All pastes #919044 Raw Edit

Untitled

public text v1 · immutable
#919044 ·published 2008-02-26 15:40 UTC
rendered paste body
g++ -DPDSUF=\".pd_linux\" -Ibundled/pd -L/home/roman/lib -L/usr/local/lib -lm -L/usr/lib -ltcl8.4 -L/usr/X11R6/lib -L/opt/gnome/lib -L/usr/X11R6/lib64 -L/opt/gnome/lib64 -lX11 -lXext -lSDL -lpthread -laa -ljpeg 
-lpng -lz -lmpeg3 -lquicktime -ldl -lglib -lcv -lfftw3f -lfftw3 -lm  -Wl,-R -Wl,/usr/local/lib -L/usr/local/lib -L. -lruby -ldl -lcrypt -lm  -I/usr/local/include -I/home/roman/include -I. -xc++ -fno-operator-nam
es -fno-omit-frame-pointer -I/usr/X11R6/include -I/usr/local/lib/ruby/1.9/i686-linux -I/usr/include/tcl8.4 -I../Gem/src -falign-functions=16 -mtune=pentium -march=pentium -Wall -Wno-unused -Wunused-variable -g -
fPIC -I. -O2 -funroll-loops -shared -rdynamic \
                rubyext.c.fcs -xnone -o gridflow.pd_linux
rubyext.c.fcs:38:30: error: ../base/grid.h.fcs: No such file or directory
rubyext.c.fcs:176: error: stray ‘@’ in program
rubyext.c.fcs:181: error: stray ‘@’ in program
rubyext.c.fcs:185: error: stray ‘@’ in program
rubyext.c.fcs:466: error: stray ‘@’ in program
rubyext.c.fcs:491: error: stray ‘@’ in program
rubyext.c.fcs:530: error: stray ‘@’ in program
rubyext.c.fcs:547: error: stray ‘@’ in program
rubyext.c.fcs:556: error: stray ‘@’ in program
rubyext.c.fcs:678: error: stray ‘@’ in program
rubyext.c.fcs:683: error: stray ‘@’ in program
rubyext.c.fcs:690: error: stray ‘@’ in program
rubyext.c.fcs:690: error: stray ‘@’ in program
rubyext.c.fcs:775: error: stray ‘@’ in program
bundled/pd/g_canvas.h:64: error: ‘t_floatarg’ has not been declared
bundled/pd/g_canvas.h:64: error: ‘t_floatarg’ has not been declared
bundled/pd/g_canvas.h:65: error: ‘t_floatarg’ has not been declared
bundled/pd/g_canvas.h:69: error: ‘EXTERN_STRUCT’ does not name a type
bundled/pd/g_canvas.h:74: error: ‘EXTERN_STRUCT’ does not name a type
bundled/pd/g_canvas.h:77: error: ‘EXTERN_STRUCT’ does not name a type
bundled/pd/g_canvas.h:80: error: ‘EXTERN_STRUCT’ does not name a type
bundled/pd/g_canvas.h:83: error: ‘EXTERN_STRUCT’ does not name a type
bundled/pd/g_canvas.h:86: error: ‘EXTERN_STRUCT’ does not name a type
bundled/pd/g_canvas.h:91: error: ISO C++ forbids declaration of ‘t_gobj’ with no type
bundled/pd/g_canvas.h:91: error: expected ‘;’ before ‘*’ token
bundled/pd/g_canvas.h:103: error: ISO C++ forbids declaration of ‘t_gobj’ with no type
bundled/pd/g_canvas.h:103: error: expected ‘;’ before ‘*’ token
bundled/pd/g_canvas.h:106: error: ISO C++ forbids declaration of ‘t_binbuf’ with no type
bundled/pd/g_canvas.h:106: error: expected ‘;’ before ‘*’ token
bundled/pd/g_canvas.h:107: error: ISO C++ forbids declaration of ‘t_binbuf’ with no type
bundled/pd/g_canvas.h:107: error: expected ‘;’ before ‘*’ token
bundled/pd/g_canvas.h:116: error: ISO C++ forbids declaration of ‘t_outconnect’ with no type
bundled/pd/g_canvas.h:116: error: expected ‘;’ before ‘*’ token
bundled/pd/g_canvas.h:137: error: ISO C++ forbids declaration of ‘t_garray’ with no type
bundled/pd/g_canvas.h:137: error: expected ‘;’ before ‘*’ token
bundled/pd/g_canvas.h:156: error: ‘t_object’ does not name a type
bundled/pd/g_canvas.h:157: error: ISO C++ forbids declaration of ‘t_gobj’ with no type
bundled/pd/g_canvas.h:157: error: expected ‘;’ before ‘*’ token
bundled/pd/g_canvas.h:175: error: ISO C++ forbids declaration of ‘t_symbol’ with no type
bundled/pd/g_canvas.h:175: error: expected ‘;’ before ‘*’ token
bundled/pd/g_canvas.h:179: error: ISO C++ forbids declaration of ‘t_symbol’ with no type
bundled/pd/g_canvas.h:179: error: expected ‘;’ before ‘*’ token
bundled/pd/g_canvas.h:182: error: ISO C++ forbids declaration of ‘t_symbol’ with no type
bundled/pd/g_canvas.h:182: error: expected ‘;’ before ‘*’ token
bundled/pd/g_canvas.h:210: error: ISO C++ forbids declaration of ‘t_symbol’ with no type
bundled/pd/g_canvas.h:210: error: expected ‘;’ before ‘*’ token
bundled/pd/g_canvas.h:211: error: ISO C++ forbids declaration of ‘t_symbol’ with no type
bundled/pd/g_canvas.h:211: error: expected ‘;’ before ‘*’ token
bundled/pd/g_canvas.h:216: error: ‘t_pd’ does not name a type
bundled/pd/g_canvas.h:218: error: ISO C++ forbids declaration of ‘t_symbol’ with no type
bundled/pd/g_canvas.h:218: error: expected ‘;’ before ‘*’ token
bundled/pd/g_canvas.h:228: error: ISO C++ forbids declaration of ‘t_symbol’ with no type
bundled/pd/g_canvas.h:228: error: expected ‘;’ before ‘*’ token
bundled/pd/g_canvas.h:230: error: ‘t_gpointer’ does not name a type
bundled/pd/g_canvas.h:231: error: ISO C++ forbids declaration of ‘t_gstub’ with no type
bundled/pd/g_canvas.h:231: error: expected ‘;’ before ‘*’ token
bundled/pd/g_canvas.h:236: error: ‘t_gobj’ does not name a type
bundled/pd/g_canvas.h:237: error: ISO C++ forbids declaration of ‘t_scalar’ with no type
bundled/pd/g_canvas.h:237: error: expected ‘;’ before ‘*’ token
bundled/pd/g_canvas.h:238: error: ISO C++ forbids declaration of ‘t_glist’ with no type
bundled/pd/g_canvas.h:238: error: expected ‘;’ before ‘*’ token
bundled/pd/g_canvas.h:239: error: ISO C++ forbids declaration of ‘t_symbol’ with no type
bundled/pd/g_canvas.h:239: error: expected ‘;’ before ‘*’ token
bundled/pd/g_canvas.h:240: error: ISO C++ forbids declaration of ‘t_symbol’ with no type
bundled/pd/g_canvas.h:240: error: expected ‘;’ before ‘*’ token
bundled/pd/g_canvas.h:250: error: ISO C++ forbids declaration of ‘t_canvas’ with no type
bundled/pd/g_canvas.h:250: error: expected ‘;’ before ‘*’ token
bundled/pd/g_canvas.h:251: error: ISO C++ forbids declaration of ‘t_object’ with no type
bundled/pd/g_canvas.h:251: error: expected ‘;’ before ‘*’ token
bundled/pd/g_canvas.h:254: error: ISO C++ forbids declaration of ‘t_object’ with no type
bundled/pd/g_canvas.h:254: error: expected ‘;’ before ‘*’ token
bundled/pd/g_canvas.h:255: error: ISO C++ forbids declaration of ‘t_outlet’ with no type
bundled/pd/g_canvas.h:255: error: expected ‘;’ before ‘*’ token
bundled/pd/g_canvas.h:256: error: ISO C++ forbids declaration of ‘t_inlet’ with no type
bundled/pd/g_canvas.h:256: error: expected ‘;’ before ‘*’ token
bundled/pd/g_canvas.h:262: error: ISO C++ forbids declaration of ‘t_outconnect’ with no type
bundled/pd/g_canvas.h:262: error: expected ‘;’ before ‘*’ token
bundled/pd/g_canvas.h:272: error: typedef ‘t_getrectfn’ is initialized (use __typeof__ instead)
bundled/pd/g_canvas.h:272: error: ‘t_gobj’ was not declared in this scope
bundled/pd/g_canvas.h:272: error: ‘x’ was not declared in this scope
bundled/pd/g_canvas.h:272: error: expected primary-expression before ‘struct’
bundled/pd/g_canvas.h:273: error: expected primary-expression before ‘int’
bundled/pd/g_canvas.h:273: error: expected primary-expression before ‘int’
bundled/pd/g_canvas.h:273: error: expected primary-expression before ‘int’
bundled/pd/g_canvas.h:273: error: expected primary-expression before ‘int’
bundled/pd/g_canvas.h:275: error: typedef ‘t_displacefn’ is initialized (use __typeof__ instead)
bundled/pd/g_canvas.h:275: error: ‘t_gobj’ was not declared in this scope
bundled/pd/g_canvas.h:275: error: ‘x’ was not declared in this scope
bundled/pd/g_canvas.h:275: error: expected primary-expression before ‘struct’
bundled/pd/g_canvas.h:275: error: expected primary-expression before ‘int’
bundled/pd/g_canvas.h:275: error: expected primary-expression before ‘int’
bundled/pd/g_canvas.h:277: error: typedef ‘t_selectfn’ is initialized (use __typeof__ instead)
bundled/pd/g_canvas.h:277: error: ‘t_gobj’ was not declared in this scope
bundled/pd/g_canvas.h:277: error: ‘x’ was not declared in this scope
bundled/pd/g_canvas.h:277: error: expected primary-expression before ‘struct’
bundled/pd/g_canvas.h:277: error: expected primary-expression before ‘int’
bundled/pd/g_canvas.h:279: error: typedef ‘t_activatefn’ is initialized (use __typeof__ instead)
bundled/pd/g_canvas.h:279: error: ‘t_gobj’ was not declared in this scope
bundled/pd/g_canvas.h:279: error: ‘x’ was not declared in this scope
bundled/pd/g_canvas.h:279: error: expected primary-expression before ‘struct’
bundled/pd/g_canvas.h:279: error: expected primary-expression before ‘int’
bundled/pd/g_canvas.h:281: error: typedef ‘t_deletefn’ is initialized (use __typeof__ instead)
bundled/pd/g_canvas.h:281: error: ‘t_gobj’ was not declared in this scope
bundled/pd/g_canvas.h:281: error: ‘x’ was not declared in this scope
bundled/pd/g_canvas.h:281: error: expected primary-expression before ‘struct’
bundled/pd/g_canvas.h:283: error: typedef ‘t_visfn’ is initialized (use __typeof__ instead)
bundled/pd/g_canvas.h:283: error: ‘t_gobj’ was not declared in this scope
bundled/pd/g_canvas.h:283: error: ‘x’ was not declared in this scope
bundled/pd/g_canvas.h:283: error: expected primary-expression before ‘struct’
bundled/pd/g_canvas.h:283: error: expected primary-expression before ‘int’
bundled/pd/g_canvas.h:285: error: typedef ‘t_clickfn’ is initialized (use __typeof__ instead)
bundled/pd/g_canvas.h:285: error: ‘t_gobj’ was not declared in this scope
bundled/pd/g_canvas.h:285: error: ‘x’ was not declared in this scope
bundled/pd/g_canvas.h:285: error: expected primary-expression before ‘struct’
bundled/pd/g_canvas.h:286: error: expected primary-expression before ‘int’
bundled/pd/g_canvas.h:286: error: expected primary-expression before ‘int’
bundled/pd/g_canvas.h:286: error: expected primary-expression before ‘int’
bundled/pd/g_canvas.h:286: error: expected primary-expression before ‘int’
bundled/pd/g_canvas.h:286: error: expected primary-expression before ‘int’
bundled/pd/g_canvas.h:286: error: expected primary-expression before ‘int’
bundled/pd/g_canvas.h:310: error: typedef ‘t_parentgetrectfn’ is initialized (use __typeof__ instead)
bundled/pd/g_canvas.h:310: error: ‘t_gobj’ was not declared in this scope
bundled/pd/g_canvas.h:310: error: ‘x’ was not declared in this scope
bundled/pd/g_canvas.h:310: error: expected primary-expression before ‘struct’
bundled/pd/g_canvas.h:311: error: ‘t_word’ was not declared in this scope
bundled/pd/g_canvas.h:311: error: ‘data’ was not declared in this scope
bundled/pd/g_canvas.h:311: error: expected primary-expression before ‘*’ token
bundled/pd/g_canvas.h:311: error: ‘tmpl’ was not declared in this scope
bundled/pd/g_canvas.h:311: error: expected primary-expression before ‘float’
bundled/pd/g_canvas.h:311: error: expected primary-expression before ‘float’
bundled/pd/g_canvas.h:312: error: expected primary-expression before ‘int’
bundled/pd/g_canvas.h:312: error: expected primary-expression before ‘int’
bundled/pd/g_canvas.h:312: error: expected primary-expression before ‘int’
bundled/pd/g_canvas.h:312: error: expected primary-expression before ‘int’
bundled/pd/g_canvas.h:314: error: typedef ‘t_parentdisplacefn’ is initialized (use __typeof__ instead)
bundled/pd/g_canvas.h:314: error: ‘t_gobj’ was not declared in this scope
bundled/pd/g_canvas.h:314: error: ‘x’ was not declared in this scope
bundled/pd/g_canvas.h:314: error: expected primary-expression before ‘struct’
bundled/pd/g_canvas.h:315: error: ‘t_word’ was not declared in this scope
bundled/pd/g_canvas.h:315: error: ‘data’ was not declared in this scope
bundled/pd/g_canvas.h:315: error: expected primary-expression before ‘*’ token
bundled/pd/g_canvas.h:315: error: ‘tmpl’ was not declared in this scope
bundled/pd/g_canvas.h:315: error: expected primary-expression before ‘float’
bundled/pd/g_canvas.h:315: error: expected primary-expression before ‘float’
bundled/pd/g_canvas.h:316: error: expected primary-expression before ‘int’
bundled/pd/g_canvas.h:316: error: expected primary-expression before ‘int’
bundled/pd/g_canvas.h:318: error: typedef ‘t_parentselectfn’ is initialized (use __typeof__ instead)
bundled/pd/g_canvas.h:318: error: ‘t_gobj’ was not declared in this scope
bundled/pd/g_canvas.h:318: error: ‘x’ was not declared in this scope
bundled/pd/g_canvas.h:318: error: expected primary-expression before ‘struct’
bundled/pd/g_canvas.h:319: error: ‘t_word’ was not declared in this scope
bundled/pd/g_canvas.h:319: error: ‘data’ was not declared in this scope
bundled/pd/g_canvas.h:319: error: expected primary-expression before ‘*’ token
bundled/pd/g_canvas.h:319: error: ‘tmpl’ was not declared in this scope
bundled/pd/g_canvas.h:319: error: expected primary-expression before ‘float’
bundled/pd/g_canvas.h:319: error: expected primary-expression before ‘float’
bundled/pd/g_canvas.h:320: error: expected primary-expression before ‘int’
bundled/pd/g_canvas.h:322: error: typedef ‘t_parentactivatefn’ is initialized (use __typeof__ instead)
bundled/pd/g_canvas.h:322: error: ‘t_gobj’ was not declared in this scope
bundled/pd/g_canvas.h:322: error: ‘x’ was not declared in this scope
bundled/pd/g_canvas.h:322: error: expected primary-expression before ‘struct’
bundled/pd/g_canvas.h:323: error: ‘t_word’ was not declared in this scope
bundled/pd/g_canvas.h:323: error: ‘data’ was not declared in this scope
bundled/pd/g_canvas.h:323: error: expected primary-expression before ‘*’ token
bundled/pd/g_canvas.h:323: error: ‘tmpl’ was not declared in this scope
bundled/pd/g_canvas.h:323: error: expected primary-expression before ‘float’
bundled/pd/g_canvas.h:323: error: expected primary-expression before ‘float’
bundled/pd/g_canvas.h:324: error: expected primary-expression before ‘int’
bundled/pd/g_canvas.h:326: error: typedef ‘t_parentvisfn’ is initialized (use __typeof__ instead)
bundled/pd/g_canvas.h:326: error: ‘t_gobj’ was not declared in this scope
bundled/pd/g_canvas.h:326: error: ‘x’ was not declared in this scope
bundled/pd/g_canvas.h:326: error: expected primary-expression before ‘struct’
bundled/pd/g_canvas.h:327: error: ‘t_word’ was not declared in this scope
bundled/pd/g_canvas.h:327: error: ‘data’ was not declared in this scope
bundled/pd/g_canvas.h:327: error: expected primary-expression before ‘*’ token
bundled/pd/g_canvas.h:327: error: ‘tmpl’ was not declared in this scope
bundled/pd/g_canvas.h:327: error: expected primary-expression before ‘float’
bundled/pd/g_canvas.h:327: error: expected primary-expression before ‘float’
bundled/pd/g_canvas.h:328: error: expected primary-expression before ‘int’
bundled/pd/g_canvas.h:330: error: typedef ‘t_parentclickfn’ is initialized (use __typeof__ instead)
bundled/pd/g_canvas.h:330: error: ‘t_gobj’ was not declared in this scope
bundled/pd/g_canvas.h:330: error: ‘x’ was not declared in this scope
bundled/pd/g_canvas.h:330: error: expected primary-expression before ‘struct’
bundled/pd/g_canvas.h:331: error: ‘t_word’ was not declared in this scope
bundled/pd/g_canvas.h:331: error: ‘data’ was not declared in this scope
bundled/pd/g_canvas.h:331: error: expected primary-expression before ‘*’ token
bundled/pd/g_canvas.h:331: error: ‘tmpl’ was not declared in this scope
bundled/pd/g_canvas.h:331: error: ‘t_scalar’ was not declared in this scope
bundled/pd/g_canvas.h:331: error: ‘sc’ was not declared in this scope
bundled/pd/g_canvas.h:331: error: ‘t_array’ was not declared in this scope
bundled/pd/g_canvas.h:331: error: ‘ap’ was not declared in this scope
bundled/pd/g_canvas.h:332: error: expected primary-expression before ‘float’
bundled/pd/g_canvas.h:332: error: expected primary-expression before ‘float’
bundled/pd/g_canvas.h:333: error: expected primary-expression before ‘int’
bundled/pd/g_canvas.h:333: error: expected primary-expression before ‘int’
bundled/pd/g_canvas.h:333: error: expected primary-expression before ‘int’
bundled/pd/g_canvas.h:333: error: expected primary-expression before ‘int’
bundled/pd/g_canvas.h:333: error: expected primary-expression before ‘int’
bundled/pd/g_canvas.h:333: error: expected primary-expression before ‘int’
bundled/pd/g_canvas.h:353: error: expected constructor, destructor, or type conversion before ‘void’
bundled/pd/g_canvas.h:355: error: expected initializer before ‘*’ token
bundled/pd/g_canvas.h:356: error: expected initializer before ‘*’ token
bundled/pd/g_canvas.h:357: error: expected initializer before ‘*’ token
bundled/pd/g_canvas.h:358: error: expected initializer before ‘*’ token
bundled/pd/g_canvas.h:366: error: expected constructor, destructor, or type conversion before ‘void’
bundled/pd/g_canvas.h:368: error: expected constructor, destructor, or type conversion before ‘void’
bundled/pd/g_canvas.h:369: error: expected constructor, destructor, or type conversion before ‘void’
bundled/pd/g_canvas.h:370: error: expected constructor, destructor, or type conversion before ‘void’
bundled/pd/g_canvas.h:371: error: expected constructor, destructor, or type conversion before ‘void’
bundled/pd/g_canvas.h:372: error: expected constructor, destructor, or type conversion before ‘void’
bundled/pd/g_canvas.h:373: error: expected constructor, destructor, or type conversion before ‘int’
bundled/pd/g_canvas.h:375: error: expected constructor, destructor, or type conversion before ‘void’
bundled/pd/g_canvas.h:376: error: expected constructor, destructor, or type conversion before ‘void’
bundled/pd/g_canvas.h:377: error: expected constructor, destructor, or type conversion before ‘void’
bundled/pd/g_canvas.h:380: error: ‘EXTERN’ does not name a type
bundled/pd/g_canvas.h:381: error: expected constructor, destructor, or type conversion before ‘void’
bundled/pd/g_canvas.h:382: error: expected constructor, destructor, or type conversion before ‘void’
bundled/pd/g_canvas.h:383: error: expected constructor, destructor, or type conversion before ‘void’
bundled/pd/g_canvas.h:384: error: expected constructor, destructor, or type conversion before ‘void’
bundled/pd/g_canvas.h:386: error: expected constructor, destructor, or type conversion before ‘void’
bundled/pd/g_canvas.h:387: error: ‘EXTERN’ does not name a type
bundled/pd/g_canvas.h:388: error: expected constructor, destructor, or type conversion before ‘int’
bundled/pd/g_canvas.h:389: error: expected constructor, destructor, or type conversion before ‘void’
bundled/pd/g_canvas.h:390: error: expected constructor, destructor, or type conversion before ‘void’
bundled/pd/g_canvas.h:391: error: expected constructor, destructor, or type conversion before ‘void’
bundled/pd/g_canvas.h:392: error: expected constructor, destructor, or type conversion before ‘void’
bundled/pd/g_canvas.h:393: error: expected constructor, destructor, or type conversion before ‘void’
bundled/pd/g_canvas.h:394: error: expected constructor, destructor, or type conversion before ‘void’
bundled/pd/g_canvas.h:395: error: expected constructor, destructor, or type conversion before ‘void’
bundled/pd/g_canvas.h:397: error: expected constructor, destructor, or type conversion before ‘int’
bundled/pd/g_canvas.h:398: error: expected constructor, destructor, or type conversion before ‘int’
bundled/pd/g_canvas.h:399: error: ‘EXTERN’ does not name a type
bundled/pd/g_canvas.h:400: error: expected constructor, destructor, or type conversion before ‘int’
bundled/pd/g_canvas.h:401: error: expected constructor, destructor, or type conversion before ‘void’
bundled/pd/g_canvas.h:402: error: expected constructor, destructor, or type conversion before ‘void’
bundled/pd/g_canvas.h:403: error: expected constructor, destructor, or type conversion before ‘void’
bundled/pd/g_canvas.h:405: error: expected constructor, destructor, or type conversion before ‘float’
bundled/pd/g_canvas.h:406: error: expected constructor, destructor, or type conversion before ‘float’
bundled/pd/g_canvas.h:407: error: expected constructor, destructor, or type conversion before ‘float’
bundled/pd/g_canvas.h:408: error: expected constructor, destructor, or type conversion before ‘float’
bundled/pd/g_canvas.h:409: error: expected constructor, destructor, or type conversion before ‘float’
bundled/pd/g_canvas.h:410: error: expected constructor, destructor, or type conversion before ‘float’
bundled/pd/g_canvas.h:412: error: expected constructor, destructor, or type conversion before ‘void’
bundled/pd/g_canvas.h:413: error: expected constructor, destructor, or type conversion before ‘void’
bundled/pd/g_canvas.h:414: error: ‘EXTERN’ does not name a type
bundled/pd/g_canvas.h:417: error: expected constructor, destructor, or type conversion before ‘void’
bundled/pd/g_canvas.h:419: error: ‘EXTERN’ does not name a type
bundled/pd/g_canvas.h:420: error: expected constructor, destructor, or type conversion before ‘int’
bundled/pd/g_canvas.h:421: error: expected constructor, destructor, or type conversion before ‘void’
bundled/pd/g_canvas.h:422: error: expected constructor, destructor, or type conversion before ‘void’
bundled/pd/g_canvas.h:424: error: expected constructor, destructor, or type conversion before ‘void’
bundled/pd/g_canvas.h:425: error: expected constructor, destructor, or type conversion before ‘void’
bundled/pd/g_canvas.h:426: error: variable or field ‘canvas_deletelinesforio’ declared void
bundled/pd/g_canvas.h:426: error: ‘t_canvas’ was not declared in this scope
bundled/pd/g_canvas.h:426: error: ‘x’ was not declared in this scope
bundled/pd/g_canvas.h:426: error: ‘t_text’ was not declared in this scope
bundled/pd/g_canvas.h:426: error: ‘text’ was not declared in this scope
bundled/pd/g_canvas.h:427: error: ‘t_inlet’ was not declared in this scope
bundled/pd/g_canvas.h:427: error: ‘inp’ was not declared in this scope
bundled/pd/g_canvas.h:427: error: ‘t_outlet’ was not declared in this scope
bundled/pd/g_canvas.h:427: error: ‘outp’ was not declared in this scope
bundled/pd/g_canvas.h:427: error: initializer expression list treated as compound expression
bundled/pd/g_canvas.h:431: error: expected constructor, destructor, or type conversion before ‘void’
bundled/pd/g_canvas.h:432: error: expected constructor, destructor, or type conversion before ‘void’
bundled/pd/g_canvas.h:434: error: expected constructor, destructor, or type conversion before ‘void’
bundled/pd/g_canvas.h:435: error: expected constructor, destructor, or type conversion before ‘int’
bundled/pd/g_canvas.h:436: error: expected constructor, destructor, or type conversion before ‘int’
bundled/pd/g_canvas.h:437: error: expected constructor, destructor, or type conversion before ‘int’
bundled/pd/g_canvas.h:438: error: expected constructor, destructor, or type conversion before ‘int’
bundled/pd/g_canvas.h:439: error: expected constructor, destructor, or type conversion before ‘int’
bundled/pd/g_canvas.h:449: error: expected constructor, destructor, or type conversion before ‘struct’
bundled/pd/g_canvas.h:450: error: expected constructor, destructor, or type conversion before ‘struct’
bundled/pd/g_canvas.h:451: error: expected constructor, destructor, or type conversion before ‘void’
bundled/pd/g_canvas.h:452: error: expected constructor, destructor, or type conversion before ‘void’
bundled/pd/g_canvas.h:453: error: expected constructor, destructor, or type conversion before ‘struct’
bundled/pd/g_canvas.h:454: error: expected constructor, destructor, or type conversion before ‘int’
bundled/pd/g_canvas.h:455: error: expected constructor, destructor, or type conversion before ‘void’
bundled/pd/g_canvas.h:456: error: expected constructor, destructor, or type conversion before ‘void’
bundled/pd/g_canvas.h:457: error: expected constructor, destructor, or type conversion before ‘void’
bundled/pd/g_canvas.h:458: error: expected constructor, destructor, or type conversion before ‘void’
bundled/pd/g_canvas.h:459: error: expected constructor, destructor, or type conversion before ‘void’
bundled/pd/g_canvas.h:460: error: expected constructor, destructor, or type conversion before ‘void’
bundled/pd/g_canvas.h:461: error: expected constructor, destructor, or type conversion before ‘void’
bundled/pd/g_canvas.h:462: error: expected constructor, destructor, or type conversion before ‘int’
bundled/pd/g_canvas.h:463: error: expected constructor, destructor, or type conversion before ‘int’
bundled/pd/g_canvas.h:464: error: expected constructor, destructor, or type conversion before ‘char’
bundled/pd/g_canvas.h:465: error: expected constructor, destructor, or type conversion before ‘void’
bundled/pd/g_canvas.h:466: error: expected constructor, destructor, or type conversion before ‘void’
bundled/pd/g_canvas.h:470: error: ‘EXTERN’ does not name a type
bundled/pd/g_canvas.h:472: error: ‘EXTERN’ does not name a type
bundled/pd/g_canvas.h:473: error: ‘EXTERN’ does not name a type
bundled/pd/g_canvas.h:474: error: expected constructor, destructor, or type conversion before ‘void’
bundled/pd/g_canvas.h:475: error: expected constructor, destructor, or type conversion before ‘void’
bundled/pd/g_canvas.h:476: error: expected constructor, destructor, or type conversion before ‘void’
bundled/pd/g_canvas.h:477: error: expected constructor, destructor, or type conversion before ‘void’
bundled/pd/g_canvas.h:478: error: expected constructor, destructor, or type conversion before ‘void’
bundled/pd/g_canvas.h:479: error: expected constructor, destructor, or type conversion before ‘void’
bundled/pd/g_canvas.h:481: error: ‘EXTERN’ does not name a type
bundled/pd/g_canvas.h:482: error: expected constructor, destructor, or type conversion before ‘void’
bundled/pd/g_canvas.h:483: error: ‘EXTERN’ does not name a type
bundled/pd/g_canvas.h:484: error: expected constructor, destructor, or type conversion before ‘void’
bundled/pd/g_canvas.h:485: error: expected constructor, destructor, or type conversion before ‘void’
bundled/pd/g_canvas.h:486: error: expected constructor, destructor, or type conversion before ‘void’
bundled/pd/g_canvas.h:487: error: expected constructor, destructor, or type conversion before ‘void’
bundled/pd/g_canvas.h:488: error: expected constructor, destructor, or type conversion before ‘void’
bundled/pd/g_canvas.h:489: error: ‘EXTERN’ does not name a type
bundled/pd/g_canvas.h:490: error: expected constructor, destructor, or type conversion before ‘void’
bundled/pd/g_canvas.h:491: error: expected constructor, destructor, or type conversion before ‘void’
bundled/pd/g_canvas.h:492: error: ‘EXTERN’ does not name a type
bundled/pd/g_canvas.h:493: error: ‘EXTERN’ does not name a type
bundled/pd/g_canvas.h:494: error: expected constructor, destructor, or type conversion before ‘void’
bundled/pd/g_canvas.h:495: error: expected constructor, destructor, or type conversion before ‘int’
bundled/pd/g_canvas.h:496: error: typedef ‘t_canvasapply’ is initialized (use __typeof__ instead)
bundled/pd/g_canvas.h:496: error: ‘t_canvas’ was not declared in this scope
bundled/pd/g_canvas.h:496: error: ‘x’ was not declared in this scope
bundled/pd/g_canvas.h:496: error: ‘t_int’ was not declared in this scope
bundled/pd/g_canvas.h:496: error: ‘t_int’ was not declared in this scope
bundled/pd/g_canvas.h:496: error: ‘t_int’ was not declared in this scope
bundled/pd/g_canvas.h:498: error: ‘EXTERN’ does not name a type
bundled/pd/g_canvas.h:501: error: expected constructor, destructor, or type conversion before ‘void’
bundled/pd/g_canvas.h:502: error: expected constructor, destructor, or type conversion before ‘void’
bundled/pd/g_canvas.h:503: error: expected constructor, destructor, or type conversion before ‘void’
bundled/pd/g_canvas.h:504: error: expected constructor, destructor, or type conversion before ‘void’
bundled/pd/g_canvas.h:505: error: expected constructor, destructor, or type conversion before ‘void’
bundled/pd/g_canvas.h:506: error: expected constructor, destructor, or type conversion before ‘int’
bundled/pd/g_canvas.h:507: error: expected constructor, destructor, or type conversion before ‘int’
bundled/pd/g_canvas.h:508: error: expected constructor, destructor, or type conversion before ‘int’
bundled/pd/g_canvas.h:509: error: expected constructor, destructor, or type conversion before ‘void’
bundled/pd/g_canvas.h:510: error: expected constructor, destructor, or type conversion before ‘struct’
bundled/pd/g_canvas.h:511: error: expected constructor, destructor, or type conversion before ‘void’
bundled/pd/g_canvas.h:512: error: expected constructor, destructor, or type conversion before ‘void’
bundled/pd/g_canvas.h:513: error: expected constructor, destructor, or type conversion before ‘int’
bundled/pd/g_canvas.h:515: error: expected constructor, destructor, or type conversion before ‘int’
bundled/pd/g_canvas.h:517: error: typedef ‘t_undofn’ is initialized (use __typeof__ instead)
bundled/pd/g_canvas.h:517: error: ‘t_canvas’ was not declared in this scope
bundled/pd/g_canvas.h:517: error: ‘canvas’ was not declared in this scope
bundled/pd/g_canvas.h:517: error: expected primary-expression before ‘void’
bundled/pd/g_canvas.h:518: error: expected primary-expression before ‘int’
bundled/pd/g_canvas.h:522: error: expected constructor, destructor, or type conversion before ‘void’
bundled/pd/g_canvas.h:524: error: expected constructor, destructor, or type conversion before ‘void’
bundled/pd/g_canvas.h:525: error: expected constructor, destructor, or type conversion before ‘int’
bundled/pd/g_canvas.h:527: error: expected constructor, destructor, or type conversion before ‘void’
bundled/pd/g_canvas.h:529: error: expected constructor, destructor, or type conversion before ‘void’
bundled/pd/g_canvas.h:531: error: expected constructor, destructor, or type conversion before ‘int’
bundled/pd/g_canvas.h:533: error: expected constructor, destructor, or type conversion before ‘void’
bundled/pd/g_canvas.h:538: error: expected constructor, destructor, or type conversion before ‘void’
bundled/pd/g_canvas.h:540: error: expected constructor, destructor, or type conversion before ‘void’
bundled/pd/g_canvas.h:541: error: expected constructor, destructor, or type conversion before ‘int’
bundled/pd/g_canvas.h:543: error: ‘EXTERN’ does not name a type
bundled/pd/g_canvas.h:545: error: expected constructor, destructor, or type conversion before ‘void’
bundled/pd/g_canvas.h:546: error: ‘EXTERN’ does not name a type
bundled/pd/g_canvas.h:547: error: expected constructor, destructor, or type conversion before ‘void’
bundled/pd/g_canvas.h:551: error: ‘EXTERN’ does not name a type
bundled/pd/g_canvas.h:554: error: ‘EXTERN’ does not name a type
bundled/pd/g_canvas.h:556: error: ‘EXTERN’ does not name a type
bundled/pd/g_canvas.h:557: error: expected constructor, destructor, or type conversion before ‘void’
bundled/pd/g_canvas.h:558: error: expected constructor, destructor, or type conversion before ‘void’
bundled/pd/g_canvas.h:561: error: ‘EXTERN’ does not name a type
bundled/pd/g_canvas.h:562: error: expected constructor, destructor, or type conversion before ‘void’
bundled/pd/g_canvas.h:563: error: expected constructor, destructor, or type conversion before ‘void’
bundled/pd/g_canvas.h:566: error: expected constructor, destructor, or type conversion before ‘void’
bundled/pd/g_canvas.h:567: error: expected constructor, destructor, or type conversion before ‘void’
bundled/pd/g_canvas.h:569: error: ‘EXTERN’ does not name a type
bundled/pd/g_canvas.h:571: error: expected constructor, destructor, or type conversion before ‘void’
bundled/pd/g_canvas.h:572: error: expected constructor, destructor, or type conversion before ‘void’
bundled/pd/g_canvas.h:573: error: expected constructor, destructor, or type conversion before ‘void’
bundled/pd/g_canvas.h:576: error: expected constructor, destructor, or type conversion before ‘int’
bundled/pd/g_canvas.h:582: error: expected constructor, destructor, or type conversion before ‘void’
bundled/pd/g_canvas.h:588: error: expected constructor, destructor, or type conversion before ‘int’
bundled/pd/g_canvas.h:595: error: ‘EXTERN’ does not name a type
bundled/pd/g_canvas.h:596: error: expected constructor, destructor, or type conversion before ‘void’
bundled/pd/g_canvas.h:597: error: expected constructor, destructor, or type conversion before ‘int’
bundled/pd/g_canvas.h:598: error: expected constructor, destructor, or type conversion before ‘int’
bundled/pd/g_canvas.h:600: error: ‘EXTERN’ does not name a type
bundled/pd/g_canvas.h:602: error: expected constructor, destructor, or type conversion before ‘void’
bundled/pd/g_canvas.h:604: error: ‘EXTERN’ does not name a type
bundled/pd/g_canvas.h:606: error: expected constructor, destructor, or type conversion before ‘void’
bundled/pd/g_canvas.h:609: error: ‘EXTERN’ does not name a type
bundled/pd/g_canvas.h:610: error: ‘EXTERN’ does not name a type
bundled/pd/g_canvas.h:611: error: ‘EXTERN’ does not name a type
bundled/pd/g_canvas.h:612: error: expected constructor, destructor, or type conversion before ‘void’
bundled/pd/g_canvas.h:615: error: ‘EXTERN’ does not name a type
bundled/pd/g_canvas.h:617: error: expected constructor, destructor, or type conversion before ‘void’
bundled/pd/g_canvas.h:619: error: ‘EXTERN’ does not name a type
bundled/pd/g_canvas.h:621: error: expected constructor, destructor, or type conversion before ‘void’
bundled/pd/g_canvas.h:623: error: ‘EXTERN’ does not name a type
bundled/pd/g_canvas.h:625: error: expected constructor, destructor, or type conversion before ‘void’
bundled/pd/g_canvas.h:627: error: ‘EXTERN’ does not name a type
bundled/pd/g_canvas.h:628: error: expected constructor, destructor, or type conversion before ‘float’
bundled/pd/g_canvas.h:632: error: expected constructor, destructor, or type conversion before ‘struct’
bundled/pd/g_canvas.h:633: error: expected constructor, destructor, or type conversion before ‘void’
bundled/pd/g_canvas.h:636: error: ‘EXTERN’ does not name a type
bundled/pd/g_canvas.h:637: error: ‘EXTERN’ does not name a type
rubyext.c.fcs:85: error: ISO C++ forbids declaration of ‘t_symbol’ with no type
rubyext.c.fcs:85: error: expected ‘;’ before ‘*’ token
rubyext.c.fcs:87: error: ISO C++ forbids declaration of ‘t_atom’ with no type
rubyext.c.fcs:87: error: expected ‘;’ before ‘*’ token
rubyext.c.fcs:94: error: ‘Ruby’ was not declared in this scope
rubyext.c.fcs:94: error: expected ‘,’ or ‘;’ before ‘{’ token
rubyext.c.fcs:96: error: expected initializer before ‘*’ token
rubyext.c.fcs: In function ‘void CObject_freeee(void*)’:
rubyext.c.fcs:99: error: ‘CObject’ was not declared in this scope
rubyext.c.fcs:99: error: ‘self’ was not declared in this scope
rubyext.c.fcs:99: error: expected primary-expression before ‘)’ token
rubyext.c.fcs:99: error: expected `;' before ‘victim’
rubyext.c.fcs:101: error: ‘_L_’ was not declared in this scope
rubyext.c.fcs:101: error: expected `;' before ‘fprintf’
rubyext.c.fcs:102: error: ‘abort’ was not declared in this scope
rubyext.c.fcs:105: error: type ‘<type error>’ argument given to ‘delete’, expected pointer
rubyext.c.fcs: At global scope:
rubyext.c.fcs:110: error: ‘Ruby’ does not name a type
rubyext.c.fcs:111: error: ‘Ruby’ does not name a type
rubyext.c.fcs:114: error: expected class-name before ‘{’ token
rubyext.c.fcs:118: error: ‘Ruby’ does not name a type
rubyext.c.fcs:118: error: ‘Ruby’ does not name a type
rubyext.c.fcs: In constructor ‘Pointer::Pointer()’:
rubyext.c.fcs:116: error: ‘RAISE’ was not declared in this scope
rubyext.c.fcs: At global scope:
rubyext.c.fcs:120: error: ‘Ruby’ does not name a type
rubyext.c.fcs:120: error: ‘Ruby’ does not name a type
rubyext.c.fcs:121: error: variable or field ‘Pointer_startup’ declared void
rubyext.c.fcs:121: error: ‘Ruby’ was not declared in this scope
rubyext.c.fcs:121: error: ‘MethodDecl’ does not name a type
rubyext.c.fcs:121: error: ‘FClass’ does not name a type
rubyext.c.fcs:121: error: variable or field ‘Pointer_startup’ declared void
rubyext.c.fcs:121: error: redefinition of ‘int Pointer_startup’
rubyext.c.fcs:121: error: ‘int Pointer_startup’ previously defined here
rubyext.c.fcs:121: error: ‘Ruby’ was not declared in this scope
rubyext.c.fcs:128: error: ‘Ruby’ does not name a type
rubyext.c.fcs:132: error: ‘Ruby’ was not declared in this scope
rubyext.c.fcs:132: error: expected ‘,’ or ‘;’ before ‘{’ token
rubyext.c.fcs:137: error: ‘Ruby’ does not name a type
rubyext.c.fcs:150: error: ‘Ruby’ was not declared in this scope
rubyext.c.fcs:150: error: expected ‘,’ or ‘;’ before ‘{’ token
rubyext.c.fcs:156: error: ‘Ruby’ was not declared in this scope
rubyext.c.fcs:156: error: expected ‘,’ or ‘;’ before ‘{’ token
rubyext.c.fcs:165: error: expected class-name before ‘{’ token
rubyext.c.fcs:167: error: ISO C++ forbids declaration of ‘t_inlet’ with no type
rubyext.c.fcs:167: error: expected ‘;’ before ‘*’ token
rubyext.c.fcs:171: error: expected initializer before ‘*’ token
rubyext.c.fcs:188: error: expected initializer before ‘*’ token
rubyext.c.fcs:190: error: variable or field ‘Bridge_export_value’ declared void
rubyext.c.fcs:190: error: ‘Ruby’ was not declared in this scope
rubyext.c.fcs:190: error: ‘t_atom’ was not declared in this scope
rubyext.c.fcs:190: error: ‘at’ was not declared in this scope
rubyext.c.fcs:190: error: initializer expression list treated as compound expression
rubyext.c.fcs:190: error: expected ‘,’ or ‘;’ before ‘{’ token
rubyext.c.fcs:199: error: ‘Ruby’ does not name a type
rubyext.c.fcs:207: error: ‘Ruby’ does not name a type
rubyext.c.fcs:216: error: ‘Ruby’ does not name a type
rubyext.c.fcs:227: error: ‘t_symbol’ has not been declared
rubyext.c.fcs:227: error: ‘t_atom’ has not been declared
rubyext.c.fcs: In function ‘void BFObject_method_missing(BFObject*, int, int*, int, int*)’:
rubyext.c.fcs:228: error: too many initializers for ‘FMessage’
rubyext.c.fcs:228: error: invalid conversion from ‘int*’ to ‘int’
rubyext.c.fcs:229: error: invalid use of undefined type ‘struct BFObject’
rubyext.c.fcs:80: error: forward declaration of ‘struct BFObject’
rubyext.c.fcs:230: error: ‘pd_error’ was not declared in this scope
rubyext.c.fcs:233: error: ‘RMethod’ was not declared in this scope
rubyext.c.fcs:233: error: ‘BFObject_method_missing_1’ was not declared in this scope
rubyext.c.fcs:233: error: ‘Ruby’ was not declared in this scope
rubyext.c.fcs:233: error: ‘BFObject_rescue’ was not declared in this scope
rubyext.c.fcs:233: error: ‘rb_eException’ was not declared in this scope
rubyext.c.fcs:233: error: ‘rb_rescue2’ was not declared in this scope
rubyext.c.fcs: At global scope:
rubyext.c.fcs:237: error: ‘t_symbol’ has not been declared
rubyext.c.fcs:237: error: ‘t_atom’ has not been declared
rubyext.c.fcs:242: error: ‘t_symbol’ has not been declared
rubyext.c.fcs:242: error: ‘t_atom’ has not been declared
rubyext.c.fcs:246: error: ‘Ruby’ does not name a type
rubyext.c.fcs:298: error: ‘t_symbol’ was not declared in this scope
rubyext.c.fcs:298: error: ‘classsym’ was not declared in this scope
rubyext.c.fcs:298: error: expected primary-expression before ‘int’
rubyext.c.fcs:298: error: ‘t_atom’ was not declared in this scope
rubyext.c.fcs:298: error: ‘at’ was not declared in this scope
rubyext.c.fcs:298: error: initializer expression list treated as compound expression
rubyext.c.fcs:298: error: expected ‘,’ or ‘;’ before ‘{’ token
rubyext.c.fcs: In function ‘void BFObject_delete_1(FMessage*)’:
rubyext.c.fcs:309: error: invalid use of undefined type ‘struct BFObject’
rubyext.c.fcs:80: error: forward declaration of ‘struct BFObject’
rubyext.c.fcs:310: error: invalid use of undefined type ‘struct BFObject’
rubyext.c.fcs:80: error: forward declaration of ‘struct BFObject’
rubyext.c.fcs:310: error: expected primary-expression before ‘)’ token
rubyext.c.fcs:310: error: ‘SI’ was not declared in this scope
rubyext.c.fcs:310: error: ‘rb_funcall’ was not declared in this scope
rubyext.c.fcs:312: error: ‘post’ was not declared in this scope
rubyext.c.fcs: In function ‘void BFObject_delete(BFObject*)’:
rubyext.c.fcs:317: error: ‘gensym’ was not declared in this scope
rubyext.c.fcs:318: error: ‘FMessage’ has no non-static data member named ‘selector’
rubyext.c.fcs:318: error: too many initializers for ‘FMessage’
rubyext.c.fcs:319: error: ‘RMethod’ was not declared in this scope
rubyext.c.fcs:319: error: ‘Ruby’ was not declared in this scope
rubyext.c.fcs:319: error: ‘BFObject_rescue’ was not declared in this scope
rubyext.c.fcs:319: error: ‘rb_eException’ was not declared in this scope
rubyext.c.fcs:319: error: ‘rb_rescue2’ was not declared in this scope
rubyext.c.fcs: At global scope:
rubyext.c.fcs:325: error: ‘VALUE’ does not name a type
rubyext.c.fcs:326: error: ‘ID’ does not name a type
rubyext.c.fcs:328: error: ISO C++ forbids declaration of ‘VALUE’ with no type
rubyext.c.fcs:328: error: expected ‘;’ before ‘*’ token
rubyext.c.fcs:334: error: ‘VALUE’ does not name a type
rubyext.c.fcs:338: error: ‘Ruby’ does not name a type
rubyext.c.fcs:346: error: ‘VALUE’ does not name a type
rubyext.c.fcs:359: error: variable or field ‘bf_getrectfn’ declared void
rubyext.c.fcs:359: error: ‘t_gobj’ was not declared in this scope
rubyext.c.fcs:359: error: ‘x’ was not declared in this scope
rubyext.c.fcs:359: error: ‘t_glist’ was not declared in this scope
rubyext.c.fcs:359: error: ‘glist’ was not declared in this scope
rubyext.c.fcs:360: error: expected primary-expression before ‘int’
rubyext.c.fcs:360: error: expected primary-expression before ‘int’
rubyext.c.fcs:360: error: expected primary-expression before ‘int’
rubyext.c.fcs:360: error: expected primary-expression before ‘int’
rubyext.c.fcs:360: error: initializer expression list treated as compound expression
rubyext.c.fcs:360: error: expected ‘,’ or ‘;’ before ‘{’ token
rubyext.c.fcs:377: error: variable or field ‘bf_displacefn’ declared void
rubyext.c.fcs:377: error: ‘t_gobj’ was not declared in this scope
rubyext.c.fcs:377: error: ‘x’ was not declared in this scope
rubyext.c.fcs:377: error: ‘t_glist’ was not declared in this scope
rubyext.c.fcs:377: error: ‘glist’ was not declared in this scope
rubyext.c.fcs:377: error: expected primary-expression before ‘int’
rubyext.c.fcs:377: error: expected primary-expression before ‘int’
rubyext.c.fcs:377: error: initializer expression list treated as compound expression
rubyext.c.fcs:377: error: expected ‘,’ or ‘;’ before ‘{’ token
rubyext.c.fcs:387: error: variable or field ‘bf_selectfn’ declared void
rubyext.c.fcs:387: error: ‘t_gobj’ was not declared in this scope
rubyext.c.fcs:387: error: ‘x’ was not declared in this scope
rubyext.c.fcs:387: error: ‘t_glist’ was not declared in this scope
rubyext.c.fcs:387: error: ‘glist’ was not declared in this scope
rubyext.c.fcs:387: error: expected primary-expression before ‘int’
rubyext.c.fcs:387: error: initializer expression list treated as compound expression
rubyext.c.fcs:387: error: expected ‘,’ or ‘;’ before ‘{’ token
rubyext.c.fcs:393: error: variable or field ‘bf_activatefn’ declared void
rubyext.c.fcs:393: error: ‘t_gobj’ was not declared in this scope
rubyext.c.fcs:393: error: ‘x’ was not declared in this scope
rubyext.c.fcs:393: error: ‘t_glist’ was not declared in this scope
rubyext.c.fcs:393: error: ‘glist’ was not declared in this scope
rubyext.c.fcs:393: error: expected primary-expression before ‘int’
rubyext.c.fcs:393: error: initializer expression list treated as compound expression
rubyext.c.fcs:393: error: expected ‘,’ or ‘;’ before ‘{’ token
rubyext.c.fcs:399: error: variable or field ‘bf_deletefn’ declared void
rubyext.c.fcs:399: error: ‘t_gobj’ was not declared in this scope
rubyext.c.fcs:399: error: ‘x’ was not declared in this scope
rubyext.c.fcs:399: error: ‘t_glist’ was not declared in this scope
rubyext.c.fcs:399: error: ‘glist’ was not declared in this scope
rubyext.c.fcs:399: error: initializer expression list treated as compound expression
rubyext.c.fcs:399: error: expected ‘,’ or ‘;’ before ‘{’ token
rubyext.c.fcs:406: error: variable or field ‘bf_visfn’ declared void
rubyext.c.fcs:406: error: ‘t_gobj’ was not declared in this scope
rubyext.c.fcs:406: error: ‘x’ was not declared in this scope
rubyext.c.fcs:406: error: ‘t_glist’ was not declared in this scope
rubyext.c.fcs:406: error: ‘glist’ was not declared in this scope
rubyext.c.fcs:406: error: expected primary-expression before ‘int’
rubyext.c.fcs:406: error: initializer expression list treated as compound expression
rubyext.c.fcs:406: error: expected ‘,’ or ‘;’ before ‘{’ token
rubyext.c.fcs:414: error: ‘t_gobj’ was not declared in this scope
rubyext.c.fcs:414: error: ‘x’ was not declared in this scope
rubyext.c.fcs:414: error: ‘t_glist’ was not declared in this scope
rubyext.c.fcs:414: error: ‘glist’ was not declared in this scope
rubyext.c.fcs:415: error: expected primary-expression before ‘int’
rubyext.c.fcs:415: error: expected primary-expression before ‘int’
rubyext.c.fcs:415: error: expected primary-expression before ‘int’
rubyext.c.fcs:415: error: expected primary-expression before ‘int’
rubyext.c.fcs:415: error: expected primary-expression before ‘int’
rubyext.c.fcs:415: error: expected primary-expression before ‘int’
rubyext.c.fcs:415: error: initializer expression list treated as compound expression
rubyext.c.fcs:415: error: expected ‘,’ or ‘;’ before ‘{’ token
rubyext.c.fcs:427: error: ‘t_floatarg’ has not been declared
rubyext.c.fcs: In function ‘void bf_keyfn(void*, int)’:
rubyext.c.fcs:428: error: invalid use of undefined type ‘struct BFObject’
rubyext.c.fcs:80: error: forward declaration of ‘struct BFObject’
rubyext.c.fcs:428: error: ‘pd_key’ was not declared in this scope
rubyext.c.fcs:428: error: ‘SI’ was not declared in this scope
rubyext.c.fcs:428: error: ‘INT2NUM’ was not declared in this scope
rubyext.c.fcs:428: error: ‘rb_funcall_myrescue’ was not declared in this scope
rubyext.c.fcs: At global scope:
rubyext.c.fcs:432: error: ‘t_floatarg’ has not been declared
rubyext.c.fcs:432: error: ‘t_floatarg’ has not been declared
rubyext.c.fcs: In function ‘void bf_motionfn(void*, int, int)’:
rubyext.c.fcs:433: error: invalid use of undefined type ‘struct BFObject’
rubyext.c.fcs:80: error: forward declaration of ‘struct BFObject’
rubyext.c.fcs:433: error: ‘pd_motion’ was not declared in this scope
rubyext.c.fcs:433: error: ‘SI’ was not declared in this scope
rubyext.c.fcs:434: error: ‘INT2NUM’ was not declared in this scope
rubyext.c.fcs:434: error: ‘rb_funcall_myrescue’ was not declared in this scope
rubyext.c.fcs: At global scope:
rubyext.c.fcs:438: error: variable or field ‘bf_propertiesfn’ declared void
rubyext.c.fcs:438: error: ‘t_gobj’ was not declared in this scope
rubyext.c.fcs:438: error: ‘x’ was not declared in this scope
rubyext.c.fcs:438: error: expected primary-expression before ‘struct’
rubyext.c.fcs:438: error: initializer expression list treated as compound expression
rubyext.c.fcs:438: error: expected ‘,’ or ‘;’ before ‘{’ token
rubyext.c.fcs:446: error: variable or field ‘bf_savefn’ declared void
rubyext.c.fcs:446: error: ‘t_gobj’ was not declared in this scope
rubyext.c.fcs:446: error: ‘x’ was not declared in this scope
rubyext.c.fcs:446: error: ‘t_binbuf’ was not declared in this scope
rubyext.c.fcs:446: error: ‘b’ was not declared in this scope
rubyext.c.fcs:446: error: initializer expression list treated as compound expression
rubyext.c.fcs:446: error: expected ‘,’ or ‘;’ before ‘{’ token
rubyext.c.fcs:452: error: variable or field ‘BFObject_class_init_1’ declared void
rubyext.c.fcs:452: error: ‘t_class’ was not declared in this scope
rubyext.c.fcs:452: error: ‘qlass’ was not declared in this scope
rubyext.c.fcs:452: error: expected ‘,’ or ‘;’ before ‘{’ token
rubyext.c.fcs:460: error: ‘Ruby’ does not name a type
rubyext.c.fcs:472: error: ‘Ruby’ does not name a type
rubyext.c.fcs:489: error: ‘Ruby’ does not name a type
rubyext.c.fcs:498: error: ‘Ruby’ does not name a type
rubyext.c.fcs:505: error: ‘Ruby’ does not name a type
rubyext.c.fcs:529: error: ‘Ruby’ does not name a type
rubyext.c.fcs:546: error: ‘Ruby’ does not name a type
rubyext.c.fcs:555: error: ‘Ruby’ does not name a type
rubyext.c.fcs:563: error: ‘Ruby’ does not name a type
rubyext.c.fcs:574: error: ‘Ruby’ does not name a type
rubyext.c.fcs:584: error: ISO C++ forbids declaration of ‘t_symbol’ with no type
rubyext.c.fcs:584: error: expected ‘;’ before ‘*’ token
rubyext.c.fcs:586: error: ISO C++ forbids declaration of ‘t_atom’ with no type
rubyext.c.fcs:586: error: expected ‘;’ before ‘*’ token
rubyext.c.fcs:590: error: ‘Ruby’ does not name a type
rubyext.c.fcs: In function ‘void BFObject_undrawio(BFObject*)’:
rubyext.c.fcs:602: error: invalid use of undefined type ‘struct BFObject’
rubyext.c.fcs:80: error: forward declaration of ‘struct BFObject’
rubyext.c.fcs:602: error: invalid use of undefined type ‘struct BFObject’
rubyext.c.fcs:80: error: forward declaration of ‘struct BFObject’
rubyext.c.fcs:602: error: ‘glist_isvisible’ was not declared in this scope
rubyext.c.fcs:603: error: invalid use of undefined type ‘struct BFObject’
rubyext.c.fcs:80: error: forward declaration of ‘struct BFObject’
rubyext.c.fcs:603: error: ‘glist_findrtext’ was not declared in this scope
rubyext.c.fcs:605: error: invalid use of undefined type ‘struct BFObject’
rubyext.c.fcs:80: error: forward declaration of ‘struct BFObject’
rubyext.c.fcs:605: error: ‘rtext_gettag’ was not declared in this scope
rubyext.c.fcs:605: error: ‘glist_eraseiofor’ was not declared in this scope
rubyext.c.fcs: In function ‘void BFObject_redraw(BFObject*)’:
rubyext.c.fcs:611: error: invalid use of undefined type ‘struct BFObject’
rubyext.c.fcs:80: error: forward declaration of ‘struct BFObject’
rubyext.c.fcs:611: error: invalid use of undefined type ‘struct BFObject’
rubyext.c.fcs:80: error: forward declaration of ‘struct BFObject’
rubyext.c.fcs:611: error: ‘glist_isvisible’ was not declared in this scope
rubyext.c.fcs:612: error: invalid use of undefined type ‘struct BFObject’
rubyext.c.fcs:80: error: forward declaration of ‘struct BFObject’
rubyexrubyext.c.fcs:614: error: ‘t_gobj’ was not declared in this scope
rubyext.c.fcs:614: error: expected primary-expression before ‘)’ token
rubyext.c.fcs:614: error: invalid use of undefined type ‘struct BFObject’
rubyext.c.fcs:80: error: forward declaration of ‘struct BFObject’
rubyext.c.fcs:614: error: ‘gobj_vis’ was not declared in this scope
rubyext.c.fcs:615: error: expected primary-expression before ‘)’ token
rubyext.c.fcs:615: error: invalid use of undefined type ‘struct BFObject’
rubyext.c.fcs:80: error: forward declaration of ‘struct BFObject’
rubyext.c.fcs:616: error: invalid use of undefined type ‘struct BFObject’
rubyext.c.fcs:80: error: forward declaration of ‘struct BFObject’
rubyext.c.fcs:616: error: ‘t_text’ was not declared in this scope
rubyext.c.fcs:616: error: expected primary-expression before ‘)’ token
rubyext.c.fcs:616: error: ‘canvas_fixlinesfor’ was not declared in this scope
rubyext.c.fcs: At global scope:
rubyext.c.fcs:621: error: invalid use of undefined type ‘struct BFObject’
rubyext.c.fcs:80: error: forward declaration of ‘struct BFObject’
rubyext.c.fcs: In member function ‘void BFObject::ninlets_set(int)’:
rubyext.c.fcs:623: error: ‘RAISE’ was not declared in this scope
rubyext.c.fcs:624: error: ‘Ruby’ was not declared in this scope
rubyext.c.fcs:624: error: expected `)' before ‘this’
rubyext.c.fcs:624: error: ‘RAISE’ was not declared in this scope
rubyext.c.fcs:625: error: ‘RAISE’ was not declared in this scope
rubyext.c.fcs:627: error: ‘nin’ was not declared in this scope
rubyext.c.fcs:629: error: ‘in’ was not declared in this scope
rubyext.c.fcs:629: error: ‘memcpy’ was not declared in this scope
rubyext.c.fcs:630: error: type ‘<type error>’ argument given to ‘delete’, expected pointer
rubyext.c.fcs:633: error: ‘BFProxy_class’ was not declared in this scope
rubyext.c.fcs:633: error: ‘pd_new’ was not declared in this scope
rubyext.c.fcs:636: error: ‘struct BFProxy’ has no member named ‘inlet’
rubyext.c.fcs:636: error: ‘struct BFProxy’ has no member named ‘ob_pd’
rubyext.c.fcs:636: error: ‘inlet_new’ was not declared in this scope
rubyext.c.fcs:642: error: ‘in’ was not declared in this scope
rubyext.c.fcs:642: error: ‘inlet_free’ was not declared in this scope
rubyext.c.fcs: At global scope:
rubyext.c.fcs:649: error: invalid use of undefined type ‘struct BFObject’
rubyext.c.fcs:80: error: forward declaration of ‘struct BFObject’
rubyext.c.fcs: In member function ‘void BFObject::noutlets_set(int)’:
rubyext.c.fcs:650: error: ‘RAISE’ was not declared in this scope
rubyext.c.fcs:651: error: ‘RAISE’ was not declared in this scope
rubyext.c.fcs:653: error: ‘nout’ was not declared in this scope
rubyext.c.fcs:654: error: ‘t_outlet’ was not declared in this scope
rubyext.c.fcs:654: error: ‘noo’ was not declared in this scope
rubyext.c.fcs:654: error: expected type-specifier before ‘t_outlet’
rubyext.c.fcs:654: error: expected `;' before ‘t_outlet’
rubyext.c.fcs:655: error: ‘out’ was not declared in this scope
rubyext.c.fcs:655: error: expected primary-expression before ‘)’ token
rubyext.c.fcs:655: error: ‘memcpy’ was not declared in this scope
rubyext.c.fcs:656: error: type ‘<type error>’ argument given to ‘delete’, expected pointer
rubyext.c.fcs:658: error: ‘s_anything’ was not declared in this scope
rubyext.c.fcs:658: error: ‘outlet_new’ was not declared in this scope
rubyext.c.fcs:660: error: ‘out’ was not declared in this scope
rubyext.c.fcs:660: error: ‘outlet_free’ was not declared in this scope
rubyext.c.fcs: At global scope:
rubyext.c.fcs:665: error: ‘Ruby’ does not name a type
rubyext.c.fcs:670: error: ‘Ruby’ does not name a type
rubyext.c.fcs:676: error: ‘Ruby’ does not name a type
rubyext.c.fcs:681: error: ‘Ruby’ does not name a type
rubyext.c.fcs:687: error: ‘Ruby’ does not name a type
rubyext.c.fcs:696: error: ‘Ruby’ does not name a type
rubyext.c.fcs:703: error: ‘Ruby’ does not name a type
rubyext.c.fcs:724: error: variable or field ‘FObject_startup’ declared void
rubyext.c.fcs:724: error: ‘Ruby’ was not declared in this scope
rubyext.c.fcs: In function ‘void* FObject_allocator()’:
rubyext.c.fcs:724: error: expected type-specifier before ‘FObject’
rubyext.c.fcs:724: error: expected ‘;’ before ‘FObject’
rubyext.c.fcs:724: error: ‘FObject’ was not declared in this scope
rubyext.c.fcs: At global scope:
rubyext.c.fcs:724: error: ‘MethodDecl’ does not name a type
rubyext.c.fcs:724: error: ‘FClass’ does not name a type
rubyext.c.fcs:724: error: variable or field ‘FObject_startup’ declared void
rubyext.c.fcs:724: error: redefinition of ‘int FObject_startup’
rubyext.c.fcs:724: error: ‘int FObject_startup’ previously defined here
rubyext.c.fcs:724: error: ‘Ruby’ was not declared in this scope
rubyext.c.fcs:730: error: expected class-name before ‘{’ token
rubyext.c.fcs:731: error: ISO C++ forbids declaration of ‘t_clock’ with no type
t.c.fcs:612: error: ‘glist_findrtext’ was not declared in this scope
rubyext.c.fcs:731: error: expected ‘;’ before ‘*’ token
rubyext.c.fcs:732: error: ‘Ruby’ does not name a type
rubyext.c.fcs:733: error: ‘VA’ has not been declared
rubyext.c.fcs:733: error: ‘Ruby’ does not name a type
rubyext.c.fcs:734: error: ‘VA’ has not been declared
rubyext.c.fcs:734: error: ‘Ruby’ does not name a type
rubyext.c.fcs:735: error: ‘VA’ has not been declared
rubyext.c.fcs:735: error: ‘Ruby’ does not name a type
rubyext.c.fcs:738: error: variable or field ‘Clock_fn’ declared void
rubyext.c.fcs:738: error: ‘Ruby’ was not declared in this scope
rubyext.c.fcs:738: error: expected ‘,’ or ‘;’ before ‘{’ token
rubyext.c.fcs: In function ‘void Clock_mark(Clock*)’:
rubyext.c.fcs:739: error: ‘struct Clock’ has no member named ‘owner’
rubyext.c.fcs:739: error: ‘rb_gc_mark’ was not declared in this scope
rubyext.c.fcs: In function ‘void Clock_free(Clock*)’:
rubyext.c.fcs:740: error: ‘struct Clock’ has no member named ‘serf’
rubyext.c.fcs:740: error: ‘clock_free’ was not declared in this scope
rubyext.c.fcs: At global scope:
rubyext.c.fcs:742: error: ‘Ruby’ does not name a type
rubyext.c.fcs:750: error: ‘Ruby’ does not name a type
rubyext.c.fcs:750: error: variable or field ‘set’ declared void
rubyext.c.fcs:750: error: ‘int Clock::set’ is not a static member of ‘struct Clock’
rubyext.c.fcs:750: error: ‘VA’ was not declared in this scope
rubyext.c.fcs:750: error: expected primary-expression before ‘double’
rubyext.c.fcs:750: error: initializer expression list treated as compound expression
rubyext.c.fcs:750: error: expected ‘,’ or ‘;’ before ‘{’ token
rubyext.c.fcs:751: error: ‘Ruby’ does not name a type
rubyext.c.fcs:751: error: variable or field ‘delay’ declared void
rubyext.c.fcs:751: error: ‘int Clock::delay’ is not a static member of ‘struct Clock’
rubyext.c.fcs:751: error: ‘VA’ was not declared in this scope
rubyext.c.fcs:751: error: expected primary-expression before ‘double’
rubyext.c.fcs:751: error: initializer expression list treated as compound expression
rubyext.c.fcs:751: error: expected ‘,’ or ‘;’ before ‘{’ token
rubyext.c.fcs:752: error: ‘Ruby’ does not name a type
rubyext.c.fcs:752: error: variable or field ‘unset’ declared void
rubyext.c.fcs:752: error: ‘int Clock::unset’ is not a static member of ‘struct Clock’
rubyext.c.fcs:752: error: ‘VA’ was not declared in this scope
rubyext.c.fcs:752: error: expected ‘,’ or ‘;’ before ‘{’ token
rubyext.c.fcs:754: error: variable or field ‘Clock_startup’ declared void
rubyext.c.fcs:754: error: ‘Ruby’ was not declared in this scope
rubyext.c.fcs:754: error: ‘MethodDecl’ does not name a type
rubyext.c.fcs:754: error: ‘FClass’ does not name a type
rubyext.c.fcs:754: error: variable or field ‘Clock_startup’ declared void
rubyext.c.fcs:754: error: redefinition of ‘int Clock_startup’
rubyext.c.fcs:754: error: ‘int Clock_startup’ previously defined here
rubyext.c.fcs:754: error: ‘Ruby’ was not declared in this scope
rubyext.c.fcs:759: error: ‘Ruby’ does not name a type
rubyext.c.fcs:768: error: ‘Ruby’ does not name a type
rubyext.c.fcs:813: error: expected class-name before ‘{’ token
rubyext.c.fcs:815: error: expected constructor, destructor, or type conversion before ‘*’ token
rubyext.c.fcs:816: error: ‘t_symbol’ was not declared in this scope
rubyext.c.fcs:816: error: ‘classsym’ was not declared in this scope
rubyext.c.fcs:816: error: expected primary-expression before ‘int’
rubyext.c.fcs:816: error: ‘t_atom’ was not declared in this scope
rubyext.c.fcs:816: error: ‘at’ was not declared in this scope
rubyext.c.fcs:816: error: initializer expression list treated as compound expression
rubyext.c.fcs:816: error: expected ‘,’ or ‘;’ before ‘{’ token
rubyext.c.fcs:828: error: expected initializer before ‘*’ token
rubyext.c.fcs: In function ‘void ruby_stack_end_hack()’:
rubyext.c.fcs:837: error: ‘hack’ was not declared in this scope
rubyext.c.fcs:837: error: ‘clock_free’ was not declared in this scope
rubyext.c.fcs: In function ‘void add_to_path(char*)’:
rubyext.c.fcs:845: error: ‘sprintf’ was not declared in this scope
rubyext.c.fcs: In function ‘void gridflow_setup()’:
rubyext.c.fcs:860: error: ‘post’ was not declared in this scope
rubyext.c.fcs:862: error: ‘getenv’ was not declared in this scope
rubyext.c.fcs:863: error: ‘strcmp’ was not declared in this scope
rubyext.c.fcs:868: error: ‘exit’ was not declared in this scope
rubyext.c.fcs:869: error: ‘open_via_path’ was not declared in this scope
rubyext.c.fcs:881: error: ‘ruby_init’ was not declared in this scope
rubyext.c.fcs:882: error: ‘COUNT’ was not declared in this scope
rubyext.c.fcs:882: error: ‘ruby_options’ was not declared in this scope
rubyext.c.fcs:883: error: ‘EVAL’ was not declared in this scope
rubyext.c.fcs:883: error: ‘rb_str_ptr’ was not declared in this scope
rubyext.c.fcs:884: error: ‘Ruby’ was not declared in this scope
rubyext.c.fcs:884: error: expected `;' before ‘cData’
rubyext.c.fcs:885: error: ‘BFProxy_class’ was not declared in this scope
rubyext.c.fcs:885: error: ‘stderr’ was not declared in this scope
rubyext.c.fcs:885: error: ‘gensym’ was not declared in this scope
rubyext.c.fcs:885: error: ‘fprintf’ was not declared in this scope
rubyext.c.fcs:885: error: ‘CLASS_PD’ was not declared in this scope
rubyext.c.fcs:885: error: ‘CLASS_NOINLET’ was not declared in this scope
rubyext.c.fcs:885: error: ‘A_NULL’ was not declared in this scope
rubyext.c.fcs:885: error: ‘class_new’ was not declared in this scope
rubyext.c.fcs:887: error: ‘class_addanything’ was not declared in this scope
rubyext.c.fcs:888: error: ‘cData’ was not declared in this scope
rubyext.c.fcs:889: error: ‘RMethod’ was not declared in this scope
rubyext.c.fcs:889: error: ‘rb_define_singleton_method’ was not declared in this scope
rubyext.c.fcs:891: error: ‘mGridFlow2’ was not declared in this scope
rubyext.c.fcs:894: error: ‘DIR’ was not declared in this scope
rubyext.c.fcs:894: error: ‘SI’ was not declared in this scope
rubyext.c.fcs:894: error: ‘rb_str_new2’ was not declared in this scope
rubyext.c.fcs:894: error: ‘rb_const_set’ was not declared in this scope
rubyext.c.fcs:905: error: ‘bindpatcher’ was not declared in this scope
rubyext.c.fcs:905: error: ‘t_newmethod’ was not declared in this scope
rubyext.c.fcs:905: error: ‘t_object’ was not declared in this scope
rubyext.c.fcs:905: error: ‘CLASS_DEFAULT’ was not declared in this scope
rubyext.c.fcs:905: error: ‘A_GIMME’ was not declared in this scope
rubyext.c.fcs:910: error: ‘hack’ was not declared in this scope
rubyext.c.fcs:910: error: ‘t_method’ was not declared in this scope
rubyext.c.fcs:910: error: ‘clock_new’ was not declared in this scope
rubyext.c.fcs:911: error: ‘clock_delay’ was not declared in this scope
rubyext.c.fcs: At global scope:
rubyext.c.fcs:94: warning: ‘rb_sym_name_r4j’ defined but not used
rubyext.c.fcs:121: warning: ‘Pointer_startup’ defined but not used
rubyext.c.fcs:150: warning: ‘ninlets_of’ defined but not used
rubyext.c.fcs:156: warning: ‘noutlets_of’ defined but not used
rubyext.c.fcs:190: warning: ‘Bridge_export_value’ defined but not used
rubyext.c.fcs:298: warning: ‘BFObject_init’ defined but not used
rubyext.c.fcs:452: warning: ‘BFObject_class_init_1’ defined but not used
rubyext.c.fcs:724: warning: ‘FObject_startup’ defined but not used
rubyext.c.fcs:754: warning: ‘Clock_startup’ defined but not used
rubyext.c.fcs:816: warning: ‘bindpatcher_init’ defined but not used
make: *** [gridflow.pd_linux] Error 1