.all_cpp.cpp
koagendaview.cpp: In member function 'void KOAgendaView::updateEventDates(KOAgendaItem*)':
koagendaview.cpp:1028: warning: unused variable 'recur'
calendarview.cpp: In member function 'bool CalendarView::openCalendar(const QString&, bool)':
calendarview.cpp:393: warning: unused variable 'cr'
kotodoviewitem.cpp: In member function 'bool KOTodoViewItem::isAlternate()':
kotodoviewitem.cpp:212: warning: suggest parentheses around assignment used as truth value
koprefs.cpp: In member function 'QColor* KOPrefs::resourceColor(const QString&)':
koprefs.cpp:304: warning: converting to 'int' from 'double'
actionmanager.cpp: In member function 'void ActionManager::file_open(const KURL&)':
actionmanager.cpp:722: warning: 'setActiveWindow' is deprecated (declared at /usr/kde/3.5/include/kwin.h:113)
../kdgantt/KDGanttViewTaskItem.h: In member function 'virtual void KOrg::TimelineSubItem::showItem(bool, int)':
../kdgantt/KDGanttViewTaskItem.h:64: error: 'virtual void KDGanttViewTaskItem::showItem(bool, int)' is private
timelineitem.cpp:116: error: within this context
../kdgantt/KDGanttView.h:456: error: 'KDTimeHeaderWidget* KDGanttView::myTimeHeader' is private
timelineitem.cpp:122: error: within this context
../kdgantt/KDGanttView.h:456: error: 'KDTimeHeaderWidget* KDGanttView::myTimeHeader' is private
timelineitem.cpp:123: error: within this context
../kdgantt/KDGanttView.h:457: error: 'KDTimeTableWidget* KDGanttView::myTimeTable' is private
timelineitem.cpp:128: error: within this context
../kdgantt/KDGanttView.h:457: error: 'KDTimeTableWidget* KDGanttView::myTimeTable' is private
timelineitem.cpp:140: error: within this context
koattendeeeditor.cpp: In member function 'virtual bool KOAttendeeEditor::eventFilter(QObject*, QEvent*)':
koattendeeeditor.cpp:438: error: expected unqualified-id before numeric constant
koattendeeeditor.cpp:438: error: expected `)' before numeric constant
make[3]: *** [libkorganizer_la.all_cpp.lo] Error 1
make[3]: *** Waiting for unfinished jobs....
make[3]: Leaving directory `/tmp/PALUDIS/var_tmp/kde-base/korganizer-3.5.9/work/korganizer-3.5.9/korganizer'
make[2]: *** [all-recursive] Error 1
make[2]: Leaving directory `/tmp/PALUDIS/var_tmp/kde-base/korganizer-3.5.9/work/korganizer-3.5.9/korganizer'
make[1]: *** [all-recursive] Error 1
make[1]: Leaving directory `/tmp/PALUDIS/var_tmp/kde-base/korganizer-3.5.9/work/korganizer-3.5.9'
make: *** [all] Error 2
!!! ERROR in kde-base/korganizer-3.5.9:
!!! In kde_src_compile at line 4253
!!! died running emake, kde_src_compile:make
!!! Call stack:
!!! * kde_src_compile (/tmp/PALUDIS/var_tmp/kde-base/korganizer-3.5.9/temp/loadsaveenv:4253)
!!! * kde_src_compile (/tmp/PALUDIS/var_tmp/kde-base/korganizer-3.5.9/temp/loadsaveenv:4257)
!!! * kde_src_compile (/tmp/PALUDIS/var_tmp/kde-base/korganizer-3.5.9/temp/loadsaveenv:4136)
!!! * kde-meta_src_compile (/tmp/PALUDIS/var_tmp/kde-base/korganizer-3.5.9/temp/loadsaveenv:3971)
!!! * src_compile (/tmp/PALUDIS/var_tmp/kde-base/korganizer-3.5.9/temp/loadsaveenv:5586)
!!! * ebuild_f_compile (/usr/libexec/paludis/1/src_compile.bash:51)
!!! * ebuild_main (/usr/libexec/paludis/ebuild.bash:457)
!!! * main (/usr/libexec/paludis/ebuild.bash:475)
diefunc: making ebuild PID 18715 exit with error
die trap: exiting with error.