LD_LIBRARY_PATH sane: Ok
which installed: Ok
sed works: Ok (/bin/sed)
GNU make version '3.81': Ok
C compiler '/usr/bin/gcc'
C compiler version '4.1.3': Ok
C++ compiler '/usr/bin/g++'
C++ compiler version '4.1.3': Ok
bison installed: Ok
flex installed: Ok
gettext installed: Ok
makeinfo installed: Ok
Build system dependencies: Ok
PATH="/Devel/ARM9/Hammer/buildroot2/toolchain_build_arm/bin:/Devel/ARM9/Hammer/buildroot2/build_arm/staging_dir/bin:/Devel/ARM9/Hammer/buildroot2/build_arm/staging_dir/usr/bin:/Devel/ARM9/Hammer/buildroot/build_arm/staging_dir/bin:/home/linuxguy/bin:/bin:/usr/bin:/usr/local/bin:/sbin:/usr/sbin:/usr/local/sbin" /usr/bin/make -j1 -C /Devel/ARM9/Hammer/buildroot2/toolchain_build_arm/gcc-4.1.2-final all
make[1]: Entering directory `/Devel/ARM9/Hammer/buildroot2/toolchain_build_arm/gcc-4.1.2-final'
make[2]: Entering directory `/Devel/ARM9/Hammer/buildroot2/toolchain_build_arm/gcc-4.1.2-final'
make[3]: Entering directory `/Devel/ARM9/Hammer/buildroot2/toolchain_build_arm/gcc-4.1.2-final/libiberty'
make[4]: Entering directory `/Devel/ARM9/Hammer/buildroot2/toolchain_build_arm/gcc-4.1.2-final/libiberty/testsuite'
make[4]: Nothing to be done for `all'.
make[4]: Leaving directory `/Devel/ARM9/Hammer/buildroot2/toolchain_build_arm/gcc-4.1.2-final/libiberty/testsuite'
make[3]: Leaving directory `/Devel/ARM9/Hammer/buildroot2/toolchain_build_arm/gcc-4.1.2-final/libiberty'
make[3]: Entering directory `/Devel/ARM9/Hammer/buildroot2/toolchain_build_arm/gcc-4.1.2-final/fixincludes'
make[3]: Nothing to be done for `all'.
make[3]: Leaving directory `/Devel/ARM9/Hammer/buildroot2/toolchain_build_arm/gcc-4.1.2-final/fixincludes'
make[3]: Entering directory `/Devel/ARM9/Hammer/buildroot2/toolchain_build_arm/gcc-4.1.2-final/intl'
make[3]: Nothing to be done for `all'.
make[3]: Leaving directory `/Devel/ARM9/Hammer/buildroot2/toolchain_build_arm/gcc-4.1.2-final/intl'
make[3]: Entering directory `/Devel/ARM9/Hammer/buildroot2/toolchain_build_arm/gcc-4.1.2-final/build-i386-pc-linux-gnu/libiberty'
make[4]: Entering directory `/Devel/ARM9/Hammer/buildroot2/toolchain_build_arm/gcc-4.1.2-final/build-i386-pc-linux-gnu/libiberty/testsuite'
make[4]: Nothing to be done for `all'.
make[4]: Leaving directory `/Devel/ARM9/Hammer/buildroot2/toolchain_build_arm/gcc-4.1.2-final/build-i386-pc-linux-gnu/libiberty/testsuite'
make[3]: Leaving directory `/Devel/ARM9/Hammer/buildroot2/toolchain_build_arm/gcc-4.1.2-final/build-i386-pc-linux-gnu/libiberty'
make[3]: Entering directory `/Devel/ARM9/Hammer/buildroot2/toolchain_build_arm/gcc-4.1.2-final/build-i386-pc-linux-gnu/fixincludes'
make[3]: Nothing to be done for `all'.
make[3]: Leaving directory `/Devel/ARM9/Hammer/buildroot2/toolchain_build_arm/gcc-4.1.2-final/build-i386-pc-linux-gnu/fixincludes'
make[3]: Entering directory `/Devel/ARM9/Hammer/buildroot2/toolchain_build_arm/gcc-4.1.2-final/libcpp'
make[3]: Nothing to be done for `all'.
make[3]: Leaving directory `/Devel/ARM9/Hammer/buildroot2/toolchain_build_arm/gcc-4.1.2-final/libcpp'
make[3]: Entering directory `/Devel/ARM9/Hammer/buildroot2/toolchain_build_arm/gcc-4.1.2-final/gcc'
/Devel/ARM9/Hammer/buildroot2/toolchain_build_arm/gcc-4.1.2-final/./gcc/xgcc -B/Devel/ARM9/Hammer/buildroot2/toolchain_build_arm/gcc-4.1.2-final/./gcc/ -B/Devel/ARM9/Hammer/buildroot2/build_arm/staging_dir/arm-linux-uclibc/bin/ -B/Devel/ARM9/Hammer/buildroot2/build_arm/staging_dir/arm-linux-uclibc/lib/ -isystem /Devel/ARM9/Hammer/buildroot2/build_arm/staging_dir/arm-linux-uclibc/include -isystem /Devel/ARM9/Hammer/buildroot2/build_arm/staging_dir/arm-linux-uclibc/sys-include -dumpspecs > tmp-specs
/Devel/ARM9/Hammer/buildroot2/toolchain_build_arm/gcc-4.1.2-final/./gcc/xgcc: error while loading shared libraries: libiconv.so.2: cannot open shared object file: No such file or directory
make[3]: *** [specs] Error 127
make[3]: Leaving directory `/Devel/ARM9/Hammer/buildroot2/toolchain_build_arm/gcc-4.1.2-final/gcc'
make[2]: *** [all-gcc] Error 2
make[2]: Leaving directory `/Devel/ARM9/Hammer/buildroot2/toolchain_build_arm/gcc-4.1.2-final'
make[1]: *** [all] Error 2
make[1]: Leaving directory `/Devel/ARM9/Hammer/buildroot2/toolchain_build_arm/gcc-4.1.2-final'
make: *** [/Devel/ARM9/Hammer/buildroot2/toolchain_build_arm/gcc-4.1.2-final/.compiled] Error 2
linuxguy@intrepid </Devel/ARM9/Hammer/buildroot2>