All pastes #917775 Raw Edit

apt_error1

public text v1 · immutable
#917775 ·published 2008-02-25 17:44 UTC
rendered paste body
g++   -g -O0 -fPIC -D_i386_ -D_linux_ -DKATMAI -I../i386-linux/include -I../include -I/home/ranjank/ranjan_kuma_Spectrum-Rec/vobs/baseline/include -D__THREADED -msse -mmmx -D_SIMPLE_R -D_REENTRANT -D_GNU_SOURCE  -D_REENTRANT -D_STLP_USE_DYNAMIC_LIB -I"/home/ranjank/ranjan_kuma_Spectrum-Rec/vobs/baseline/include/stlport" -D_STLP_DEBUG -DVERSION=\"9.0\" -I../apt/base -I../apt/api -I/home/ranjank/ranjan_kuma_Spectrum-Rec/vobs/baseline/include/aachen   -D_REENTRANT -D_STLP_USE_DYNAMIC_LIB -I"/home/ranjank/ranjan_kuma_Spectrum-Rec/vobs/baseline/include/stlport" -D_STLP_DEBUG  -c ../apt/base/src/aptaligner.cpp -o build/i386-linux/debug/lib/apt/base/src/aptalignerD.o
In file included from ../apt/base/src/aptaligner.cpp:23:
../apt/base/ds/aptaligner.h:103: error: expected identifier before ‘(’ token
../apt/base/ds/aptaligner.h:103: error: expected `}' before ‘(’ token
../apt/base/ds/aptaligner.h:103: error: new types may not be defined in a return type
../apt/base/ds/aptaligner.h:103: note: (perhaps a semicolon is missing after the definition of ‘DSAPTAligner::DSAPTTraceBack::<anonymous enum>’)
../apt/base/ds/aptaligner.h:103: error: invalid pure specifier (only `= 0' is allowed) before numeric constant
../apt/base/ds/aptaligner.h:104: error: non-local function ‘DSAPTAligner::DSAPTTraceBack::<anonymous enum> DSAPTAligner::DSAPTTraceBack::__builtin_inff()’ uses anonymous type
../apt/base/ds/aptaligner.h:105: error: expected ‘;’ before ‘}’ token
../apt/base/ds/aptaligner.h:105: error: expected `;' before ‘}’ token
../apt/base/ds/aptaligner.h:107: error: ISO C++ forbids declaration of ‘DSAPTTraceBack’ with no type
../apt/base/ds/aptaligner.h:109: error: expected class-name before ‘(’ token
../apt/base/ds/aptaligner.h: In member function ‘int DSAPTAligner::DSAPTTraceBack()’:
../apt/base/ds/aptaligner.h:107: error: only constructors take base initializers
../apt/base/ds/aptaligner.h: At global scope:
../apt/base/ds/aptaligner.h:131: error: ‘logger_’ declared as reference but not initialized
../apt/base/ds/aptaligner.h:137: error: ‘graphInv_’ declared as reference but not initialized
../apt/base/ds/aptaligner.h:138: error: ‘phoneInv_’ declared as reference but not initialized
../apt/base/ds/aptaligner.h:148: error: expected constructor, destructor, or type conversion before ‘*’ token
../apt/base/ds/aptaligner.h:149: error: expected declaration before ‘}’ token
gmake[1]: *** [build/i386-linux/debug/lib/apt/base/src/aptalignerD.o] Error 1
gmake[1]: Leaving directory `/home/ranjank/ranjan_kuma_Spectrum-Rec/vobs/ssft_shared_src/apt_src/src'
gmake: *** [apt-shared] Error 2
Non-zero return: 2