All pastes #917769 Raw Edit

DST_error4

public text v1 · immutable
#917769 ·published 2008-02-25 17:40 UTC
rendered paste body
g++   -g -O0 -fPIC -D_i386_ -D_linux_ -DKATMAI -I../i386-linux/include -I../include -I/home/ranjank/ranjan_kuma_Spectrum-Rec/vobs/baseline/include -D__THREADED -msse -mmmx -D_SIMPLE_R -D_REENTRANT -D_GNU_SOURCE  -D_REENTRANT -D_STLP_USE_DYNAMIC_LIB -I"/home/ranjank/ranjan_kuma_Spectrum-Rec/vobs/baseline/include/stlport" -D_STLP_DEBUG -DVERSION=\"9.0\" -I../layer0/marble -I../layer0/apiutils -I../layer0/sysctrls -I../layer0/dsnmsmsg -I../layer1/speech -I../layer1/audiotools -I/home/ranjank/ranjan_kuma_Spectrum-Rec/vobs/baseline/include/aachen   -D_REENTRANT -D_STLP_USE_DYNAMIC_LIB -I"/home/ranjank/ranjan_kuma_Spectrum-Rec/vobs/baseline/include/stlport" -D_STLP_DEBUG  -c ../layer1/speech/src/phlexdsc.cpp -o build/i386-linux/debug/lib/layer1/speech/src/phlexdscD.o
In file included from ../layer1/speech/ds/phlexdsc.h:28,
                 from ../layer1/speech/src/phlexdsc.cpp:29:
/home/ranjank/ranjan_kuma_Spectrum-Rec/vobs/baseline/include/aachen/dst/tvhdict.h:13: error: ‘__DFL_TMPL_PARAM’ has not been declared
/home/ranjank/ranjan_kuma_Spectrum-Rec/vobs/baseline/include/aachen/dst/tvhdict.h:13: error: expected `)' before ‘,’ token
/home/ranjank/ranjan_kuma_Spectrum-Rec/vobs/baseline/include/aachen/dst/tvhdict.h:13: error: ‘struct stlpd_std::hash<X>’ is not a valid type for a template constant parameter
/home/ranjank/ranjan_kuma_Spectrum-Rec/vobs/baseline/include/aachen/dst/tvhdict.h:13: error: expected ‘>’ before ‘)’ token
/home/ranjank/ranjan_kuma_Spectrum-Rec/vobs/baseline/include/aachen/dst/tvhdict.h:13: error: expected unqualified-id before ‘)’ token
/home/ranjank/ranjan_kuma_Spectrum-Rec/vobs/baseline/include/aachen/dst/tvhdict.h:117: error: ‘__DFL_TMPL_PARAM’ has not been declared
/home/ranjank/ranjan_kuma_Spectrum-Rec/vobs/baseline/include/aachen/dst/tvhdict.h:117: error: expected `)' before ‘,’ token
/home/ranjank/ranjan_kuma_Spectrum-Rec/vobs/baseline/include/aachen/dst/tvhdict.h:117: error: ‘struct stlpd_std::hash<X>’ is not a valid type for a template constant parameter
/home/ranjank/ranjan_kuma_Spectrum-Rec/vobs/baseline/include/aachen/dst/tvhdict.h:117: error: expected ‘>’ before ‘)’ token
/home/ranjank/ranjan_kuma_Spectrum-Rec/vobs/baseline/include/aachen/dst/tvhdict.h:117: error: expected unqualified-id before ‘)’ token
In file included from ../layer1/speech/src/phlexdsc.cpp:29:
../layer1/speech/ds/phlexdsc.h:46: error: expected template-name before ‘<’ token
../layer1/speech/ds/phlexdsc.h:46: error: expected `{' before ‘<’ token
../layer1/speech/ds/phlexdsc.h:46: error: expected unqualified-id before ‘<’ token
../layer1/speech/src/phlexdsc.cpp:46: error: invalid use of incomplete type ‘class DSPhoneticLexDescription’
../layer1/speech/ds/phlexdsc.h:46: error: forward declaration of ‘class DSPhoneticLexDescription’
../layer1/speech/src/phlexdsc.cpp:51: error: invalid use of incomplete type ‘class DSPhoneticLexDescription’
../layer1/speech/ds/phlexdsc.h:46: error: forward declaration of ‘class DSPhoneticLexDescription’
../layer1/speech/src/phlexdsc.cpp:62: error: invalid use of incomplete type ‘class DSPhoneticLexDescription’
../layer1/speech/ds/phlexdsc.h:46: error: forward declaration of ‘class DSPhoneticLexDescription’
../layer1/speech/src/phlexdsc.cpp:68: error: invalid use of incomplete type ‘class DSPhoneticLexDescription’
../layer1/speech/ds/phlexdsc.h:46: error: forward declaration of ‘class DSPhoneticLexDescription’
../layer1/speech/src/phlexdsc.cpp:76: error: invalid use of incomplete type ‘class DSPhoneticLexDescription’
../layer1/speech/ds/phlexdsc.h:46: error: forward declaration of ‘class DSPhoneticLexDescription’
../layer1/speech/src/phlexdsc.cpp:131: error: invalid use of incomplete type ‘class DSPhoneticLexDescription’
../layer1/speech/ds/phlexdsc.h:46: error: forward declaration of ‘class DSPhoneticLexDescription’
gmake[1]: *** [build/i386-linux/debug/lib/layer1/speech/src/phlexdscD.o] Error 1
gmake[1]: Leaving directory `/home/ranjank/ranjan_kuma_Spectrum-Rec/vobs/ssft_shared_src/SP_Baselibs_src/src'
gmake: *** [speech-static] Error 2
Non-zero return: 2