g++ -g -O0 -fPIC -D_i386_ -D_linux_ -DKATMAI -I../i386-linux/include -I../include -I/home/ranjank/ranjan_kuma_Spectrum-Rec/vobs/baseline/include -D__THREADED -msse -mmmx -D_SIMPLE_R -D_REENTRANT -D_GNU_SOURCE -D_REENTRANT -D_STLP_USE_DYNAMIC_LIB -I"/home/ranjank/ranjan_kuma_Spectrum-Rec/vobs/baseline/include/stlport" -D_STLP_DEBUG -DVERSION=\"9.0\" -I../layer0/marble -I../layer0/apiutils -I../layer0/sysctrls -I../layer0/dsnmsmsg -I../layer1/speech -I../layer1/audiotools -I/home/ranjank/ranjan_kuma_Spectrum-Rec/vobs/baseline/include/aachen -D_REENTRANT -D_STLP_USE_DYNAMIC_LIB -I"/home/ranjank/ranjan_kuma_Spectrum-Rec/vobs/baseline/include/stlport" -D_STLP_DEBUG -c ../layer0/marble/src/crashhdlr.cpp -o build/i386-linux/debug/lib/layer0/marble/src/crashhdlrD.o
In file included from ../layer0/marble/ds/nmsmsg.h:43,
from ../layer0/marble/src/crashhdlr.cpp:21:
/home/ranjank/ranjan_kuma_Spectrum-Rec/vobs/baseline/include/aachen/dst/tphdict.h:15: error: ‘__DFL_TMPL_PARAM’ has not been declared
/home/ranjank/ranjan_kuma_Spectrum-Rec/vobs/baseline/include/aachen/dst/tphdict.h:15: error: expected `)' before ‘,’ token
/home/ranjank/ranjan_kuma_Spectrum-Rec/vobs/baseline/include/aachen/dst/tphdict.h:15: error: ‘struct stlpd_std::hash<X>’ is not a valid type for a template constant parameter
/home/ranjank/ranjan_kuma_Spectrum-Rec/vobs/baseline/include/aachen/dst/tphdict.h:15: error: expected ‘>’ before ‘)’ token
/home/ranjank/ranjan_kuma_Spectrum-Rec/vobs/baseline/include/aachen/dst/tphdict.h:15: error: expected unqualified-id before ‘)’ token
/home/ranjank/ranjan_kuma_Spectrum-Rec/vobs/baseline/include/aachen/dst/tphdict.h:179: error: ‘__DFL_TMPL_PARAM’ has not been declared
/home/ranjank/ranjan_kuma_Spectrum-Rec/vobs/baseline/include/aachen/dst/tphdict.h:179: error: expected `)' before ‘,’ token
/home/ranjank/ranjan_kuma_Spectrum-Rec/vobs/baseline/include/aachen/dst/tphdict.h:179: error: ‘struct stlpd_std::hash<X>’ is not a valid type for a template constant parameter
/home/ranjank/ranjan_kuma_Spectrum-Rec/vobs/baseline/include/aachen/dst/tphdict.h:179: error: expected ‘>’ before ‘)’ token
/home/ranjank/ranjan_kuma_Spectrum-Rec/vobs/baseline/include/aachen/dst/tphdict.h:179: error: expected unqualified-id before ‘)’ token
In file included from ../layer0/marble/src/crashhdlr.cpp:21:
../layer0/marble/ds/nmsmsg.h:56: error: expected initializer before ‘<’ token
../layer0/marble/ds/nmsmsg.h:60: error: expected class-name before ‘{’ token
../layer0/marble/ds/nmsmsg.h:310: error: expected initializer before ‘<’ token
../layer0/marble/ds/nmsmsg.h:314: error: expected class-name before ‘{’ token
In file included from ../layer0/marble/ds/nmsmsg.h:371,
from ../layer0/marble/src/crashhdlr.cpp:21:
../layer0/marble/ds/nmsmsg.inl: In member function ‘void DSNMSMessage::clear()’:
../layer0/marble/ds/nmsmsg.inl:27: error: ‘clearAndDestroy’ was not declared in this scope
../layer0/marble/ds/nmsmsg.inl: In constructor ‘DSNMSMessageIterator::DSNMSMessageIterator(const DSNMSMessage&)’:
../layer0/marble/ds/nmsmsg.inl:37: error: class ‘DSNMSMessageIterator’ does not have any field named ‘DSNMSMessageIteratorBase’
../layer0/marble/ds/nmsmsg.inl: In member function ‘bool DSNMSMessageIterator::operator++()’:
../layer0/marble/ds/nmsmsg.inl:44: error: ‘DSNMSMessageIteratorBase’ has not been declared
../layer0/marble/ds/nmsmsg.inl: In member function ‘const DSNMSObjectID* DSNMSMessageIterator::operator()()’:
../layer0/marble/ds/nmsmsg.inl:50: error: ‘DSNMSMessageIteratorBase’ has not been declared
../layer0/marble/ds/nmsmsg.inl: In member function ‘void DSNMSMessageIterator::reset()’:
../layer0/marble/ds/nmsmsg.inl:56: error: ‘DSNMSMessageIteratorBase’ has not been declared
../layer0/marble/ds/nmsmsg.inl: In member function ‘void DSNMSMessageIterator::reset(const DSNMSMessage&)’:
../layer0/marble/ds/nmsmsg.inl:62: error: ‘DSNMSMessageIteratorBase’ has not been declared
../layer0/marble/ds/nmsmsg.inl: In member function ‘const DSNMSObjectID* DSNMSMessageIterator::getObjectID() const’:
../layer0/marble/ds/nmsmsg.inl:68: error: ‘key’ was not declared in this scope
../layer0/marble/ds/nmsmsg.inl: In member function ‘const DSNMSCString& DSNMSMessageIterator::getStringValue() const’:
../layer0/marble/ds/nmsmsg.inl:74: error: ‘value’ was not declared in this scope
../layer0/marble/ds/nmsmsg.inl: In member function ‘int DSNMSMessageIterator::getIntValue() const’:
../layer0/marble/ds/nmsmsg.inl:80: error: ‘value’ was not declared in this scope
../layer0/marble/ds/nmsmsg.inl: In member function ‘long int DSNMSMessageIterator::getLongValue() const’:
../layer0/marble/ds/nmsmsg.inl:86: error: ‘value’ was not declared in this scope
gmake[1]: *** [build/i386-linux/debug/lib/layer0/marble/src/crashhdlrD.o] Error 1
gmake[1]: Leaving directory `/home/ranjank/ranjan_kuma_Spectrum-Rec/vobs/ssft_shared_src/SP_Baselibs_src/src'
gmake: *** [marble-static] Error 2
Non-zero return: 2