rendered paste bodykinstalldirs build/i386-linux/debug/lib/./ build/i386-linux/debug/lib/DSTools_src/src/ build/i386-linux/debug/lib/layer0/apiutils/src/ build/i386-linux/debug/lib/layer0/dsnmsmsg/src/ build/i386-linux/debug/lib/layer0/marble/src/ build/i386-linux/debug/lib/layer1/speech/src/
chmod go-w,a+x build/i386-linux/debug/lib/./ build/i386-linux/debug/lib/DSTools_src/src/ build/i386-linux/debug/lib/layer0/apiutils/src/ build/i386-linux/debug/lib/layer0/dsnmsmsg/src/ build/i386-linux/debug/lib/layer0/marble/src/ build/i386-linux/debug/lib/layer1/speech/src/
gmake build/i386-linux/debug/lib/libmarbleD.a TARGET=marble DEPS=marble_SRC
gmake[1]: Entering directory `/home/ranjank/ranjan_kuma_Spectrum-Rec/vobs/ssft_shared_src/SP_Baselibs_src/src'
g++ -g -O0 -fPIC -D_i386_ -D_linux_ -DKATMAI -I../i386-linux/include -I../include -I/home/ranjank/ranjan_kuma_Spectrum-Rec/vobs/baseline/include -D__THREADED -msse -mmmx -D_SIMPLE_R -D_REENTRANT -D_GNU_SOURCE -D_REENTRANT -D_STLP_USE_DYNAMIC_LIB -I"/home/ranjank/ranjan_kuma_Spectrum-Rec/vobs/baseline/include/stlport" -D_STLP_DEBUG -DVERSION=\"9.0\" -I../layer0/marble -I../layer0/apiutils -I../layer0/sysctrls -I../layer0/dsnmsmsg -I../layer1/speech -I../layer1/audiotools -I/home/ranjank/ranjan_kuma_Spectrum-Rec/vobs/baseline/include/aachen -D_REENTRANT -D_STLP_USE_DYNAMIC_LIB -I"/home/ranjank/ranjan_kuma_Spectrum-Rec/vobs/baseline/include/stlport" -D_STLP_DEBUG -c ../../DSTools_src/src/epersist.cpp -o build/i386-linux/debug/lib/DSTools_src/src/epersistD.o
In file included from /home/ranjank/ranjan_kuma_Spectrum-Rec/vobs/baseline/include/aachen/dst/epersist.h:5,
from ../../DSTools_src/src/epersist.cpp:1:
/home/ranjank/ranjan_kuma_Spectrum-Rec/vobs/baseline/include/aachen/dst/defs.h:41: error: ‘__DFL_TMPL_PARAM’ has not been declared
/home/ranjank/ranjan_kuma_Spectrum-Rec/vobs/baseline/include/aachen/dst/defs.h:41: error: expected `)' before ‘,’ token
/home/ranjank/ranjan_kuma_Spectrum-Rec/vobs/baseline/include/aachen/dst/defs.h:41: error: ‘struct stlpd_std::equal_to<_Tp>’ is not a valid type for a template constant parameter
/home/ranjank/ranjan_kuma_Spectrum-Rec/vobs/baseline/include/aachen/dst/defs.h:41: error: expected ‘>’ before ‘)’ token
/home/ranjank/ranjan_kuma_Spectrum-Rec/vobs/baseline/include/aachen/dst/defs.h:41: error: expected unqualified-id before ‘)’ token
/home/ranjank/ranjan_kuma_Spectrum-Rec/vobs/baseline/include/aachen/dst/defs.h:63: error: ‘__DFL_TMPL_PARAM’ has not been declared
/home/ranjank/ranjan_kuma_Spectrum-Rec/vobs/baseline/include/aachen/dst/defs.h:63: error: expected `)' before ‘,’ token
/home/ranjank/ranjan_kuma_Spectrum-Rec/vobs/baseline/include/aachen/dst/defs.h:63: error: ‘struct stlpd_std::hash<X>’ is not a valid type for a template constant parameter
/home/ranjank/ranjan_kuma_Spectrum-Rec/vobs/baseline/include/aachen/dst/defs.h:63: error: expected ‘>’ before ‘)’ token
/home/ranjank/ranjan_kuma_Spectrum-Rec/vobs/baseline/include/aachen/dst/defs.h:63: error: expected unqualified-id before ‘)’ token
gmake[1]: *** [build/i386-linux/debug/lib/DSTools_src/src/epersistD.o] Error 1
gmake[1]: Leaving directory `/home/ranjank/ranjan_kuma_Spectrum-Rec/vobs/ssft_shared_src/SP_Baselibs_src/src'
gmake: *** [marble-static] Error 2
Non-zero return: 2