All pastes #917222 Raw Edit

WUNDERBAR

public text v1 · immutable
#917222 ·published 2008-02-25 05:28 UTC
rendered paste body
This file contains any messages produced by compilers while
running configure, to aid debugging if configure makes a mistake.

It was created by configure, which was
generated by GNU Autoconf 2.61.  Invocation command line was

  $ ./configure --with-python --with-perl --with-php=5

## --------- ##
## Platform. ##
## --------- ##

hostname = bishop
uname -m = i686
uname -r = 2.6.24-8-generic
uname -s = Linux
uname -v = #1 SMP Thu Feb 14 20:40:45 UTC 2008

/usr/bin/uname -p = unknown
/bin/uname -X     = unknown

/bin/arch              = unknown
/usr/bin/arch -k       = unknown
/usr/convex/getsysinfo = unknown
/usr/bin/hostinfo      = unknown
/bin/machine           = unknown
/usr/bin/oslevel       = unknown
/bin/universe          = unknown

PATH: /var/lib/gems/1.8/bin/
PATH: /var/lib/gems/1.8/bin/
PATH: /usr/local/sbin
PATH: /usr/local/bin
PATH: /usr/sbin
PATH: /usr/bin
PATH: /sbin
PATH: /bin
PATH: /usr/bin/X11
PATH: /usr/games


## ----------- ##
## Core tests. ##
## ----------- ##

configure:2032: checking for a BSD-compatible install
configure:2088: result: /usr/bin/install -c
configure:2099: checking whether build environment is sane
configure:2142: result: yes
configure:2170: checking for a thread-safe mkdir -p
configure:2209: result: /bin/mkdir -p
configure:2222: checking for gawk
configure:2238: found /usr/bin/gawk
configure:2249: result: gawk
configure:2260: checking whether make sets $(MAKE)
configure:2281: result: yes
configure:2568: checking build system type
configure:2586: result: i686-pc-linux-gnu
configure:2608: checking host system type
configure:2623: result: i686-pc-linux-gnu
configure:2657: checking for style of include used by make
configure:2685: result: GNU
configure:2755: checking for gcc
configure:2771: found /usr/bin/gcc
configure:2782: result: gcc
configure:3020: checking for C compiler version
configure:3027: gcc --version >&5
gcc (GCC) 4.2.3 (Ubuntu 4.2.3-1ubuntu2)
Copyright (C) 2007 Free Software Foundation, Inc.
This is free software; see the source for copying conditions.  There is NO
warranty; not even for MERCHANTABILITY or FITNESS FOR A PARTICULAR PURPOSE.

configure:3030: $? = 0
configure:3037: gcc -v >&5
Using built-in specs.
Target: i486-linux-gnu
Configured with: ../src/configure -v --enable-languages=c,c++,fortran,objc,obj-c++,treelang --prefix=/usr --enable-shared --with-system-zlib --libexecdir=/usr/lib --without-included-gettext --enable-threads=posix --enable-nls --with-gxx-include-dir=/usr/include/c++/4.2 --program-suffix=-4.2 --enable-clocale=gnu --enable-libstdcxx-debug --enable-objc-gc --enable-mpfr --enable-targets=all --enable-checking=release --build=i486-linux-gnu --host=i486-linux-gnu --target=i486-linux-gnu
Thread model: posix
gcc version 4.2.3 (Ubuntu 4.2.3-1ubuntu2)
configure:3040: $? = 0
configure:3047: gcc -V >&5
gcc: '-V' option must have argument
configure:3050: $? = 1
configure:3073: checking for C compiler default output file name
configure:3100: gcc -g -O0   conftest.c  >&5
configure:3103: $? = 0
configure:3141: result: a.out
configure:3158: checking whether the C compiler works
configure:3168: ./a.out
configure:3171: $? = 0
configure:3188: result: yes
configure:3195: checking whether we are cross compiling
configure:3197: result: no
configure:3200: checking for suffix of executables
configure:3207: gcc -o conftest -g -O0   conftest.c  >&5
configure:3210: $? = 0
configure:3234: result: 
configure:3240: checking for suffix of object files
configure:3266: gcc -c -g -O0  conftest.c >&5
configure:3269: $? = 0
configure:3292: result: o
configure:3296: checking whether we are using the GNU C compiler
configure:3325: gcc -c -g -O0  conftest.c >&5
configure:3331: $? = 0
configure:3348: result: yes
configure:3353: checking whether gcc accepts -g
configure:3383: gcc -c -g  conftest.c >&5
configure:3389: $? = 0
configure:3488: result: yes
configure:3505: checking for gcc option to accept ISO C89
configure:3579: gcc  -c -g -O0  conftest.c >&5
configure:3585: $? = 0
configure:3608: result: none needed
configure:3628: checking dependency style of gcc
configure:3719: result: gcc3
configure:3734: checking for a sed that does not truncate output
configure:3790: result: /bin/sed
configure:3793: checking for grep that handles long lines and -e
configure:3867: result: /bin/grep
configure:3872: checking for egrep
configure:3950: result: /bin/grep -E
configure:3966: checking for ld used by gcc
configure:4033: result: /usr/bin/ld
configure:4042: checking if the linker (/usr/bin/ld) is GNU ld
configure:4057: result: yes
configure:4062: checking for /usr/bin/ld option to reload object files
configure:4069: result: -r
configure:4087: checking for BSD-compatible nm
configure:4136: result: /usr/bin/nm -B
configure:4140: checking whether ln -s works
configure:4144: result: yes
configure:4151: checking how to recognize dependent libraries
configure:4337: result: pass_all
configure:4582: checking how to run the C preprocessor
configure:4622: gcc -E  conftest.c
configure:4628: $? = 0
configure:4659: gcc -E  conftest.c
conftest.c:10:28: error: ac_nonexistent.h: No such file or directory
configure:4665: $? = 1
configure: failed program was:
| /* confdefs.h.  */
| #define PACKAGE_NAME ""
| #define PACKAGE_TARNAME ""
| #define PACKAGE_VERSION ""
| #define PACKAGE_STRING ""
| #define PACKAGE_BUGREPORT ""
| #define PACKAGE "trollbot"
| #define VERSION "1.0.0"
| /* end confdefs.h.  */
| #include <ac_nonexistent.h>
configure:4698: result: gcc -E
configure:4727: gcc -E  conftest.c
configure:4733: $? = 0
configure:4764: gcc -E  conftest.c
conftest.c:10:28: error: ac_nonexistent.h: No such file or directory
configure:4770: $? = 1
configure: failed program was:
| /* confdefs.h.  */
| #define PACKAGE_NAME ""
| #define PACKAGE_TARNAME ""
| #define PACKAGE_VERSION ""
| #define PACKAGE_STRING ""
| #define PACKAGE_BUGREPORT ""
| #define PACKAGE "trollbot"
| #define VERSION "1.0.0"
| /* end confdefs.h.  */
| #include <ac_nonexistent.h>
configure:4808: checking for ANSI C header files
configure:4838: gcc -c -g -O0  conftest.c >&5
configure:4844: $? = 0
configure:4943: gcc -o conftest -g -O0   conftest.c  >&5
configure:4946: $? = 0
configure:4952: ./conftest
configure:4955: $? = 0
configure:4972: result: yes
configure:4996: checking for sys/types.h
configure:5017: gcc -c -g -O0  conftest.c >&5
configure:5023: $? = 0
configure:5039: result: yes
configure:4996: checking for sys/stat.h
configure:5017: gcc -c -g -O0  conftest.c >&5
configure:5023: $? = 0
configure:5039: result: yes
configure:4996: checking for stdlib.h
configure:5017: gcc -c -g -O0  conftest.c >&5
configure:5023: $? = 0
configure:5039: result: yes
configure:4996: checking for string.h
configure:5017: gcc -c -g -O0  conftest.c >&5
configure:5023: $? = 0
configure:5039: result: yes
configure:4996: checking for memory.h
configure:5017: gcc -c -g -O0  conftest.c >&5
configure:5023: $? = 0
configure:5039: result: yes
configure:4996: checking for strings.h
configure:5017: gcc -c -g -O0  conftest.c >&5
configure:5023: $? = 0
configure:5039: result: yes
configure:4996: checking for inttypes.h
configure:5017: gcc -c -g -O0  conftest.c >&5
configure:5023: $? = 0
configure:5039: result: yes
configure:4996: checking for stdint.h
configure:5017: gcc -c -g -O0  conftest.c >&5
configure:5023: $? = 0
configure:5039: result: yes
configure:4996: checking for unistd.h
configure:5017: gcc -c -g -O0  conftest.c >&5
configure:5023: $? = 0
configure:5039: result: yes
configure:5066: checking dlfcn.h usability
configure:5083: gcc -c -g -O0  conftest.c >&5
configure:5089: $? = 0
configure:5103: result: yes
configure:5107: checking dlfcn.h presence
configure:5122: gcc -E  conftest.c
configure:5128: $? = 0
configure:5142: result: yes
configure:5170: checking for dlfcn.h
configure:5178: result: yes
configure:5249: checking for g++
configure:5265: found /usr/bin/g++
configure:5276: result: g++
configure:5307: checking for C++ compiler version
configure:5314: g++ --version >&5
g++ (GCC) 4.2.3 (Ubuntu 4.2.3-1ubuntu2)
Copyright (C) 2007 Free Software Foundation, Inc.
This is free software; see the source for copying conditions.  There is NO
warranty; not even for MERCHANTABILITY or FITNESS FOR A PARTICULAR PURPOSE.

configure:5317: $? = 0
configure:5324: g++ -v >&5
Using built-in specs.
Target: i486-linux-gnu
Configured with: ../src/configure -v --enable-languages=c,c++,fortran,objc,obj-c++,treelang --prefix=/usr --enable-shared --with-system-zlib --libexecdir=/usr/lib --without-included-gettext --enable-threads=posix --enable-nls --with-gxx-include-dir=/usr/include/c++/4.2 --program-suffix=-4.2 --enable-clocale=gnu --enable-libstdcxx-debug --enable-objc-gc --enable-mpfr --enable-targets=all --enable-checking=release --build=i486-linux-gnu --host=i486-linux-gnu --target=i486-linux-gnu
Thread model: posix
gcc version 4.2.3 (Ubuntu 4.2.3-1ubuntu2)
configure:5327: $? = 0
configure:5334: g++ -V >&5
g++: '-V' option must have argument
configure:5337: $? = 1
configure:5340: checking whether we are using the GNU C++ compiler
configure:5369: g++ -c   conftest.cpp >&5
configure:5375: $? = 0
configure:5392: result: yes
configure:5397: checking whether g++ accepts -g
configure:5427: g++ -c -g  conftest.cpp >&5
configure:5433: $? = 0
configure:5532: result: yes
configure:5557: checking dependency style of g++
configure:5648: result: gcc3
configure:5673: checking how to run the C++ preprocessor
configure:5709: g++ -E  conftest.cpp
configure:5715: $? = 0
configure:5746: g++ -E  conftest.cpp
conftest.cpp:21:28: error: ac_nonexistent.h: No such file or directory
configure:5752: $? = 1
configure: failed program was:
| /* confdefs.h.  */
| #define PACKAGE_NAME ""
| #define PACKAGE_TARNAME ""
| #define PACKAGE_VERSION ""
| #define PACKAGE_STRING ""
| #define PACKAGE_BUGREPORT ""
| #define PACKAGE "trollbot"
| #define VERSION "1.0.0"
| #define STDC_HEADERS 1
| #define HAVE_SYS_TYPES_H 1
| #define HAVE_SYS_STAT_H 1
| #define HAVE_STDLIB_H 1
| #define HAVE_STRING_H 1
| #define HAVE_MEMORY_H 1
| #define HAVE_STRINGS_H 1
| #define HAVE_INTTYPES_H 1
| #define HAVE_STDINT_H 1
| #define HAVE_UNISTD_H 1
| #define HAVE_DLFCN_H 1
| /* end confdefs.h.  */
| #include <ac_nonexistent.h>
configure:5785: result: g++ -E
configure:5814: g++ -E  conftest.cpp
configure:5820: $? = 0
configure:5851: g++ -E  conftest.cpp
conftest.cpp:21:28: error: ac_nonexistent.h: No such file or directory
configure:5857: $? = 1
configure: failed program was:
| /* confdefs.h.  */
| #define PACKAGE_NAME ""
| #define PACKAGE_TARNAME ""
| #define PACKAGE_VERSION ""
| #define PACKAGE_STRING ""
| #define PACKAGE_BUGREPORT ""
| #define PACKAGE "trollbot"
| #define VERSION "1.0.0"
| #define STDC_HEADERS 1
| #define HAVE_SYS_TYPES_H 1
| #define HAVE_SYS_STAT_H 1
| #define HAVE_STDLIB_H 1
| #define HAVE_STRING_H 1
| #define HAVE_MEMORY_H 1
| #define HAVE_STRINGS_H 1
| #define HAVE_INTTYPES_H 1
| #define HAVE_STDINT_H 1
| #define HAVE_UNISTD_H 1
| #define HAVE_DLFCN_H 1
| /* end confdefs.h.  */
| #include <ac_nonexistent.h>
configure:5950: checking for g77
configure:5980: result: no
configure:5950: checking for xlf
configure:5980: result: no
configure:5950: checking for f77
configure:5980: result: no
configure:5950: checking for frt
configure:5980: result: no
configure:5950: checking for pgf77
configure:5980: result: no
configure:5950: checking for cf77
configure:5980: result: no
configure:5950: checking for fort77
configure:5980: result: no
configure:5950: checking for fl32
configure:5980: result: no
configure:5950: checking for af77
configure:5980: result: no
configure:5950: checking for xlf90
configure:5980: result: no
configure:5950: checking for f90
configure:5980: result: no
configure:5950: checking for pgf90
configure:5980: result: no
configure:5950: checking for pghpf
configure:5980: result: no
configure:5950: checking for epcf90
configure:5980: result: no
configure:5950: checking for gfortran
configure:5980: result: no
configure:5950: checking for g95
configure:5980: result: no
configure:5950: checking for xlf95
configure:5980: result: no
configure:5950: checking for f95
configure:5980: result: no
configure:5950: checking for fort
configure:5980: result: no
configure:5950: checking for ifort
configure:5980: result: no
configure:5950: checking for ifc
configure:5980: result: no
configure:5950: checking for efc
configure:5980: result: no
configure:5950: checking for pgf95
configure:5980: result: no
configure:5950: checking for lf95
configure:5980: result: no
configure:5950: checking for ftn
configure:5980: result: no
configure:6007: checking for Fortran 77 compiler version
configure:6014:  --version >&5
./configure: line 6015: --version: command not found
configure:6017: $? = 127
configure:6024:  -v >&5
./configure: line 6025: -v: command not found
configure:6027: $? = 127
configure:6034:  -V >&5
./configure: line 6035: -V: command not found
configure:6037: $? = 127
configure:6045: checking whether we are using the GNU Fortran 77 compiler
configure:6064:  -c  conftest.F >&5
./configure: line 6065: -c: command not found
configure:6070: $? = 127
configure: failed program was:
|       program main
| #ifndef __GNUC__
|        choke me
| #endif
| 
|       end
configure:6087: result: no
configure:6093: checking whether  accepts -g
configure:6110:  -c -g conftest.f >&5
./configure: line 6111: -c: command not found
configure:6116: $? = 127
configure: failed program was:
|       program main
| 
|       end
configure:6132: result: no
configure:6161: checking the maximum length of command line arguments
configure:6273: result: 98304
configure:6285: checking command to parse /usr/bin/nm -B output from gcc object
configure:6390: gcc -c -g -O0  conftest.c >&5
configure:6393: $? = 0
configure:6397: /usr/bin/nm -B conftest.o \| sed -n -e 's/^.*[ 	]\([ABCDGIRSTW][ABCDGIRSTW]*\)[ 	][ 	]*\([_A-Za-z][_A-Za-z0-9]*\)$/\1 \2 \2/p' \> conftest.nm
configure:6400: $? = 0
configure:6452: gcc -o conftest -g -O0   conftest.c conftstm.o >&5
configure:6455: $? = 0
configure:6493: result: ok
configure:6497: checking for objdir
configure:6512: result: .libs
configure:6604: checking for ar
configure:6620: found /usr/bin/ar
configure:6631: result: ar
configure:6700: checking for ranlib
configure:6716: found /usr/bin/ranlib
configure:6727: result: ranlib
configure:6796: checking for strip
configure:6812: found /usr/bin/strip
configure:6823: result: strip
configure:7421: checking if gcc supports -fno-rtti -fno-exceptions
configure:7439: gcc -c -g -O0  -fno-rtti -fno-exceptions conftest.c >&5
cc1: warning: command line option "-fno-rtti" is valid for C++/ObjC++ but not for C
configure:7443: $? = 0
configure:7456: result: no
configure:7471: checking for gcc option to produce PIC
configure:7703: result: -fPIC
configure:7711: checking if gcc PIC flag -fPIC works
configure:7729: gcc -c -g -O0  -fPIC -DPIC conftest.c >&5
configure:7733: $? = 0
configure:7746: result: yes
configure:7774: checking if gcc static flag -static works
configure:7802: result: yes
configure:7812: checking if gcc supports -c -o file.o
configure:7833: gcc -c -g -O0  -o out/conftest2.o conftest.c >&5
configure:7837: $? = 0
configure:7859: result: yes
configure:7885: checking whether the gcc linker (/usr/bin/ld) supports shared libraries
configure:8866: result: yes
configure:8887: checking whether -lc should be explicitly linked in
configure:8892: gcc -c -g -O0  conftest.c >&5
configure:8895: $? = 0
configure:8910: gcc -shared conftest.o  -v -Wl,-soname -Wl,conftest -o conftest 2\>\&1 \| grep  -lc  \>/dev/null 2\>\&1
configure:8913: $? = 0
configure:8925: result: no
configure:8933: checking dynamic linker characteristics
configure:9547: result: GNU/Linux ld.so
configure:9571: checking how to hardcode library paths into programs
configure:9596: result: immediate
configure:9610: checking whether stripping libraries is possible
configure:9615: result: yes
configure:9739: checking for shl_load
configure:9795: gcc -o conftest -g -O0   conftest.c  >&5
/tmp/ccn18hep.o: In function `main':
/home/comcor/src/c/trollbot/conftest.c:55: undefined reference to `shl_load'
collect2: ld returned 1 exit status
configure:9801: $? = 1
configure: failed program was:
| /* confdefs.h.  */
| #define PACKAGE_NAME ""
| #define PACKAGE_TARNAME ""
| #define PACKAGE_VERSION ""
| #define PACKAGE_STRING ""
| #define PACKAGE_BUGREPORT ""
| #define PACKAGE "trollbot"
| #define VERSION "1.0.0"
| #define STDC_HEADERS 1
| #define HAVE_SYS_TYPES_H 1
| #define HAVE_SYS_STAT_H 1
| #define HAVE_STDLIB_H 1
| #define HAVE_STRING_H 1
| #define HAVE_MEMORY_H 1
| #define HAVE_STRINGS_H 1
| #define HAVE_INTTYPES_H 1
| #define HAVE_STDINT_H 1
| #define HAVE_UNISTD_H 1
| #define HAVE_DLFCN_H 1
| /* end confdefs.h.  */
| /* Define shl_load to an innocuous variant, in case <limits.h> declares shl_load.
|    For example, HP-UX 11i <limits.h> declares gettimeofday.  */
| #define shl_load innocuous_shl_load
| 
| /* System header to define __stub macros and hopefully few prototypes,
|     which can conflict with char shl_load (); below.
|     Prefer <limits.h> to <assert.h> if __STDC__ is defined, since
|     <limits.h> exists even on freestanding compilers.  */
| 
| #ifdef __STDC__
| # include <limits.h>
| #else
| # include <assert.h>
| #endif
| 
| #undef shl_load
| 
| /* Override any GCC internal prototype to avoid an error.
|    Use char because int might match the return type of a GCC
|    builtin and then its argument prototype would still apply.  */
| #ifdef __cplusplus
| extern "C"
| #endif
| char shl_load ();
| /* The GNU C library defines this for functions which it implements
|     to always fail with ENOSYS.  Some functions are actually named
|     something starting with __ and the normal name is an alias.  */
| #if defined __stub_shl_load || defined __stub___shl_load
| choke me
| #endif
| 
| int
| main ()
| {
| return shl_load ();
|   ;
|   return 0;
| }
configure:9818: result: no
configure:9823: checking for shl_load in -ldld
configure:9858: gcc -o conftest -g -O0   conftest.c -ldld   >&5
/usr/bin/ld: cannot find -ldld
collect2: ld returned 1 exit status
configure:9864: $? = 1
configure: failed program was:
| /* confdefs.h.  */
| #define PACKAGE_NAME ""
| #define PACKAGE_TARNAME ""
| #define PACKAGE_VERSION ""
| #define PACKAGE_STRING ""
| #define PACKAGE_BUGREPORT ""
| #define PACKAGE "trollbot"
| #define VERSION "1.0.0"
| #define STDC_HEADERS 1
| #define HAVE_SYS_TYPES_H 1
| #define HAVE_SYS_STAT_H 1
| #define HAVE_STDLIB_H 1
| #define HAVE_STRING_H 1
| #define HAVE_MEMORY_H 1
| #define HAVE_STRINGS_H 1
| #define HAVE_INTTYPES_H 1
| #define HAVE_STDINT_H 1
| #define HAVE_UNISTD_H 1
| #define HAVE_DLFCN_H 1
| /* end confdefs.h.  */
| 
| /* Override any GCC internal prototype to avoid an error.
|    Use char because int might match the return type of a GCC
|    builtin and then its argument prototype would still apply.  */
| #ifdef __cplusplus
| extern "C"
| #endif
| char shl_load ();
| int
| main ()
| {
| return shl_load ();
|   ;
|   return 0;
| }
configure:9882: result: no
configure:9887: checking for dlopen
configure:9943: gcc -o conftest -g -O0   conftest.c  >&5
/tmp/cc8HEbT4.o: In function `main':
/home/comcor/src/c/trollbot/conftest.c:55: undefined reference to `dlopen'
collect2: ld returned 1 exit status
configure:9949: $? = 1
configure: failed program was:
| /* confdefs.h.  */
| #define PACKAGE_NAME ""
| #define PACKAGE_TARNAME ""
| #define PACKAGE_VERSION ""
| #define PACKAGE_STRING ""
| #define PACKAGE_BUGREPORT ""
| #define PACKAGE "trollbot"
| #define VERSION "1.0.0"
| #define STDC_HEADERS 1
| #define HAVE_SYS_TYPES_H 1
| #define HAVE_SYS_STAT_H 1
| #define HAVE_STDLIB_H 1
| #define HAVE_STRING_H 1
| #define HAVE_MEMORY_H 1
| #define HAVE_STRINGS_H 1
| #define HAVE_INTTYPES_H 1
| #define HAVE_STDINT_H 1
| #define HAVE_UNISTD_H 1
| #define HAVE_DLFCN_H 1
| /* end confdefs.h.  */
| /* Define dlopen to an innocuous variant, in case <limits.h> declares dlopen.
|    For example, HP-UX 11i <limits.h> declares gettimeofday.  */
| #define dlopen innocuous_dlopen
| 
| /* System header to define __stub macros and hopefully few prototypes,
|     which can conflict with char dlopen (); below.
|     Prefer <limits.h> to <assert.h> if __STDC__ is defined, since
|     <limits.h> exists even on freestanding compilers.  */
| 
| #ifdef __STDC__
| # include <limits.h>
| #else
| # include <assert.h>
| #endif
| 
| #undef dlopen
| 
| /* Override any GCC internal prototype to avoid an error.
|    Use char because int might match the return type of a GCC
|    builtin and then its argument prototype would still apply.  */
| #ifdef __cplusplus
| extern "C"
| #endif
| char dlopen ();
| /* The GNU C library defines this for functions which it implements
|     to always fail with ENOSYS.  Some functions are actually named
|     something starting with __ and the normal name is an alias.  */
| #if defined __stub_dlopen || defined __stub___dlopen
| choke me
| #endif
| 
| int
| main ()
| {
| return dlopen ();
|   ;
|   return 0;
| }
configure:9966: result: no
configure:9971: checking for dlopen in -ldl
configure:10006: gcc -o conftest -g -O0   conftest.c -ldl   >&5
configure:10012: $? = 0
configure:10030: result: yes
configure:10199: checking whether a program can dlopen itself
configure:10273: gcc -o conftest -g -O0  -DHAVE_DLFCN_H  -Wl,--export-dynamic conftest.c -ldl  >&5
configure: In function 'main':
configure:10269: warning: incompatible implicit declaration of built-in function 'exit'
configure:10276: $? = 0
configure:10294: result: yes
configure:10299: checking whether a statically linked program can dlopen itself
configure:10373: gcc -o conftest -g -O0  -DHAVE_DLFCN_H  -Wl,--export-dynamic -static conftest.c -ldl  >&5
configure: In function 'main':
configure:10369: warning: incompatible implicit declaration of built-in function 'exit'
/tmp/ccaZI0uF.o: In function `main':
/home/comcor/src/c/trollbot/configure:10357: warning: Using 'dlopen' in statically linked applications requires at runtime the shared libraries from the glibc version used for linking
configure:10376: $? = 0
/lib/: cannot read file data: Is a directory
configure:10394: result: no
configure:10417: checking if libtool supports shared libraries
configure:10419: result: yes
configure:10422: checking whether to build shared libraries
configure:10443: result: yes
configure:10446: checking whether to build static libraries
configure:10450: result: yes
configure:10544: creating libtool
configure:11137: checking for ld used by g++
configure:11204: result: /usr/bin/ld
configure:11213: checking if the linker (/usr/bin/ld) is GNU ld
configure:11228: result: yes
configure:11279: checking whether the g++ linker (/usr/bin/ld) supports shared libraries
configure:12225: result: yes
configure:12242: g++ -c -g -O2  conftest.cpp >&5
configure:12245: $? = 0
configure:12401: checking for g++ option to produce PIC
configure:12685: result: -fPIC
configure:12693: checking if g++ PIC flag -fPIC works
configure:12711: g++ -c -g -O2  -fPIC -DPIC conftest.cpp >&5
configure:12715: $? = 0
configure:12728: result: yes
configure:12756: checking if g++ static flag -static works
configure:12784: result: yes
configure:12794: checking if g++ supports -c -o file.o
configure:12815: g++ -c -g -O2  -o out/conftest2.o conftest.cpp >&5
configure:12819: $? = 0
configure:12841: result: yes
configure:12867: checking whether the g++ linker (/usr/bin/ld) supports shared libraries
configure:12896: result: yes
configure:12963: checking dynamic linker characteristics
configure:13525: result: GNU/Linux ld.so
configure:13549: checking how to hardcode library paths into programs
configure:13574: result: immediate
configure:19825: checking whether to enable maintainer-specific portions of Makefiles
configure:19834: result: no
configure:19896: checking for gcc
configure:19923: result: gcc
configure:20161: checking for C compiler version
configure:20168: gcc --version >&5
gcc (GCC) 4.2.3 (Ubuntu 4.2.3-1ubuntu2)
Copyright (C) 2007 Free Software Foundation, Inc.
This is free software; see the source for copying conditions.  There is NO
warranty; not even for MERCHANTABILITY or FITNESS FOR A PARTICULAR PURPOSE.

configure:20171: $? = 0
configure:20178: gcc -v >&5
Using built-in specs.
Target: i486-linux-gnu
Configured with: ../src/configure -v --enable-languages=c,c++,fortran,objc,obj-c++,treelang --prefix=/usr --enable-shared --with-system-zlib --libexecdir=/usr/lib --without-included-gettext --enable-threads=posix --enable-nls --with-gxx-include-dir=/usr/include/c++/4.2 --program-suffix=-4.2 --enable-clocale=gnu --enable-libstdcxx-debug --enable-objc-gc --enable-mpfr --enable-targets=all --enable-checking=release --build=i486-linux-gnu --host=i486-linux-gnu --target=i486-linux-gnu
Thread model: posix
gcc version 4.2.3 (Ubuntu 4.2.3-1ubuntu2)
configure:20181: $? = 0
configure:20188: gcc -V >&5
gcc: '-V' option must have argument
configure:20191: $? = 1
configure:20194: checking whether we are using the GNU C compiler
configure:20246: result: yes
configure:20251: checking whether gcc accepts -g
configure:20386: result: yes
configure:20403: checking for gcc option to accept ISO C89
configure:20506: result: none needed
configure:20526: checking dependency style of gcc
configure:20617: result: gcc3
configure:20633: checking whether gcc and cc understand -c and -o together
configure:20668: gcc -c conftest.c -o conftest2.o >&5
configure:20671: $? = 0
configure:20677: gcc -c conftest.c -o conftest2.o >&5
configure:20680: $? = 0
configure:20691: cc -c conftest.c >&5
configure:20694: $? = 0
configure:20702: cc -c conftest.c -o conftest2.o >&5
configure:20705: $? = 0
configure:20711: cc -c conftest.c -o conftest2.o >&5
configure:20714: $? = 0
configure:20732: result: yes
configure:20766: checking for an ANSI C-conforming const
configure:20841: gcc -c -g -O0  conftest.c >&5
configure:20847: $? = 0
configure:20862: result: yes
configure:20873: checking whether struct tm is in sys/time.h or time.h
configure:20903: gcc -c -g -O0  conftest.c >&5
configure:20909: $? = 0
configure:20924: result: time.h
configure:20950: checking time.h usability
configure:20967: gcc -c -g -O0  conftest.c >&5
configure:20973: $? = 0
configure:20987: result: yes
configure:20991: checking time.h presence
configure:21006: gcc -E  conftest.c
configure:21012: $? = 0
configure:21026: result: yes
configure:21054: checking for time.h
configure:21062: result: yes
configure:21090: checking sys/time.h usability
configure:21107: gcc -c -g -O0  conftest.c >&5
configure:21113: $? = 0
configure:21127: result: yes
configure:21131: checking sys/time.h presence
configure:21146: gcc -E  conftest.c
configure:21152: $? = 0
configure:21166: result: yes
configure:21194: checking for sys/time.h
configure:21202: result: yes
configure:21216: checking for pid_t
configure:21246: gcc -c -g -O0  conftest.c >&5
configure:21252: $? = 0
configure:21267: result: yes
configure:21294: checking vfork.h usability
configure:21311: gcc -c -g -O0  conftest.c >&5
conftest.c:56:19: error: vfork.h: No such file or directory
configure:21317: $? = 1
configure: failed program was:
| /* confdefs.h.  */
| #define PACKAGE_NAME ""
| #define PACKAGE_TARNAME ""
| #define PACKAGE_VERSION ""
| #define PACKAGE_STRING ""
| #define PACKAGE_BUGREPORT ""
| #define PACKAGE "trollbot"
| #define VERSION "1.0.0"
| #define STDC_HEADERS 1
| #define HAVE_SYS_TYPES_H 1
| #define HAVE_SYS_STAT_H 1
| #define HAVE_STDLIB_H 1
| #define HAVE_STRING_H 1
| #define HAVE_MEMORY_H 1
| #define HAVE_STRINGS_H 1
| #define HAVE_INTTYPES_H 1
| #define HAVE_STDINT_H 1
| #define HAVE_UNISTD_H 1
| #define HAVE_DLFCN_H 1
| #define HAVE_TIME_H 1
| #define HAVE_SYS_TIME_H 1
| /* end confdefs.h.  */
| #include <stdio.h>
| #ifdef HAVE_SYS_TYPES_H
| # include <sys/types.h>
| #endif
| #ifdef HAVE_SYS_STAT_H
| # include <sys/stat.h>
| #endif
| #ifdef STDC_HEADERS
| # include <stdlib.h>
| # include <stddef.h>
| #else
| # ifdef HAVE_STDLIB_H
| #  include <stdlib.h>
| # endif
| #endif
| #ifdef HAVE_STRING_H
| # if !defined STDC_HEADERS && defined HAVE_MEMORY_H
| #  include <memory.h>
| # endif
| # include <string.h>
| #endif
| #ifdef HAVE_STRINGS_H
| # include <strings.h>
| #endif
| #ifdef HAVE_INTTYPES_H
| # include <inttypes.h>
| #endif
| #ifdef HAVE_STDINT_H
| # include <stdint.h>
| #endif
| #ifdef HAVE_UNISTD_H
| # include <unistd.h>
| #endif
| #include <vfork.h>
configure:21331: result: no
configure:21335: checking vfork.h presence
configure:21350: gcc -E  conftest.c
conftest.c:23:19: error: vfork.h: No such file or directory
configure:21356: $? = 1
configure: failed program was:
| /* confdefs.h.  */
| #define PACKAGE_NAME ""
| #define PACKAGE_TARNAME ""
| #define PACKAGE_VERSION ""
| #define PACKAGE_STRING ""
| #define PACKAGE_BUGREPORT ""
| #define PACKAGE "trollbot"
| #define VERSION "1.0.0"
| #define STDC_HEADERS 1
| #define HAVE_SYS_TYPES_H 1
| #define HAVE_SYS_STAT_H 1
| #define HAVE_STDLIB_H 1
| #define HAVE_STRING_H 1
| #define HAVE_MEMORY_H 1
| #define HAVE_STRINGS_H 1
| #define HAVE_INTTYPES_H 1
| #define HAVE_STDINT_H 1
| #define HAVE_UNISTD_H 1
| #define HAVE_DLFCN_H 1
| #define HAVE_TIME_H 1
| #define HAVE_SYS_TIME_H 1
| /* end confdefs.h.  */
| #include <vfork.h>
configure:21370: result: no
configure:21398: checking for vfork.h
configure:21406: result: no
configure:21424: checking for fork
configure:21480: gcc -o conftest -g -O0   conftest.c  >&5
conftest.c:46: warning: conflicting types for built-in function 'fork'
configure:21486: $? = 0
configure:21504: result: yes
configure:21424: checking for vfork
configure:21480: gcc -o conftest -g -O0   conftest.c  >&5
configure:21486: $? = 0
configure:21504: result: yes
configure:21515: checking for working fork
configure:21547: gcc -o conftest -g -O0   conftest.c  >&5
configure:21550: $? = 0
configure:21556: ./conftest
configure:21559: $? = 0
configure:21575: result: yes
configure:21596: checking for working vfork
configure:21734: result: yes
configure:21766: checking for pid_t
configure:21817: result: yes
configure:21846: checking for python
configure:21864: found /usr/bin/python
configure:21876: result: /usr/bin/python
configure:21894: checking for a version of Python >= '2.1.0'
configure:21929: result: yes
configure:21966: checking for the distutils Python package
configure:21970: result: yes
configure:21988: checking for Python include path
configure:21998: result: -I/usr/include/python2.5
configure:22005: checking for Python library path
configure:22027: result: -L/usr/lib/python2.5 -lpython2.5
configure:22034: checking for Python site-packages path
configure:22040: result: /usr/lib/python2.5/site-packages
configure:22047: checking python extra libraries
configure:22054: result:  -lpthread -ldl  -lutil
configure:22061: checking python extra linking flags
configure:22068: result: -Xlinker -export-dynamic -Wl,-O1 -Wl,-Bsymbolic-functions
configure:22075: checking consistency of all components of python development environment
configure:22111: gcc -o conftest -g -O0  -I/usr/include/python2.5  conftest.c  -L/usr/lib/python2.5 -lpython2.5 -Wl,--unresolved-symbols=ignore-all >&5
configure:22117: $? = 0
configure:22134: result: yes
configure:22250: checking for pkg-config
configure:22268: found /usr/bin/pkg-config
configure:22280: result: /usr/bin/pkg-config
configure:22309: checking pkg-config is at least version 0.9.0
configure:22312: result: yes
configure:22333: checking for JS
configure:22341: $PKG_CONFIG --exists --print-errors "xulrunner-js"
configure:22344: $? = 0
configure:22359: $PKG_CONFIG --exists --print-errors "xulrunner-js"
configure:22362: $? = 0
configure:22398: result: yes
configure:22479: checking for tclsh8.4
configure:22497: found /usr/bin/tclsh8.4
configure:22509: result: /usr/bin/tclsh8.4
configure:22525: checking where Tcl says it lives
configure:22528: result: /usr/share/tcltk/tcl8.4
configure:22540: checking for tclConfig.sh
configure:22559: result: /usr/share/tcltk/tcl8.4/
configure:22564: checking Tcl configuration on what Tcl needs to compile
configure:22567: result: ok
configure:22578: checking where Tcl includes are
configure:22593: result: -I/usr/include/tcl8.4
configure:22665: checking if there's a valid user specified php-config
configure:22673: result: Not specified, checking elsewhere
configure:22677: checking for php-config
configure:22695: found /usr/bin/php-config
configure:22707: result: /usr/bin/php-config
configure:22718: checking for CFLAGS to use with PHP
configure:22727: result: -I/usr/include/php5 -I/usr/include/php5/main -I/usr/include/php5/TSRM -I/usr/include/php5/Zend -I/usr/include/php5/ext -I/usr/include/php5/ext/date/lib -D_LARGEFILE_SOURCE -D_FILE_OFFSET_BITS=64
configure:22730: checking whether our test PHP program compiles
configure:22766: gcc -c -g -O0  -I/usr/include/php5 -I/usr/include/php5/main -I/usr/include/php5/TSRM -I/usr/include/php5/Zend -I/usr/include/php5/ext -I/usr/include/php5/ext/date/lib -D_LARGEFILE_SOURCE -D_FILE_OFFSET_BITS=64 conftest.c >&5
configure:22772: $? = 0
configure:22792: result: Wonderbar
configure:22796: checking for LDFLAGS to use with PHP5
configure:22809: result: -lcrypt -lz -lcrypt -lssl -ldb-4.6 -lbz2 -lz -lpcre -lssl -lresolv -lm -ldl -lnsl -lxml2 -lgssapi_krb5 -lkrb5 -lk5crypto -lcom_err -lxml2 -lxml2 -lxml2 -lcrypt -lxml2 -lxml2 -lxml2 -lxml2 -lcrypt  -lphp5 -Wl,--unresolved-symbols=ignore-all
configure:22812: checking whether our test PHP5 program can link
configure:22847: gcc -o conftest -g -O0  -I/usr/include/php5 -I/usr/include/php5/main -I/usr/include/php5/TSRM -I/usr/include/php5/Zend -I/usr/include/php5/ext -I/usr/include/php5/ext/date/lib -D_LARGEFILE_SOURCE -D_FILE_OFFSET_BITS=64  conftest.c  -lcrypt -lz -lcrypt -lssl -ldb-4.6 -lbz2 -lz -lpcre -lssl -lresolv -lm -ldl -lnsl -lxml2 -lgssapi_krb5 -lkrb5 -lk5crypto -lcom_err -lxml2 -lxml2 -lxml2 -lcrypt -lxml2 -lxml2 -lxml2 -lxml2 -lcrypt  -lphp5 -Wl,--unresolved-symbols=ignore-all >&5
/usr/bin/ld: cannot find -lbz2
collect2: ld returned 1 exit status
configure:22853: $? = 1
configure: failed program was:
| /* confdefs.h.  */
| #define PACKAGE_NAME ""
| #define PACKAGE_TARNAME ""
| #define PACKAGE_VERSION ""
| #define PACKAGE_STRING ""
| #define PACKAGE_BUGREPORT ""
| #define PACKAGE "trollbot"
| #define VERSION "1.0.0"
| #define STDC_HEADERS 1
| #define HAVE_SYS_TYPES_H 1
| #define HAVE_SYS_STAT_H 1
| #define HAVE_STDLIB_H 1
| #define HAVE_STRING_H 1
| #define HAVE_MEMORY_H 1
| #define HAVE_STRINGS_H 1
| #define HAVE_INTTYPES_H 1
| #define HAVE_STDINT_H 1
| #define HAVE_UNISTD_H 1
| #define HAVE_DLFCN_H 1
| #define HAVE_TIME_H 1
| #define HAVE_SYS_TIME_H 1
| #define HAVE_FORK 1
| #define HAVE_VFORK 1
| #define HAVE_WORKING_VFORK 1
| #define HAVE_WORKING_FORK 1
| #define HAVE_PYTHON 1
| #define HAVE_PYTHON 1
| #define HAVE_JS 1
| #define HAVE_TCL 1
| /* end confdefs.h.  */
| #include <main/php.h>
|                        #include <main/SAPI.h>
|                        #include <main/php_main.h>
|                        #include <main/php_variables.h>
|                        #include <main/php_ini.h>
|                        #include <zend_ini.h>
| 
| int
| main ()
| {
| 
|                          zval *test;
| 
|   ;
|   return 0;
| }
configure:22890: result: Error, cannot use PHP5
configure:22896: checking for LDFLAGS to use with PHP4
configure:22909: result: -lcrypt -lz -lcrypt -lssl -ldb-4.6 -lbz2 -lz -lpcre -lssl -lresolv -lm -ldl -lnsl -lxml2 -lgssapi_krb5 -lkrb5 -lk5crypto -lcom_err -lxml2 -lxml2 -lxml2 -lcrypt -lxml2 -lxml2 -lxml2 -lxml2 -lcrypt  -lphp4 -Wl,--unresolved-symbols=ignore-all
configure:22912: checking whether our test PHP4 program can link
configure:22947: gcc -o conftest -g -O0  -I/usr/include/php5 -I/usr/include/php5/main -I/usr/include/php5/TSRM -I/usr/include/php5/Zend -I/usr/include/php5/ext -I/usr/include/php5/ext/date/lib -D_LARGEFILE_SOURCE -D_FILE_OFFSET_BITS=64  conftest.c  -lcrypt -lz -lcrypt -lssl -ldb-4.6 -lbz2 -lz -lpcre -lssl -lresolv -lm -ldl -lnsl -lxml2 -lgssapi_krb5 -lkrb5 -lk5crypto -lcom_err -lxml2 -lxml2 -lxml2 -lcrypt -lxml2 -lxml2 -lxml2 -lxml2 -lcrypt  -lphp4 -Wl,--unresolved-symbols=ignore-all >&5
/usr/bin/ld: cannot find -lbz2
collect2: ld returned 1 exit status
configure:22953: $? = 1
configure: failed program was:
| /* confdefs.h.  */
| #define PACKAGE_NAME ""
| #define PACKAGE_TARNAME ""
| #define PACKAGE_VERSION ""
| #define PACKAGE_STRING ""
| #define PACKAGE_BUGREPORT ""
| #define PACKAGE "trollbot"
| #define VERSION "1.0.0"
| #define STDC_HEADERS 1
| #define HAVE_SYS_TYPES_H 1
| #define HAVE_SYS_STAT_H 1
| #define HAVE_STDLIB_H 1
| #define HAVE_STRING_H 1
| #define HAVE_MEMORY_H 1
| #define HAVE_STRINGS_H 1
| #define HAVE_INTTYPES_H 1
| #define HAVE_STDINT_H 1
| #define HAVE_UNISTD_H 1
| #define HAVE_DLFCN_H 1
| #define HAVE_TIME_H 1
| #define HAVE_SYS_TIME_H 1
| #define HAVE_FORK 1
| #define HAVE_VFORK 1
| #define HAVE_WORKING_VFORK 1
| #define HAVE_WORKING_FORK 1
| #define HAVE_PYTHON 1
| #define HAVE_PYTHON 1
| #define HAVE_JS 1
| #define HAVE_TCL 1
| /* end confdefs.h.  */
| #include <main/php.h>
|                        #include <main/SAPI.h>
|                        #include <main/php_main.h>
|                        #include <main/php_variables.h>
|                        #include <main/php_ini.h>
|                        #include <zend_ini.h>
| 
| int
| main ()
| {
| 
|                          zval *test;
| 
|   ;
|   return 0;
| }
configure:22990: result: Error, cannot use PHP4
configure:23031: checking For perl binary
configure:23035: checking for perl
configure:23053: found /usr/bin/perl
configure:23065: result: /usr/bin/perl
configure:23083: checking whether we can link with perl
configure:23111: gcc -o conftest -g -O0   -D_REENTRANT -D_GNU_SOURCE -DTHREADS_HAVE_PIDS -DDEBIAN -fno-strict-aliasing -pipe -I/usr/local/include -D_LARGEFILE_SOURCE -D_FILE_OFFSET_BITS=64  -I/usr/lib/perl/5.8/CORE   conftest.c  -Wl,-E  -L/usr/local/lib /usr/lib/perl/5.8/auto/DynaLoader/DynaLoader.a -L/usr/lib/perl/5.8/CORE -lperl -ldl -lm -lpthread -lc -lcrypt >&5
configure:23117: $? = 0
configure:23141: result: Yes
configure:23179: checking whether make sets $(MAKE)
configure:23200: result: yes
configure:23210: checking for ANSI C header files
configure:23374: result: yes
configure:23561: creating ./config.status

## ---------------------- ##
## Running config.status. ##
## ---------------------- ##

This file was extended by config.status, which was
generated by GNU Autoconf 2.61.  Invocation command line was

  CONFIG_FILES    = 
  CONFIG_HEADERS  = 
  CONFIG_LINKS    = 
  CONFIG_COMMANDS = 
  $ ./config.status 

on bishop

config.status:712: creating Makefile
config.status:712: creating src/Makefile
config.status:712: creating src/modules/Makefile
config.status:712: creating src/modules/crypto/Makefile
config.status:712: creating doc_dist/Makefile
config.status:712: creating scripts_dist/Makefile
config.status:712: creating log_dist/Makefile
config.status:712: creating modules_dist/Makefile
config.status:712: creating text_dist/Makefile
config.status:712: creating conf_dist/Makefile
config.status:712: creating db_dist/Makefile
config.status:712: creating config.h
config.status:950: config.h is unchanged
config.status:997: executing depfiles commands
configure:24948: === configuring in libltdl (/home/comcor/src/c/trollbot/libltdl)
configure:25051: running /bin/bash ./configure '--prefix=/home/comcor/trollbot'  '--with-python' '--with-perl' '--with-php=5' 'CFLAGS=-g -O0' '--enable-ltdl-convenience' --cache-file=/dev/null --srcdir=.

## ---------------- ##
## Cache variables. ##
## ---------------- ##

ac_cv_build=i686-pc-linux-gnu
ac_cv_c_compiler_gnu=yes
ac_cv_c_const=yes
ac_cv_cxx_compiler_gnu=yes
ac_cv_env_CCC_set=
ac_cv_env_CCC_value=
ac_cv_env_CC_set=
ac_cv_env_CC_value=
ac_cv_env_CFLAGS_set=set
ac_cv_env_CFLAGS_value='-g -O0'
ac_cv_env_CPPFLAGS_set=
ac_cv_env_CPPFLAGS_value=
ac_cv_env_CPP_set=
ac_cv_env_CPP_value=
ac_cv_env_CXXCPP_set=
ac_cv_env_CXXCPP_value=
ac_cv_env_CXXFLAGS_set=
ac_cv_env_CXXFLAGS_value=
ac_cv_env_CXX_set=
ac_cv_env_CXX_value=
ac_cv_env_F77_set=
ac_cv_env_F77_value=
ac_cv_env_FFLAGS_set=
ac_cv_env_FFLAGS_value=
ac_cv_env_JS_CFLAGS_set=
ac_cv_env_JS_CFLAGS_value=
ac_cv_env_JS_LIBS_set=
ac_cv_env_JS_LIBS_value=
ac_cv_env_LDFLAGS_set=
ac_cv_env_LDFLAGS_value=
ac_cv_env_LIBS_set=
ac_cv_env_LIBS_value=
ac_cv_env_PKG_CONFIG_set=
ac_cv_env_PKG_CONFIG_value=
ac_cv_env_PYTHON_VERSION_set=
ac_cv_env_PYTHON_VERSION_value=
ac_cv_env_build_alias_set=
ac_cv_env_build_alias_value=
ac_cv_env_host_alias_set=
ac_cv_env_host_alias_value=
ac_cv_env_target_alias_set=
ac_cv_env_target_alias_value=
ac_cv_f77_compiler_gnu=no
ac_cv_func_dlopen=no
ac_cv_func_fork=yes
ac_cv_func_fork_works=yes
ac_cv_func_shl_load=no
ac_cv_func_vfork=yes
ac_cv_func_vfork_works=yes
ac_cv_header_dlfcn_h=yes
ac_cv_header_inttypes_h=yes
ac_cv_header_memory_h=yes
ac_cv_header_stdc=yes
ac_cv_header_stdint_h=yes
ac_cv_header_stdlib_h=yes
ac_cv_header_string_h=yes
ac_cv_header_strings_h=yes
ac_cv_header_sys_stat_h=yes
ac_cv_header_sys_time_h=yes
ac_cv_header_sys_types_h=yes
ac_cv_header_time_h=yes
ac_cv_header_unistd_h=yes
ac_cv_header_vfork_h=no
ac_cv_host=i686-pc-linux-gnu
ac_cv_lib_dl_dlopen=yes
ac_cv_lib_dld_shl_load=no
ac_cv_objext=o
ac_cv_path_EGREP='/bin/grep -E'
ac_cv_path_GREP=/bin/grep
ac_cv_path_PERL=/usr/bin/perl
ac_cv_path_PHPCONFIG=/usr/bin/php-config
ac_cv_path_PYTHON=/usr/bin/python
ac_cv_path_TCLSH=/usr/bin/tclsh8.4
ac_cv_path_ac_pt_PKG_CONFIG=/usr/bin/pkg-config
ac_cv_path_install='/usr/bin/install -c'
ac_cv_path_mkdir=/bin/mkdir
ac_cv_prog_AWK=gawk
ac_cv_prog_CPP='gcc -E'
ac_cv_prog_CXXCPP='g++ -E'
ac_cv_prog_ac_ct_AR=ar
ac_cv_prog_ac_ct_CC=gcc
ac_cv_prog_ac_ct_CXX=g++
ac_cv_prog_ac_ct_RANLIB=ranlib
ac_cv_prog_ac_ct_STRIP=strip
ac_cv_prog_cc_c89=
ac_cv_prog_cc_g=yes
ac_cv_prog_cc_gcc_c_o=yes
ac_cv_prog_cxx_g=yes
ac_cv_prog_f77_g=no
ac_cv_prog_make_make_set=yes
ac_cv_struct_tm=time.h
ac_cv_type_pid_t=yes
am_cv_CC_dependencies_compiler_type=gcc3
am_cv_CXX_dependencies_compiler_type=gcc3
lt_cv_deplibs_check_method=pass_all
lt_cv_dlopen=dlopen
lt_cv_dlopen_libs=-ldl
lt_cv_dlopen_self=yes
lt_cv_dlopen_self_static=no
lt_cv_file_magic_cmd='$MAGIC_CMD'
lt_cv_file_magic_test_file=
lt_cv_ld_reload_flag=-r
lt_cv_objdir=.libs
lt_cv_path_LD=/usr/bin/ld
lt_cv_path_LDCXX=/usr/bin/ld
lt_cv_path_NM='/usr/bin/nm -B'
lt_cv_path_SED=/bin/sed
lt_cv_prog_compiler_c_o=yes
lt_cv_prog_compiler_c_o_CXX=yes
lt_cv_prog_compiler_pic_works=yes
lt_cv_prog_compiler_pic_works_CXX=yes
lt_cv_prog_compiler_rtti_exceptions=no
lt_cv_prog_compiler_static_works=yes
lt_cv_prog_compiler_static_works_CXX=yes
lt_cv_prog_gnu_ld=yes
lt_cv_prog_gnu_ldcxx=yes
lt_cv_sys_global_symbol_pipe='sed -n -e '\''s/^.*[ 	]\([ABCDGIRSTW][ABCDGIRSTW]*\)[ 	][ 	]*\([_A-Za-z][_A-Za-z0-9]*\)$/\1 \2 \2/p'\'''
lt_cv_sys_global_symbol_to_c_name_address='sed -n -e '\''s/^: \([^ ]*\) $/  {\"\1\", (lt_ptr) 0},/p'\'' -e '\''s/^[BCDEGRST] \([^ ]*\) \([^ ]*\)$/  {"\2", (lt_ptr) \&\2},/p'\'''
lt_cv_sys_global_symbol_to_cdecl='sed -n -e '\''s/^. .* \(.*\)$/extern int \1;/p'\'''
lt_cv_sys_lib_dlsearch_path_spec='/lib /usr/lib /usr/lib/kde4/lib /usr/local/lib '
lt_cv_sys_lib_search_path_spec='/usr/lib/gcc/i486-linux-gnu/4.2.3 /usr/lib /lib'
lt_cv_sys_max_cmd_len=98304
lt_lt_cv_prog_compiler_c_o='"yes"'
lt_lt_cv_prog_compiler_c_o_CXX='"yes"'
lt_lt_cv_sys_global_symbol_pipe='"sed -n -e '\''s/^.*[ 	]\\([ABCDGIRSTW][ABCDGIRSTW]*\\)[ 	][ 	]*\\([_A-Za-z][_A-Za-z0-9]*\\)\$/\\1 \\2 \\2/p'\''"'
lt_lt_cv_sys_global_symbol_to_c_name_address='"sed -n -e '\''s/^: \\([^ ]*\\) \$/  {\\\"\\1\\\", (lt_ptr) 0},/p'\'' -e '\''s/^[BCDEGRST] \\([^ ]*\\) \\([^ ]*\\)\$/  {\"\\2\", (lt_ptr) \\&\\2},/p'\''"'
lt_lt_cv_sys_global_symbol_to_cdecl='"sed -n -e '\''s/^. .* \\(.*\\)\$/extern int \\1;/p'\''"'
pkg_cv_JS_CFLAGS='-DXP_UNIX -DJS_THREADSAFE -I/usr/include/mozjs -I/usr/include/nspr  '
pkg_cv_JS_LIBS='-lmozjs -lplds4 -lplc4 -lnspr4 -lpthread -ldl  '

## ----------------- ##
## Output variables. ##
## ----------------- ##

ACLOCAL='${SHELL} /home/comcor/src/c/trollbot/missing --run aclocal-1.10'
AMDEPBACKSLASH='\'
AMDEP_FALSE='#'
AMDEP_TRUE=''
AMTAR='${SHELL} /home/comcor/src/c/trollbot/missing --run tar'
AR='ar'
AUTOCONF='${SHELL} /home/comcor/src/c/trollbot/missing --run autoconf'
AUTOHEADER='${SHELL} /home/comcor/src/c/trollbot/missing --run autoheader'
AUTOMAKE='${SHELL} /home/comcor/src/c/trollbot/missing --run automake-1.10'
AWK='gawk'
CC='gcc'
CCDEPMODE='depmode=gcc3'
CFLAGS='-g -O0'
CPP='gcc -E'
CPPFLAGS=''
CXX='g++'
CXXCPP='g++ -E'
CXXDEPMODE='depmode=gcc3'
CXXFLAGS='-g -O2'
CYGPATH_W='echo'
DEFS='-DHAVE_CONFIG_H'
DEPDIR='.deps'
DSYMUTIL=''
ECHO='echo'
ECHO_C=''
ECHO_N='-n'
ECHO_T=''
EGREP='/bin/grep -E'
EXEEXT=''
F77=''
FFLAGS=''
GREP='/bin/grep'
INSTALL_DATA='${INSTALL} -m 644'
INSTALL_PROGRAM='${INSTALL}'
INSTALL_SCRIPT='${INSTALL}'
INSTALL_STRIP_PROGRAM='$(install_sh) -c -s'
JS_CFLAGS='-DXP_UNIX -DJS_THREADSAFE -I/usr/include/mozjs -I/usr/include/nspr  '
JS_LIBS='-lmozjs -lplds4 -lplc4 -lnspr4 -lpthread -ldl  '
LDFLAGS=''
LIBLTDL='${top_builddir}/libltdl/libltdlc.la'
LIBOBJS=''
LIBS=''
LIBTOOL='$(SHELL) $(top_builddir)/libtool'
LN_S='ln -s'
LTDLINCL='-I${top_srcdir}/libltdl'
LTLIBOBJS=''
MAINT='#'
MAINTAINER_MODE_FALSE=''
MAINTAINER_MODE_TRUE='#'
MAKEINFO='${SHELL} /home/comcor/src/c/trollbot/missing --run makeinfo'
NMEDIT=''
OBJEXT='o'
PACKAGE='trollbot'
PACKAGE_BUGREPORT=''
PACKAGE_NAME=''
PACKAGE_STRING=''
PACKAGE_TARNAME=''
PACKAGE_VERSION=''
PATH_SEPARATOR=':'
PERL='/usr/bin/perl'
PERL_CFLAGS=' -D_REENTRANT -D_GNU_SOURCE -DTHREADS_HAVE_PIDS -DDEBIAN -fno-strict-aliasing -pipe -I/usr/local/include -D_LARGEFILE_SOURCE -D_FILE_OFFSET_BITS=64  -I/usr/lib/perl/5.8/CORE '
PERL_LDADD='-Wl,-E  -L/usr/local/lib /usr/lib/perl/5.8/auto/DynaLoader/DynaLoader.a -L/usr/lib/perl/5.8/CORE -lperl -ldl -lm -lpthread -lc -lcrypt'
PHPCONFIG='/usr/bin/php-config'
PHP_CFLAGS=''
PHP_LDADD=''
PKG_CONFIG='/usr/bin/pkg-config'
PYTHON='/usr/bin/python'
PYTHON_CFLAGS='-I/usr/include/python2.5'
PYTHON_CPPFLAGS='-I/usr/include/python2.5'
PYTHON_EXTRA_LDFLAGS='-Xlinker -export-dynamic -Wl,-O1 -Wl,-Bsymbolic-functions'
PYTHON_EXTRA_LIBS=' -lpthread -ldl  -lutil'
PYTHON_LDADD='-L/usr/lib/python2.5 -lpython2.5  -lpthread -ldl  -lutil -Xlinker -export-dynamic -Wl,-O1 -Wl,-Bsymbolic-functions'
PYTHON_LDFLAGS='-L/usr/lib/python2.5 -lpython2.5'
PYTHON_SITE_PKG='/usr/lib/python2.5/site-packages'
PYTHON_VERSION=''
RANLIB='ranlib'
SED='/bin/sed'
SET_MAKE=''
SHELL='/bin/bash'
STRIP='strip'
TCLSH='/usr/bin/tclsh8.4'
TCL_CPPFLAGS='-I/usr/include/tcl8.4'
TCL_DEFS=' -DHAVE_LIMITS_H=1 -DHAVE_UNISTD_H=1 -DHAVE_SYS_PARAM_H=1 -DUSE_THREAD_ALLOC=1 -D_REENTRANT=1 -D_THREAD_SAFE=1 -DHAVE_PTHREAD_ATTR_SETSTACKSIZE=1 -DHAVE_PTHREAD_ATFORK=1 -DTCL_THREADS=1 -DPEEK_XCLOSEIM=1 -D_LARGEFILE64_SOURCE=1 -DTCL_WIDE_INT_TYPE=long\ long -DHAVE_STRUCT_STAT64=1 -DHAVE_OPEN64=1 -DHAVE_LSEEK64=1 -DHAVE_TYPE_OFF64_T=1 -DHAVE_GETCWD=1 -DHAVE_OPENDIR=1 -DHAVE_STRSTR=1 -DHAVE_STRTOL=1 -DHAVE_STRTOLL=1 -DHAVE_STRTOULL=1 -DHAVE_TMPNAM=1 -DHAVE_WAITPID=1 -DHAVE_GETPWUID_R_5=1 -DHAVE_GETPWUID_R=1 -DHAVE_GETPWNAM_R_5=1 -DHAVE_GETPWNAM_R=1 -DHAVE_GETGRGID_R_5=1 -DHAVE_GETGRGID_R=1 -DHAVE_GETGRNAM_R_5=1 -DHAVE_GETGRNAM_R=1 -DHAVE_GETHOSTBYNAME_R_6=1 -DHAVE_GETHOSTBYNAME_R=1 -DHAVE_GETHOSTBYADDR_R_8=1 -DHAVE_GETHOSTBYADDR_R=1 -DUSE_TERMIOS=1 -DHAVE_SYS_TIME_H=1 -DTIME_WITH_SYS_TIME=1 -DHAVE_TM_ZONE=1 -DHAVE_GMTIME_R=1 -DHAVE_LOCALTIME_R=1 -DHAVE_TM_GMTOFF=1 -DHAVE_TIMEZONE_VAR=1 -DHAVE_ST_BLKSIZE=1 -DSTDC_HEADERS=1 -DHAVE_SIGNED_CHAR=1 -DHAVE_LANGINFO=1 -DHAVE_SYS_IOCTL_H=1 '
TCL_LIBS='-L/usr/lib -ltcl8.4${TCL_DBGX} -ldl  -lpthread -lieee -lm'
VERSION='1.0.0'
WITH_JS_FALSE='#'
WITH_JS_TRUE=''
WITH_PERL_FALSE='#'
WITH_PERL_TRUE=''
WITH_PHP_FALSE=''
WITH_PHP_TRUE='#'
WITH_PYTHON_FALSE='#'
WITH_PYTHON_TRUE=''
WITH_TCL_FALSE='#'
WITH_TCL_TRUE=''
ac_ct_CC='gcc'
ac_ct_CXX='g++'
ac_ct_F77=''
am__fastdepCC_FALSE='#'
am__fastdepCC_TRUE=''
am__fastdepCXX_FALSE='#'
am__fastdepCXX_TRUE=''
am__include='include'
am__isrc=''
am__leading_dot='.'
am__quote=''
am__tar='${AMTAR} chof - "$$tardir"'
am__untar='${AMTAR} xf -'
bindir='${exec_prefix}/bin'
build='i686-pc-linux-gnu'
build_alias=''
build_cpu='i686'
build_os='linux-gnu'
build_vendor='pc'
datadir='${datarootdir}'
datarootdir='${prefix}/share'
docdir='${datarootdir}/doc/${PACKAGE}'
dvidir='${docdir}'
exec_prefix='${prefix}'
host='i686-pc-linux-gnu'
host_alias=''
host_cpu='i686'
host_os='linux-gnu'
host_vendor='pc'
htmldir='${docdir}'
includedir='${prefix}/include'
infodir='${datarootdir}/info'
install_sh='$(SHELL) /home/comcor/src/c/trollbot/install-sh'
libdir='${exec_prefix}/lib'
libexecdir='${exec_prefix}/libexec'
localedir='${datarootdir}/locale'
localstatedir='${prefix}/var'
mandir='${datarootdir}/man'
mkdir_p='/bin/mkdir -p'
oldincludedir='/usr/include'
pdfdir='${docdir}'
prefix='/home/comcor/trollbot'
program_transform_name='s,x,x,'
psdir='${docdir}'
sbindir='${exec_prefix}/sbin'
sharedstatedir='${prefix}/com'
subdirs=' libltdl'
sysconfdir='${prefix}/etc'
target_alias=''

## ----------- ##
## confdefs.h. ##
## ----------- ##

#define PACKAGE_NAME ""
#define PACKAGE_TARNAME ""
#define PACKAGE_VERSION ""
#define PACKAGE_STRING ""
#define PACKAGE_BUGREPORT ""
#define PACKAGE "trollbot"
#define VERSION "1.0.0"
#define STDC_HEADERS 1
#define HAVE_SYS_TYPES_H 1
#define HAVE_SYS_STAT_H 1
#define HAVE_STDLIB_H 1
#define HAVE_STRING_H 1
#define HAVE_MEMORY_H 1
#define HAVE_STRINGS_H 1
#define HAVE_INTTYPES_H 1
#define HAVE_STDINT_H 1
#define HAVE_UNISTD_H 1
#define HAVE_DLFCN_H 1
#define HAVE_TIME_H 1
#define HAVE_SYS_TIME_H 1
#define HAVE_FORK 1
#define HAVE_VFORK 1
#define HAVE_WORKING_VFORK 1
#define HAVE_WORKING_FORK 1
#define HAVE_PYTHON 1
#define HAVE_PYTHON 1
#define HAVE_JS 1
#define HAVE_TCL 1
#define HAVE_PERL 1
#define STDC_HEADERS 1

configure: exit 0