make[4]: Leaving directory `/home/ed/tronlatest/armagetronad/src/doc'
make[3]: Leaving directory `/home/ed/tronlatest/armagetronad/src/doc'
make[3]: Entering directory `/home/ed/tronlatest/armagetronad/src'
g++ -DHAVE_CONFIG_H -I. -I.. -I. -I.. -I/usr/include/libxml2 -I/usr/include/SDL -D_GNU_SOURCE=1 -D_REENTRANT -I/usr/include/FTGL -I/usr/include/freetype2 -I/usr/include/FTGL -I/usr/include/freetype2 -I/usr/include/libpng12 -I./tools -I./thirdparty/mathexpr -I./render -I./ui -I./thirdparty/shttpd -I./network -I./engine -I./engine/sound -I./thirdparty/particles -I./tron -I./tron/cockpit -O2 -MT libtron_a-gArena.o -MD -MP -MF .deps/libtron_a-gArena.Tpo -c -o libtron_a-gArena.o `test -f 'tron/gArena.cpp' || echo './'`tron/gArena.cpp
./tron/zone/zZoneInfluence.h:49: error: ‘tPolynomialMarshaler’ does not name a type
./tron/zone/zZoneInfluence.h:54: error: expected ‘,’ or ‘...’ before ‘&’ token
./tron/zone/zZoneInfluence.h:54: error: ISO C++ forbids declaration of ‘tPolynomialMarshaler’ with no type
./tron/zone/zZoneInfluence.h: In member function ‘void zZoneInfluenceItemRotation::set(int)’:
./tron/zone/zZoneInfluence.h:56: error: ‘rotation’ was not declared in this scope
./tron/zone/zZoneInfluence.h:56: error: ‘other’ was not declared in this scope
./tron/zone/zMonitor.h: At global scope:
./tron/zone/zMonitor.h:176: error: ‘tPolynomialMarshaler’ does not name a type
./tron/zone/zMonitor.h:198: error: ‘tPolynomialMarshaler’ has not been declared
./tron/zone/zMonitor.h: In constructor ‘zMonitorInfluence::zMonitorInfluence(zMonitorPtr)’:
./tron/zone/zMonitor.h:186: error: class ‘zMonitorInfluence’ does not have any field named ‘influence’
./tron/zone/zMonitor.h: In member function ‘void zMonitorInfluence::setInfluence(int)’:
./tron/zone/zMonitor.h:199: error: ‘influence’ was not declared in this scope
make[3]: *** [libtron_a-gArena.o] Error 1
make[3]: Leaving directory `/home/ed/tronlatest/armagetronad/src'
make[2]: *** [all-recursive] Error 1
make[2]: Leaving directory `/home/ed/tronlatest/armagetronad/src'
make[1]: *** [all-recursive] Error 1
make[1]: Leaving directory `/home/ed/tronlatest/armagetronad'
make: *** [all] Error 2