Martincitou:/usr/src/kernel-source-2.4.27# make b zImage modules
gcc -Wall -Wstrict-prototypes -O2 -fomit-frame-po inter -o scripts/mkdep scripts/mkdep.c
scripts/mkdep.c:33:19: ctype.h: No existe el fich ero o el directorio
scripts/mkdep.c:34:19: fcntl.h: No existe el fich ero o el directorio
En el fichero incluído de /usr/lib/gcc-lib/i486-l inux/3.3.5/include/syslimits.h:7,
de /usr/lib/gcc-lib/i486-linux/3 .3.5/include/limits.h:11,
de scripts/mkdep.c:35:
/usr/lib/gcc-lib/i486-linux/3.3.5/include/limits. h:122:75: limits.h: No existe el fichero o el dir ectorio
scripts/mkdep.c:36:19: stdio.h: No existe el fich ero o el directorio
scripts/mkdep.c:37:20: stdlib.h: No existe el fic hero o el directorio
scripts/mkdep.c:38:20: string.h: No existe el fic hero o el directorio
scripts/mkdep.c:39:20: unistd.h: No existe el fic hero o el directorio
scripts/mkdep.c:41:23: sys/fcntl.h: No existe el fichero o el directorio
scripts/mkdep.c:42:22: sys/mman.h: No existe el f ichero o el directorio
scripts/mkdep.c:43:22: sys/stat.h: No existe el f ichero o el directorio
scripts/mkdep.c:44:23: sys/types.h: No existe el fichero o el directorio
scripts/mkdep.c:69: error: `NULL' undeclared here (not in a function)
scripts/mkdep.c: En la función `do_depname':
scripts/mkdep.c:78: aviso: implicit declaration o f function `printf'
scripts/mkdep.c: En la función `grow_config':
scripts/mkdep.c:93: aviso: implicit declaration o f function `realloc'
scripts/mkdep.c:93: aviso: asignación se crea un puntero desde un entero sin una conversión
scripts/mkdep.c:94: error: `NULL' undeclared (fir st use in this function)
scripts/mkdep.c:94: error: (Each undeclared ident ifier is reported only once
scripts/mkdep.c:94: error: for each function it a ppears in.)
scripts/mkdep.c:95: aviso: implicit declaration o f function `perror'
scripts/mkdep.c:95: aviso: implicit declaration o f function `exit'
scripts/mkdep.c: En la función `is_defined_config ':
scripts/mkdep.c:111: aviso: implicit declaration of function `memcmp'
scripts/mkdep.c: En la función `define_config':
scripts/mkdep.c:126: aviso: implicit declaration of function `memcpy'
scripts/mkdep.c: En el nivel principal:
scripts/mkdep.c:148: error: `NULL' undeclared her e (not in a function)
scripts/mkdep.c: En la función `grow_precious':
scripts/mkdep.c:163: aviso: asignación se crea un puntero desde un entero sin una conversión
scripts/mkdep.c:164: error: `NULL' undeclared (fi rst use in this function)
scripts/mkdep.c: En la función `define_precious':
scripts/mkdep.c:176: aviso: implicit declaration of function `strlen'
scripts/mkdep.c: En la función `handle_include':
scripts/mkdep.c:204: aviso: implicit declaration of function `access'
scripts/mkdep.c:204: error: `F_OK' undeclared (fi rst use in this function)
scripts/mkdep.c: En la función `add_path':
scripts/mkdep.c:221: error: `PATH_MAX' undeclared (first use in this function)
scripts/mkdep.c:224: aviso: implicit declaration of function `strcmp'
scripts/mkdep.c:225: aviso: implicit declaration of function `realpath'
scripts/mkdep.c:225: aviso: asignación se crea un puntero desde un entero sin una conversión
scripts/mkdep.c:227: aviso: implicit declaration of function `fprintf'
scripts/mkdep.c:227: error: `stderr' undeclared ( first use in this function)
scripts/mkdep.c:235: aviso: asignación se crea un puntero desde un entero sin una conversión
scripts/mkdep.c:243: aviso: implicit declaration of function `malloc'
scripts/mkdep.c:243: aviso: asignación se crea un puntero desde un entero sin una conversión
scripts/mkdep.c:248: aviso: implicit declaration of function `strcpy'
scripts/mkdep.c:221: aviso: unused variable `reso lved_path'
scripts/mkdep.c: En la función `use_config':
scripts/mkdep.c:271: aviso: implicit declaration of function `isupper'
scripts/mkdep.c:271: aviso: implicit declaration of function `tolower'
scripts/mkdep.c: En la función `state_machine':
scripts/mkdep.c:493: aviso: implicit declaration of function `isalnum'
scripts/mkdep.c: En la función `do_depend':
scripts/mkdep.c:526: aviso: implicit declaration of function `getpagesize'
scripts/mkdep.c:528: error: storage size of `st' isn't known
scripts/mkdep.c:531: aviso: implicit declaration of function `open'
scripts/mkdep.c:531: error: `O_RDONLY' undeclared (first use in this function)
scripts/mkdep.c:537: aviso: implicit declaration of function `fstat'
scripts/mkdep.c:539: error: `stderr' undeclared ( first use in this function)
scripts/mkdep.c:540: aviso: implicit declaration of function `close'
scripts/mkdep.c:546: aviso: implicit declaration of function `mmap'
scripts/mkdep.c:546: error: `NULL' undeclared (fi rst use in this function)
scripts/mkdep.c:546: error: `PROT_READ' undeclare d (first use in this function)
scripts/mkdep.c:546: error: `MAP_PRIVATE' undecla red (first use in this function)
scripts/mkdep.c:546: aviso: asignación se crea un puntero desde un entero sin una conversión
scripts/mkdep.c:562: aviso: implicit declaration of function `puts'
scripts/mkdep.c:567: aviso: implicit declaration of function `munmap'
scripts/mkdep.c:528: aviso: unused variable `st'
scripts/mkdep.c: En la función `main':
scripts/mkdep.c:581: aviso: implicit declaration of function `getenv'
scripts/mkdep.c:581: aviso: asignación se crea un puntero desde un entero sin una conversión
scripts/mkdep.c:583: aviso: implicit declaration of function `fputs'
scripts/mkdep.c:584: error: `stderr' undeclared ( first use in this function)
scripts/mkdep.c:591: aviso: implicit declaration of function `strncmp'
make: *** [scripts/mkdep] Error 1
Martincitou:/usr/src/kernel-source-2.4.27#