config.status: creating ext2ed/Makefile
config.status: creating e2fsck/Makefile
config.status: creating debugfs/Makefile
config.status: creating tests/Makefile
config.status: creating tests/progs/Makefile
config.status: creating resize/Makefile
config.status: creating doc/Makefile
config.status: creating intl/Makefile
config.status: creating po/Makefile.in
config.status: executing default-1 commands
config.status: creating po/POTFILES
config.status: creating po/Makefile
make[1]: Entering directory `/var/tmp/portage/sys-fs/e2fsprogs-1.40.4/work/e2fsp
rogs-1.40.4'
cd ./util ; make subst
make[2]: Entering directory `/var/tmp/portage/sys-fs/e2fsprogs-1.40.4/work/e2fsp
rogs-1.40.4/util'
CC subst.c
LD subst
make[2]: Leaving directory `/var/tmp/portage/sys-fs/e2fsprogs-1.40.4/work/e2fspr
ogs-1.40.4/util'
cd .; CONFIG_FILES=./lib/ext2fs/ext2_types.h ./config.status
config.status: creating ./lib/ext2fs/ext2_types.h
config.status: executing default-1 commands
make[1]: Leaving directory `/var/tmp/portage/sys-fs/e2fsprogs-1.40.4/work/e2fspr
ogs-1.40.4'
make[1]: Entering directory `/var/tmp/portage/sys-fs/e2fsprogs-1.40.4/work/e2fsp
rogs-1.40.4'
cd .; CONFIG_FILES=./lib/blkid/blkid_types.h ./config.status
config.status: creating ./lib/blkid/blkid_types.h
config.status: executing default-1 commands
make[1]: Leaving directory `/var/tmp/portage/sys-fs/e2fsprogs-1.40.4/work/e2fspr
ogs-1.40.4'
make[1]: Entering directory `/var/tmp/portage/sys-fs/e2fsprogs-1.40.4/work/e2fsp
rogs-1.40.4'
cd .; CONFIG_FILES=./lib/uuid/uuid_types.h ./config.status
config.status: creating ./lib/uuid/uuid_types.h
config.status: executing default-1 commands
make[1]: Leaving directory `/var/tmp/portage/sys-fs/e2fsprogs-1.40.4/work/e2fspr
ogs-1.40.4'
make libs
make[1]: Entering directory `/var/tmp/portage/sys-fs/e2fsprogs-1.40.4/work/e2fsp
rogs-1.40.4'
make[2]: Entering directory `/var/tmp/portage/sys-fs/e2fsprogs-1.40.4/work/e2fsp
rogs-1.40.4'
make[2]: `lib/ext2fs/ext2_types.h' is up to date.
make[2]: Leaving directory `/var/tmp/portage/sys-fs/e2fsprogs-1.40.4/work/e2fspr
ogs-1.40.4'
make[2]: Entering directory `/var/tmp/portage/sys-fs/e2fsprogs-1.40.4/work/e2fsp
rogs-1.40.4'
make[2]: `lib/blkid/blkid_types.h' is up to date.
make[2]: Leaving directory `/var/tmp/portage/sys-fs/e2fsprogs-1.40.4/work/e2fspr
ogs-1.40.4'
make[2]: Entering directory `/var/tmp/portage/sys-fs/e2fsprogs-1.40.4/work/e2fsp
rogs-1.40.4'
make[2]: `lib/uuid/uuid_types.h' is up to date.
make[2]: Leaving directory `/var/tmp/portage/sys-fs/e2fsprogs-1.40.4/work/e2fspr
ogs-1.40.4'
making all in lib/e2p
make[2]: Entering directory `/var/tmp/portage/sys-fs/e2fsprogs-1.40.4/work/e2fsp
rogs-1.40.4/lib/e2p'
make[3]: Entering directory `/var/tmp/portage/sys-fs/e2fsprogs-1.40.4/work/e2fsp
rogs-1.40.4/lib/e2p'
MKDIR elfshared
make[3]: Leaving directory `/var/tmp/portage/sys-fs/e2fsprogs-1.40.4/work/e2fspr
ogs-1.40.4/lib/e2p'
CC feature.c
CC fgetflags.c
CC fsetflags.c
CC fgetversion.c
CC fsetversion.c
CC getflags.c
CC getversion.c
CC hashstr.c
CC iod.c
CC ls.c
CC mntopts.c
CC parse_num.c
CC pe.c
CC pf.c
CC ps.c
CC setflags.c
CC setversion.c
CC uuid.c
CC ostype.c
CC percent.c
GEN_LIB libe2p.a
GEN_ELF_SOLIB libe2p.so.2.3
make[2]: Leaving directory `/var/tmp/portage/sys-fs/e2fsprogs-1.40.4/work/e2fspr
ogs-1.40.4/lib/e2p'
making all in lib/ext2fs
make[2]: Entering directory `/var/tmp/portage/sys-fs/e2fsprogs-1.40.4/work/e2fsp
rogs-1.40.4/lib/ext2fs'
make[3]: Entering directory `/var/tmp/portage/sys-fs/e2fsprogs-1.40.4/work/e2fsp
rogs-1.40.4/lib/ext2fs'
MKDIR elfshared
make[3]: Leaving directory `/var/tmp/portage/sys-fs/e2fsprogs-1.40.4/work/e2fspr
ogs-1.40.4/lib/ext2fs'
SUBST ext2_err.et
COMPILE_ET ext2_err.et
CC bb_compat.c
CC cmp_bitmaps.c
CC fileio.c
CC inode_io.c
CC namei.c
CC write_bb_file.c
CC rs_bitmap.c
CC dupfs.c
CC test_io.c
CC imager.c
CC ext2_err.c
CC alloc.c
CC alloc_sb.c
CC alloc_stats.c
CC alloc_tables.c
CC badblocks.c
CC bb_inode.c
CC bitmaps.c
CC bitops.c
CC block.c
CC bmap.c
CC check_desc.c
CC closefs.c
CC dblist.c
CC dblist_dir.c
CC dirblock.c
CC dirhash.c
CC dir_iterate.c
CC expanddir.c
CC ext_attr.c
CC finddev.c
CC flushb.c
CC freefs.c
CC gen_bitmap.c
CC get_pathname.c
CC getsize.c
CC getsectsize.c
CC icount.c
CC ind_block.c
CC initialize.c
CC inline.c
CC inode.c
CC io_manager.c
CC ismounted.c
CC link.c
CC llseek.c
CC lookup.c
CC mkdir.c
CC mkjournal.c
CC native.c
CC newdir.c
CC openfs.c
CC read_bb.c
CC read_bb_file.c
CC res_gdt.c
CC rw_bitmaps.c
CC swapfs.c
CC tdb.c
CC unix_io.c
CC unlink.c
CC valid_blk.c
CC version.c
GEN_LIB libext2fs.a
GEN_ELF_SOLIB libext2fs.so.2.4
make[2]: Leaving directory `/var/tmp/portage/sys-fs/e2fsprogs-1.40.4/work/e2fspr
ogs-1.40.4/lib/ext2fs'
making all in lib/uuid
make[2]: Entering directory `/var/tmp/portage/sys-fs/e2fsprogs-1.40.4/work/e2fsp
rogs-1.40.4/lib/uuid'
make[3]: Entering directory `/var/tmp/portage/sys-fs/e2fsprogs-1.40.4/work/e2fsp
rogs-1.40.4/lib/uuid'
MKDIR elfshared
make[3]: Leaving directory `/var/tmp/portage/sys-fs/e2fsprogs-1.40.4/work/e2fspr
ogs-1.40.4/lib/uuid'
CC clear.c
CC compare.c
CC copy.c
CC gen_uuid.c
CC isnull.c
CC pack.c
CC parse.c
CC unpack.c
CC unparse.c
CC uuid_time.c
GEN_LIB libuuid.a
GEN_ELF_SOLIB libuuid.so.1.2
CC tst_uuid.o
LD tst_uuid
../../lib/libuuid.a(gen_uuid.o): In function `get_random_fd':
gen_uuid.c:(.text+0x109): undefined reference to `___tls_get_addr'
../../lib/libuuid.a(gen_uuid.o): In function `get_random_bytes':
gen_uuid.c:(.text+0x209): undefined reference to `___tls_get_addr'
gen_uuid.c:(.text+0x276): undefined reference to `___tls_get_addr'
../../lib/libuuid.a(gen_uuid.o): In function `uuid__generate_time':
gen_uuid.c:(.text+0x3e6): undefined reference to `___tls_get_addr'
gen_uuid.c:(.text+0x400): undefined reference to `___tls_get_addr'
../../lib/libuuid.a(gen_uuid.o):gen_uuid.c:(.text+0x48f): more undefined referen
ces to `___tls_get_addr' follow
collect2: ld returned 1 exit status
make[2]: *** [tst_uuid] Error 1
make[2]: Leaving directory `/var/tmp/portage/sys-fs/e2fsprogs-1.40.4/work/e2fspr
ogs-1.40.4/lib/uuid'
make[1]: *** [all-libs-recursive] Error 1
make[1]: Leaving directory `/var/tmp/portage/sys-fs/e2fsprogs-1.40.4/work/e2fspr
ogs-1.40.4'
make: *** [all] Error 2
*
* ERROR: sys-fs/e2fsprogs-1.40.4 failed.
* Call stack:
* ebuild.sh, line 49: Called src_compile
* environment, line 2317: Called die
* The specific snippet of code:
* emake -j1 COMPILE_ET=compile_et || die;
* The die message:
* (no error message)
*
* If you need support, post the topmost build error, and the call sta
ck if relevant.
* A complete build log is located at '/var/tmp/portage/sys-fs/e2fspro
gs-1.40.4/temp/build.log'.
* The ebuild environment file is located at '/var/tmp/portage/sys-fs/
e2fsprogs-1.40.4/temp/environment'.
*
snort ~ #