../../lib/libuuid.a(gen_uuid.o): In function `get_random_fd':
gen_uuid.c:(.text+0x109): undefined reference to `___tls_get_addr'
../../lib/libuuid.a(gen_uuid.o): In function `get_random_bytes':
gen_uuid.c:(.text+0x209): undefined reference to `___tls_get_addr'
gen_uuid.c:(.text+0x276): undefined reference to `___tls_get_addr'
../../lib/libuuid.a(gen_uuid.o): In function `uuid__generate_time':
gen_uuid.c:(.text+0x3e6): undefined reference to `___tls_get_addr'
gen_uuid.c:(.text+0x400): undefined reference to `___tls_get_addr'
../../lib/libuuid.a(gen_uuid.o):gen_uuid.c:(.text+0x48f): more undefined referen
ces to `___tls_get_addr' follow
collect2: ld returned 1 exit status
make[2]: *** [tst_uuid] Error 1
make[2]: Leaving directory `/var/tmp/portage/sys-fs/e2fsprogs-1.40.4/work/e2fspr
ogs-1.40.4/lib/uuid'
make[1]: *** [all-libs-recursive] Error 1
make[1]: Leaving directory `/var/tmp/portage/sys-fs/e2fsprogs-1.40.4/work/e2fspr
ogs-1.40.4'
make: *** [all] Error 2
*
* ERROR: sys-fs/e2fsprogs-1.40.4 failed.
* Call stack:
* ebuild.sh, line 49: Called src_compile
* environment, line 2317: Called die
* The specific snippet of code:
* emake -j1 COMPILE_ET=compile_et || die;
* The die message:
* (no error message)
*
* If you need support, post the topmost build error, and the call sta
ck if relevant.
* A complete build log is located at '/var/tmp/portage/sys-fs/e2fspro
gs-1.40.4/temp/build.log'.
* The ebuild environment file is located at '/var/tmp/portage/sys-fs/
e2fsprogs-1.40.4/temp/environment'.