x86_64-pc-linux-gnu-gcc "-DPACKAGE_NAME=\"GNU Data Access\"" -DPACKAGE_TARNAME=\"libgda\" -DPACKAGE_VERSION=\"1.2.4\" "-DPACKAGE_STRING=\"GNU Data Access 1.2.4\"" -DPACKAGE_BUGREPORT=\"gnome-db-list@gnome.org\" -DBONOBO_EXPLICIT_TRANSLATION_DOMAIN=\"libgda-2\" -DSTDC_HEADERS=1 -DHAVE_SYS_TYPES_H=1 -DHAVE_SYS_STAT_H=1 -DHAVE_STDLIB_H=1 -DHAVE_STRING_H=1 -DHAVE_MEMORY_H=1 -DHAVE_STRINGS_H=1 -DHAVE_INTTYPES_H=1 -DHAVE_STDINT_H=1 -DHAVE_UNISTD_H=1 -DHAVE_DLFCN_H=1 -DYYTEXT_POINTER=1 -DGETTEXT_PACKAGE=\"libgda-2\" -DHAVE_LOCALE_H=1 -DHAVE_LC_MESSAGES=1 -DHAVE_BIND_TEXTDOMAIN_CODESET=1 -DHAVE_GETTEXT=1 -DHAVE_DCGETTEXT=1 -DENABLE_NLS=1 -DHAVE_LDAP=1 -DHAVE_POPT_H=1 -DHAVE_READLINE_READLINE_H=1 -DHAVE_READLINE_HISTORY_H=1 -I. -I. -I../.. -I../.. -pthread -I/usr/include/glib-2.0 -I/usr/lib64/glib-2.0/include -I/usr/include/libxml2 -I/usr/include/db4.5 -Os -march=x86-64 -pipe -MT libmain.lo -MD -MP -MF .deps/libmain.Tpo -c libmain.c -o libmain.o >/dev/null 2>&1
x86_64-pc-linux-gnu-gcc -shared .libs/gda-bdb-provider.o .libs/gda-bdb-recordset.o .libs/utils.o .libs/libmain.o -Wl,--rpath -Wl,/var/tmp/portage/gnome-extra/libgda-1.2.4/work/libgda-1.2.4/libgda/.libs /usr/lib64/libgobject-2.0.so -L/usr/lib64 /usr/lib64/libgthread-2.0.so -lrt /usr/lib64/libgmodule-2.0.so -ldl /usr/lib64/libglib-2.0.so /usr/lib64/libxslt.so -lz -lm /usr/lib64/libxml2.so ../../libgda/.libs/libgda-2.so -L/var/tmp/portage/gnome-extra/libgda-1.2.4/work/libgda-1.2.4/libsql/.libs -ldb -march=x86-64 -Wl,-O1 -Wl,--enable-new-dtags -Wl,--sort-common -pthread -Wl,--export-dynamic -Wl,-soname -Wl,libgda-bdb.so -o .libs/libgda-bdb.so
/usr/lib/gcc/x86_64-pc-linux-gnu/4.1.2/../../../../x86_64-pc-linux-gnu/bin/ld: cannot find -ldb
collect2: ld returned 1 exit status
make[2]: *** [libgda-bdb.la] Error 1
make[1]: *** [all-recursive] Error 1
make: *** [all-recursive] Error 1
*
* ERROR: gnome-extra/libgda-1.2.4 failed.
* Call stack:
* ebuild.sh, line 49: Called src_compile
* environment, line 3430: Called gnome2_src_compile
* environment, line 2620: Called die
* The specific snippet of code:
* emake || die "compile failure"
* The die message:
* compile failure
*
* If you need support, post the topmost build error, and the call stack if relevant.
* A complete build log is located at '/var/tmp/portage/gnome-extra/libgda-1.2.4/temp/build.log'.
* The ebuild environment file is located at '/var/tmp/portage/gnome-extra/libgda-1.2.4/temp/environment'.
*
* Messages for package gnome-extra/libgda-1.2.4:
*
* ERROR: gnome-extra/libgda-1.2.4 failed.
* Call stack:
* ebuild.sh, line 49: Called src_compile
* environment, line 3430: Called gnome2_src_compile
* environment, line 2620: Called die
* The specific snippet of code:
* emake || die "compile failure"
* The die message:
* compile failure
*
* If you need support, post the topmost build error, and the call stack if relevant.
* A complete build log is located at '/var/tmp/portage/gnome-extra/libgda-1.2.4/temp/build.log'.
* The ebuild environment file is located at '/var/tmp/portage/gnome-extra/libgda-1.2.4/temp/environment'.
*
* GNU info directory index is up-to-date.
* IMPORTANT: 6 config files in '/etc' need updating.
* See the CONFIGURATION FILES section of the emerge
* man page to learn how to update config files.