rendered paste body[ 88%] Building CXX object keurocalc/CMakeFiles/keurocalc.dir/keurocalc.o
/usr/bin/c++ -Wnon-virtual-dtor -Wno-long-long -ansi -Wundef -Wcast-align -Wchar-subscripts -Wall -W -Wpointer-arith -Wformat-security -fno-exceptions -fno-check-new -fno-common -Woverloaded-virtual -fvisibility=hidden -fvisibility-inlines-hidden -O2 -g -I/home/chitlesh/rpmbuild/BUILD/keurocalc/keurocalc -I/home/chitlesh/rpmbuild/BUILD/keurocalc -I/usr/include/kde4 -I/usr/include/kde4/KDE -I/usr/include/QtDBus -I/usr/include/QtTest -I/usr/include/QtUiTools -I/usr/include/QtScript -I/usr/include/QtSvg -I/usr/include/QtXml -I/usr/include/QtSql -I/usr/include/QtOpenGL -I/usr/include/QtNetwork -I/usr/include/QtDesigner -I/usr/include/QtAssistant -I/usr/include/Qt3Support -I/usr/include/QtGui -I/usr/include/QtCore -I/usr/include/Qt -I/usr/lib/qt4/mkspecs/default -D_BSD_SOURCE -D_XOPEN_SOURCE=500 -D_BSD_SOURCE -D_GNU_SOURCE -DQT_NO_STL -DQT_NO_CAST_TO_ASCII -D_REENTRANT -DKDE_DEPRECATED_WARNINGS -o keurocalc/CMakeFiles/keurocalc.dir/keurocalc.o -c /home/chitlesh/rpmbuild/BUILD/keurocalc/keurocalc/keurocalc.cpp
/home/chitlesh/rpmbuild/BUILD/keurocalc/currencies/currencies.cpp: In member function 'void Currencies::addECBRates(int)':
/home/chitlesh/rpmbuild/BUILD/keurocalc/currencies/currencies.cpp:156: error: cannot convert 'bool' to 'KIO::LoadType' for argument '2' to 'KIO::TransferJob* KIO::get(const KUrl&, KIO::LoadType, KIO::JobFlags)'
/home/chitlesh/rpmbuild/BUILD/keurocalc/currencies/currencies.cpp: In member function 'void Currencies::addNY_FRBRates(int)':
/home/chitlesh/rpmbuild/BUILD/keurocalc/currencies/currencies.cpp:175: error: cannot convert 'bool' to 'KIO::LoadType' for argument '2' to 'KIO::TransferJob* KIO::get(const KUrl&, KIO::LoadType, KIO::JobFlags)'
make[2]: *** [keurocalc/CMakeFiles/keurocalc.dir/__/currencies/currencies.o] Error 1
make[2]: *** Waiting for unfinished jobs....
make[2]: Leaving directory `/home/chitlesh/rpmbuild/BUILD/keurocalc'
make[1]: *** [curconvd/CMakeFiles/curconvd.dir/all] Error 2
make[1]: *** Waiting for unfinished jobs....
make[2]: Leaving directory `/home/chitlesh/rpmbuild/BUILD/keurocalc'
make[1]: *** [keurocalc/CMakeFiles/keurocalc.dir/all] Error 2
make[1]: Leaving directory `/home/chitlesh/rpmbuild/BUILD/keurocalc'
make: *** [all] Error 2
error: Bad exit status from /var/tmp/rpm-tmp.53022 (%build)
RPM build errors:
Bad exit status from /var/tmp/rpm-tmp.53022 (%build)