All pastes #910308 Raw Edit

Something

public text v1 · immutable
·published 2008-02-19 21:28 UTC
rendered paste body
[ 81%] Built target kaddressbookpart
[ 82%] Built target kaddrbk_cryptosettings
[ 82%] Building CXX object akregator/src/CMakeFiles/akregatorpart.dir/frame.o
/home/stephen/kdesvn/kdepim/akregator/src/articlelistview.cpp:370:2: warning: #warning The distinction between empty node and 0 items after filtering is hard to port to interview
[ 82%] Building CXX object akregator/src/CMakeFiles/akregatorpart.dir/framemanager.o
/home/stephen/kdesvn/kdepim/akregator/src/articlelistview.cpp: In member function ‘void Akregator::ArticleListView::saveHeaderSettings()’:
/home/stephen/kdesvn/kdepim/akregator/src/articlelistview.cpp:229: error: no matching function for call to ‘Akregator::Settings::setArticlelistHeaderStates(QList<int>&)’
/home/stephen/kdesvn/build/kdepim/akregator/src/akregatorconfig.h:704: note: candidates are: static void Akregator::Settings::setArticlelistHeaderStates(const QString&)
/home/stephen/kdesvn/kdepim/akregator/src/articlelistview.cpp: In member function ‘void Akregator::ArticleListView::loadHeaderSettings()’:
/home/stephen/kdesvn/kdepim/akregator/src/articlelistview.cpp:239: error: conversion from ‘QString’ to non-scalar type ‘QList<int>’ requested
make[2]: *** [akregator/src/CMakeFiles/akregatorpart.dir/articlelistview.o] Error 1
make[2]: *** Waiting for unfinished jobs....
[ 82%] Built target kaddrbk_cardview
Scanning dependencies of target kaddrbk_iconview
[ 82%] Building CXX object kaddressbook/views/CMakeFiles/kaddrbk_iconview.dir/kaddressbookiconview.o
/home/stephen/kdesvn/build/qt-copy/include/Qt3Support/../../../../qt-copy/src/qt3support/widgets/q3scrollview.h:226: warning: ‘virtual void Q3ScrollView::drawContents(QPainter*)’ was hidden
/home/stephen/kdesvn/build/qt-copy/include/Qt3Support/../../../../qt-copy/src/qt3support/itemviews/q3iconview.h:446: warning:   by ‘virtual void Q3IconView::drawContents(QPainter*, int, int, int, int)’
make[1]: *** [akregator/src/CMakeFiles/akregatorpart.dir/all] Error 2
make[1]: *** Waiting for unfinished jobs....
Linking CXX shared module ../../lib/kaddrbk_iconview.so
[ 82%] Built target kaddrbk_iconview
make: *** [all] Error 2