All pastes #909983 Raw Edit

Untitled

public text v1 · immutable
·published 2008-02-19 17:36 UTC
rendered paste body
Determining if the Q_WS_WIN exist failed with the following output:
/usr/bin/make -f CMakeFiles/cmTryCompileExec.dir/build.make CMakeFiles/cmTryCompileExec.dir/build
make[1]: Entering directory `/home/kde-devel/kde/build/kdelibs/CMakeFiles/CMakeTmp'
/usr/bin/cmake -E cmake_progress_report /home/kde-devel/kde/build/kdelibs/CMakeFiles/CMakeTmp/CMakeFiles 1
Building C object CMakeFiles/cmTryCompileExec.dir/CheckSymbolExists.o
/usr/bin/gcc  -I/usr/include/qt4   -o CMakeFiles/cmTryCompileExec.dir/CheckSymbolExists.o   -c /home/kde-devel/kde/build/kdelibs/CMakeFiles/CMakeTmp/CheckSymbolExists.c
/home/kde-devel/kde/build/kdelibs/CMakeFiles/CMakeTmp/CheckSymbolExists.c: In function ‘main’:
/home/kde-devel/kde/build/kdelibs/CMakeFiles/CMakeTmp/CheckSymbolExists.c:8: error: ‘Q_WS_WIN’ undeclared (first use in this function)
/home/kde-devel/kde/build/kdelibs/CMakeFiles/CMakeTmp/CheckSymbolExists.c:8: error: (Each undeclared identifier is reported only once
/home/kde-devel/kde/build/kdelibs/CMakeFiles/CMakeTmp/CheckSymbolExists.c:8: error: for each function it appears in.)
make[1]: *** [CMakeFiles/cmTryCompileExec.dir/CheckSymbolExists.o] Error 1
make[1]: Leaving directory `/home/kde-devel/kde/build/kdelibs/CMakeFiles/CMakeTmp'
make: *** [cmTryCompileExec/fast] Error 2

File /home/kde-devel/kde/build/kdelibs/CMakeFiles/CMakeTmp/CheckSymbolExists.c:
/* */
#include <QtCore/qglobal.h>

void cmakeRequireSymbol(int dummy,...){(void)dummy;}
int main()
{
#ifndef Q_WS_WIN
  cmakeRequireSymbol(0,&Q_WS_WIN);
#endif
  return 0;
}

Determining if the Q_WS_QWS exist failed with the following output:
/usr/bin/make -f CMakeFiles/cmTryCompileExec.dir/build.make CMakeFiles/cmTryCompileExec.dir/build
make[1]: Entering directory `/home/kde-devel/kde/build/kdelibs/CMakeFiles/CMakeTmp'
/usr/bin/cmake -E cmake_progress_report /home/kde-devel/kde/build/kdelibs/CMakeFiles/CMakeTmp/CMakeFiles 1
Building C object CMakeFiles/cmTryCompileExec.dir/CheckSymbolExists.o
/usr/bin/gcc  -I/usr/include/qt4   -o CMakeFiles/cmTryCompileExec.dir/CheckSymbolExists.o   -c /home/kde-devel/kde/build/kdelibs/CMakeFiles/CMakeTmp/CheckSymbolExists.c
/home/kde-devel/kde/build/kdelibs/CMakeFiles/CMakeTmp/CheckSymbolExists.c: In function ‘main’:
/home/kde-devel/kde/build/kdelibs/CMakeFiles/CMakeTmp/CheckSymbolExists.c:8: error: ‘Q_WS_QWS’ undeclared (first use in this function)
/home/kde-devel/kde/build/kdelibs/CMakeFiles/CMakeTmp/CheckSymbolExists.c:8: error: (Each undeclared identifier is reported only once
/home/kde-devel/kde/build/kdelibs/CMakeFiles/CMakeTmp/CheckSymbolExists.c:8: error: for each function it appears in.)
make[1]: *** [CMakeFiles/cmTryCompileExec.dir/CheckSymbolExists.o] Error 1
make[1]: Leaving directory `/home/kde-devel/kde/build/kdelibs/CMakeFiles/CMakeTmp'
make: *** [cmTryCompileExec/fast] Error 2

File /home/kde-devel/kde/build/kdelibs/CMakeFiles/CMakeTmp/CheckSymbolExists.c:
/* */
#include <QtCore/qglobal.h>

void cmakeRequireSymbol(int dummy,...){(void)dummy;}
int main()
{
#ifndef Q_WS_QWS
  cmakeRequireSymbol(0,&Q_WS_QWS);
#endif
  return 0;
}

Determining if the Q_WS_MAC exist failed with the following output:
/usr/bin/make -f CMakeFiles/cmTryCompileExec.dir/build.make CMakeFiles/cmTryCompileExec.dir/build
make[1]: Entering directory `/home/kde-devel/kde/build/kdelibs/CMakeFiles/CMakeTmp'
/usr/bin/cmake -E cmake_progress_report /home/kde-devel/kde/build/kdelibs/CMakeFiles/CMakeTmp/CMakeFiles 1
Building C object CMakeFiles/cmTryCompileExec.dir/CheckSymbolExists.o
/usr/bin/gcc  -I/usr/include/qt4   -o CMakeFiles/cmTryCompileExec.dir/CheckSymbolExists.o   -c /home/kde-devel/kde/build/kdelibs/CMakeFiles/CMakeTmp/CheckSymbolExists.c
/home/kde-devel/kde/build/kdelibs/CMakeFiles/CMakeTmp/CheckSymbolExists.c: In function ‘main’:
/home/kde-devel/kde/build/kdelibs/CMakeFiles/CMakeTmp/CheckSymbolExists.c:8: error: ‘Q_WS_MAC’ undeclared (first use in this function)
/home/kde-devel/kde/build/kdelibs/CMakeFiles/CMakeTmp/CheckSymbolExists.c:8: error: (Each undeclared identifier is reported only once
/home/kde-devel/kde/build/kdelibs/CMakeFiles/CMakeTmp/CheckSymbolExists.c:8: error: for each function it appears in.)
make[1]: *** [CMakeFiles/cmTryCompileExec.dir/CheckSymbolExists.o] Error 1
make[1]: Leaving directory `/home/kde-devel/kde/build/kdelibs/CMakeFiles/CMakeTmp'
make: *** [cmTryCompileExec/fast] Error 2

File /home/kde-devel/kde/build/kdelibs/CMakeFiles/CMakeTmp/CheckSymbolExists.c:
/* */
#include <QtCore/qglobal.h>

void cmakeRequireSymbol(int dummy,...){(void)dummy;}
int main()
{
#ifndef Q_WS_MAC
  cmakeRequireSymbol(0,&Q_WS_MAC);
#endif
  return 0;
}

Determining if the function pthread_create exists in the pthreads failed with the following output:
/usr/bin/make -f CMakeFiles/cmTryCompileExec.dir/build.make CMakeFiles/cmTryCompileExec.dir/build
make[1]: Entering directory `/home/kde-devel/kde/build/kdelibs/CMakeFiles/CMakeTmp'
/usr/bin/cmake -E cmake_progress_report /home/kde-devel/kde/build/kdelibs/CMakeFiles/CMakeTmp/CMakeFiles 1
Building C object CMakeFiles/cmTryCompileExec.dir/CheckFunctionExists.o
/usr/bin/gcc  -DCHECK_FUNCTION_EXISTS=pthread_create   -o CMakeFiles/cmTryCompileExec.dir/CheckFunctionExists.o   -c /usr/share/cmake-2.4/Modules/CheckFunctionExists.c
Linking C executable cmTryCompileExec
/usr/bin/cmake -P CMakeFiles/cmTryCompileExec.dir/cmake_clean_target.cmake
/usr/bin/gcc      -DCHECK_FUNCTION_EXISTS=pthread_create  -fPIC "CMakeFiles/cmTryCompileExec.dir/CheckFunctionExists.o"   -o cmTryCompileExec -rdynamic -lpthreads 
/usr/bin/ld: cannot find -lpthreads
collect2: ld returned 1 exit status
make[1]: *** [cmTryCompileExec] Error 1
make[1]: Leaving directory `/home/kde-devel/kde/build/kdelibs/CMakeFiles/CMakeTmp'
make: *** [cmTryCompileExec/fast] Error 2


Determining if files crt_externs.h exist failed with the following output:
/usr/bin/make -f CMakeFiles/cmTryCompileExec.dir/build.make CMakeFiles/cmTryCompileExec.dir/build
make[1]: Entering directory `/home/kde-devel/kde/build/kdelibs/CMakeFiles/CMakeTmp'
/usr/bin/cmake -E cmake_progress_report /home/kde-devel/kde/build/kdelibs/CMakeFiles/CMakeTmp/CMakeFiles 1
Building C object CMakeFiles/cmTryCompileExec.dir/CheckIncludeFiles.o
/usr/bin/gcc  -Wno-long-long -std=iso9899:1990 -Wundef -Wcast-align -Werror-implicit-function-declaration -Wchar-subscripts -Wall -W -Wpointer-arith -Wwrite-strings -Wformat-security -Wmissing-format-attribute -fno-common     -D_XOPEN_SOURCE=500 -D_BSD_SOURCE -D_GNU_SOURCE -o CMakeFiles/cmTryCompileExec.dir/CheckIncludeFiles.o   -c /home/kde-devel/kde/build/kdelibs/CMakeFiles/CMakeTmp/CheckIncludeFiles.c
make[1]: Leaving directory `/home/kde-devel/kde/build/kdelibs/CMakeFiles/CMakeTmp'
/home/kde-devel/kde/build/kdelibs/CMakeFiles/CMakeTmp/CheckIncludeFiles.c:2:25: error: crt_externs.h: No such file or directory
make[1]: *** [CMakeFiles/cmTryCompileExec.dir/CheckIncludeFiles.o] Error 1
make: *** [cmTryCompileExec/fast] Error 2

Source:
/* */
#include <crt_externs.h>


int main(){return 0;}

Determining if files sysent.h exist failed with the following output:
/usr/bin/make -f CMakeFiles/cmTryCompileExec.dir/build.make CMakeFiles/cmTryCompileExec.dir/build
make[1]: Entering directory `/home/kde-devel/kde/build/kdelibs/CMakeFiles/CMakeTmp'
/usr/bin/cmake -E cmake_progress_report /home/kde-devel/kde/build/kdelibs/CMakeFiles/CMakeTmp/CMakeFiles 1
Building C object CMakeFiles/cmTryCompileExec.dir/CheckIncludeFiles.o
/usr/bin/gcc  -Wno-long-long -std=iso9899:1990 -Wundef -Wcast-align -Werror-implicit-function-declaration -Wchar-subscripts -Wall -W -Wpointer-arith -Wwrite-strings -Wformat-security -Wmissing-format-attribute -fno-common     -D_XOPEN_SOURCE=500 -D_BSD_SOURCE -D_GNU_SOURCE -o CMakeFiles/cmTryCompileExec.dir/CheckIncludeFiles.o   -c /home/kde-devel/kde/build/kdelibs/CMakeFiles/CMakeTmp/CheckIncludeFiles.c
/home/kde-devel/kde/build/kdelibs/CMakeFiles/CMakeTmp/CheckIncludeFiles.c:2:20: error: sysent.h: No such file or directory
make[1]: Leaving directory `/home/kde-devel/kde/build/kdelibs/CMakeFiles/CMakeTmp'
make[1]: *** [CMakeFiles/cmTryCompileExec.dir/CheckIncludeFiles.o] Error 1
make: *** [cmTryCompileExec/fast] Error 2

Source:
/* */
#include <sysent.h>


int main(){return 0;}

Determining if files sys/ucred.h exist failed with the following output:
/usr/bin/make -f CMakeFiles/cmTryCompileExec.dir/build.make CMakeFiles/cmTryCompileExec.dir/build
make[1]: Entering directory `/home/kde-devel/kde/build/kdelibs/CMakeFiles/CMakeTmp'
/usr/bin/cmake -E cmake_progress_report /home/kde-devel/kde/build/kdelibs/CMakeFiles/CMakeTmp/CMakeFiles 1
Building C object CMakeFiles/cmTryCompileExec.dir/CheckIncludeFiles.o
/usr/bin/gcc  -Wno-long-long -std=iso9899:1990 -Wundef -Wcast-align -Werror-implicit-function-declaration -Wchar-subscripts -Wall -W -Wpointer-arith -Wwrite-strings -Wformat-security -Wmissing-format-attribute -fno-common     -D_XOPEN_SOURCE=500 -D_BSD_SOURCE -D_GNU_SOURCE -o CMakeFiles/cmTryCompileExec.dir/CheckIncludeFiles.o   -c /home/kde-devel/kde/build/kdelibs/CMakeFiles/CMakeTmp/CheckIncludeFiles.c
/home/kde-devel/kde/build/kdelibs/CMakeFiles/CMakeTmp/CheckIncludeFiles.c:2:23: error: sys/ucred.h: No such file or directory
make[1]: *** [CMakeFiles/cmTryCompileExec.dir/CheckIncludeFiles.o] Error 1
make[1]: Leaving directory `/home/kde-devel/kde/build/kdelibs/CMakeFiles/CMakeTmp'
make: *** [cmTryCompileExec/fast] Error 2

Source:
/* */
#include <sys/ucred.h>


int main(){return 0;}

Determining if files stdio.h;sys/mnttab.h exist failed with the following output:
/usr/bin/make -f CMakeFiles/cmTryCompileExec.dir/build.make CMakeFiles/cmTryCompileExec.dir/build
make[1]: Entering directory `/home/kde-devel/kde/build/kdelibs/CMakeFiles/CMakeTmp'
/usr/bin/cmake -E cmake_progress_report /home/kde-devel/kde/build/kdelibs/CMakeFiles/CMakeTmp/CMakeFiles 1
Building C object CMakeFiles/cmTryCompileExec.dir/CheckIncludeFiles.o
/usr/bin/gcc  -Wno-long-long -std=iso9899:1990 -Wundef -Wcast-align -Werror-implicit-function-declaration -Wchar-subscripts -Wall -W -Wpointer-arith -Wwrite-strings -Wformat-security -Wmissing-format-attribute -fno-common     -D_XOPEN_SOURCE=500 -D_BSD_SOURCE -D_GNU_SOURCE -o CMakeFiles/cmTryCompileExec.dir/CheckIncludeFiles.o   -c /home/kde-devel/kde/build/kdelibs/CMakeFiles/CMakeTmp/CheckIncludeFiles.c
/home/kde-devel/kde/build/kdelibs/CMakeFiles/CMakeTmp/CheckIncludeFiles.c:3:24: error: sys/mnttab.h: No such file or directory
make[1]: Leaving directory `/home/kde-devel/kde/build/kdelibs/CMakeFiles/CMakeTmp'
make[1]: *** [CMakeFiles/cmTryCompileExec.dir/CheckIncludeFiles.o] Error 1
make: *** [cmTryCompileExec/fast] Error 2

Source:
/* */
#include <stdio.h>
#include <sys/mnttab.h>


int main(){return 0;}

Determining if files sys/mntent.h exist failed with the following output:
/usr/bin/make -f CMakeFiles/cmTryCompileExec.dir/build.make CMakeFiles/cmTryCompileExec.dir/build
make[1]: Entering directory `/home/kde-devel/kde/build/kdelibs/CMakeFiles/CMakeTmp'
/usr/bin/cmake -E cmake_progress_report /home/kde-devel/kde/build/kdelibs/CMakeFiles/CMakeTmp/CMakeFiles 1
Building C object CMakeFiles/cmTryCompileExec.dir/CheckIncludeFiles.o
/usr/bin/gcc  -Wno-long-long -std=iso9899:1990 -Wundef -Wcast-align -Werror-implicit-function-declaration -Wchar-subscripts -Wall -W -Wpointer-arith -Wwrite-strings -Wformat-security -Wmissing-format-attribute -fno-common     -D_XOPEN_SOURCE=500 -D_BSD_SOURCE -D_GNU_SOURCE -o CMakeFiles/cmTryCompileExec.dir/CheckIncludeFiles.o   -c /home/kde-devel/kde/build/kdelibs/CMakeFiles/CMakeTmp/CheckIncludeFiles.c
/home/kde-devel/kde/build/kdelibs/CMakeFiles/CMakeTmp/CheckIncludeFiles.c:2:24: error: sys/mntent.h: No such file or directory
make[1]: Leaving directory `/home/kde-devel/kde/build/kdelibs/CMakeFiles/CMakeTmp'
make[1]: *** [CMakeFiles/cmTryCompileExec.dir/CheckIncludeFiles.o] Error 1
make: *** [cmTryCompileExec/fast] Error 2

Source:
/* */
#include <sys/mntent.h>


int main(){return 0;}

Determining if files valgrind/memcheck.h exist failed with the following output:
/usr/bin/make -f CMakeFiles/cmTryCompileExec.dir/build.make CMakeFiles/cmTryCompileExec.dir/build
make[1]: Entering directory `/home/kde-devel/kde/build/kdelibs/CMakeFiles/CMakeTmp'
/usr/bin/cmake -E cmake_progress_report /home/kde-devel/kde/build/kdelibs/CMakeFiles/CMakeTmp/CMakeFiles 1
Building C object CMakeFiles/cmTryCompileExec.dir/CheckIncludeFiles.o
/usr/bin/gcc  -Wno-long-long -std=iso9899:1990 -Wundef -Wcast-align -Werror-implicit-function-declaration -Wchar-subscripts -Wall -W -Wpointer-arith -Wwrite-strings -Wformat-security -Wmissing-format-attribute -fno-common     -D_XOPEN_SOURCE=500 -D_BSD_SOURCE -D_GNU_SOURCE -o CMakeFiles/cmTryCompileExec.dir/CheckIncludeFiles.o   -c /home/kde-devel/kde/build/kdelibs/CMakeFiles/CMakeTmp/CheckIncludeFiles.c
/home/kde-devel/kde/build/kdelibs/CMakeFiles/CMakeTmp/CheckIncludeFiles.c:2:31: error: valgrind/memcheck.h: No such file or directory
make[1]: *** [CMakeFiles/cmTryCompileExec.dir/CheckIncludeFiles.o] Error 1
make[1]: Leaving directory `/home/kde-devel/kde/build/kdelibs/CMakeFiles/CMakeTmp'
make: *** [cmTryCompileExec/fast] Error 2

Source:
/* */
#include <valgrind/memcheck.h>


int main(){return 0;}

Determining if files crtdbg.h exist failed with the following output:
/usr/bin/make -f CMakeFiles/cmTryCompileExec.dir/build.make CMakeFiles/cmTryCompileExec.dir/build
make[1]: Entering directory `/home/kde-devel/kde/build/kdelibs/CMakeFiles/CMakeTmp'
/usr/bin/cmake -E cmake_progress_report /home/kde-devel/kde/build/kdelibs/CMakeFiles/CMakeTmp/CMakeFiles 1
Building C object CMakeFiles/cmTryCompileExec.dir/CheckIncludeFiles.o
/usr/bin/gcc  -Wno-long-long -std=iso9899:1990 -Wundef -Wcast-align -Werror-implicit-function-declaration -Wchar-subscripts -Wall -W -Wpointer-arith -Wwrite-strings -Wformat-security -Wmissing-format-attribute -fno-common     -D_XOPEN_SOURCE=500 -D_BSD_SOURCE -D_GNU_SOURCE -o CMakeFiles/cmTryCompileExec.dir/CheckIncludeFiles.o   -c /home/kde-devel/kde/build/kdelibs/CMakeFiles/CMakeTmp/CheckIncludeFiles.c
/home/kde-devel/kde/build/kdelibs/CMakeFiles/CMakeTmp/CheckIncludeFiles.c:2:20: error: crtdbg.h: No such file or directory
make[1]: *** [CMakeFiles/cmTryCompileExec.dir/CheckIncludeFiles.o] Error 1
make[1]: Leaving directory `/home/kde-devel/kde/build/kdelibs/CMakeFiles/CMakeTmp'
make: *** [cmTryCompileExec/fast] Error 2

Source:
/* */
#include <crtdbg.h>


int main(){return 0;}

Determining if files arpa/nameser8_compat.h exist failed with the following output:
/usr/bin/make -f CMakeFiles/cmTryCompileExec.dir/build.make CMakeFiles/cmTryCompileExec.dir/build
make[1]: Entering directory `/home/kde-devel/kde/build/kdelibs/CMakeFiles/CMakeTmp'
/usr/bin/cmake -E cmake_progress_report /home/kde-devel/kde/build/kdelibs/CMakeFiles/CMakeTmp/CMakeFiles 1
Building C object CMakeFiles/cmTryCompileExec.dir/CheckIncludeFiles.o
/usr/bin/gcc  -Wno-long-long -std=iso9899:1990 -Wundef -Wcast-align -Werror-implicit-function-declaration -Wchar-subscripts -Wall -W -Wpointer-arith -Wwrite-strings -Wformat-security -Wmissing-format-attribute -fno-common     -D_XOPEN_SOURCE=500 -D_BSD_SOURCE -D_GNU_SOURCE -o CMakeFiles/cmTryCompileExec.dir/CheckIncludeFiles.o   -c /home/kde-devel/kde/build/kdelibs/CMakeFiles/CMakeTmp/CheckIncludeFiles.c
/home/kde-devel/kde/build/kdelibs/CMakeFiles/CMakeTmp/CheckIncludeFiles.c:2:34: error: arpa/nameser8_compat.h: No such file or directory
make[1]: Leaving directory `/home/kde-devel/kde/build/kdelibs/CMakeFiles/CMakeTmp'
make[1]: *** [CMakeFiles/cmTryCompileExec.dir/CheckIncludeFiles.o] Error 1
make: *** [cmTryCompileExec/fast] Error 2

Source:
/* */
#include <arpa/nameser8_compat.h>


int main(){return 0;}

Determining if the function getpeereid exists failed with the following output:
/usr/bin/make -f CMakeFiles/cmTryCompileExec.dir/build.make CMakeFiles/cmTryCompileExec.dir/build
make[1]: Entering directory `/home/kde-devel/kde/build/kdelibs/CMakeFiles/CMakeTmp'
/usr/bin/cmake -E cmake_progress_report /home/kde-devel/kde/build/kdelibs/CMakeFiles/CMakeTmp/CMakeFiles 1
Building C object CMakeFiles/cmTryCompileExec.dir/CheckFunctionExists.o
/usr/bin/gcc  -Wno-long-long -std=iso9899:1990 -Wundef -Wcast-align -Werror-implicit-function-declaration -Wchar-subscripts -Wall -W -Wpointer-arith -Wwrite-strings -Wformat-security -Wmissing-format-attribute -fno-common  -DCHECK_FUNCTION_EXISTS=getpeereid   -D_XOPEN_SOURCE=500 -D_BSD_SOURCE -D_GNU_SOURCE -o CMakeFiles/cmTryCompileExec.dir/CheckFunctionExists.o   -c /usr/share/cmake-2.4/Modules/CheckFunctionExists.c
Linking C executable cmTryCompileExec
/usr/bin/cmake -P CMakeFiles/cmTryCompileExec.dir/cmake_clean_target.cmake
/usr/bin/gcc     -Wno-long-long -std=iso9899:1990 -Wundef -Wcast-align -Werror-implicit-function-declaration -Wchar-subscripts -Wall -W -Wpointer-arith -Wwrite-strings -Wformat-security -Wmissing-format-attribute -fno-common  -DCHECK_FUNCTION_EXISTS=getpeereid  -fPIC "CMakeFiles/cmTryCompileExec.dir/CheckFunctionExists.o"   -o cmTryCompileExec -rdynamic 
CMakeFiles/cmTryCompileExec.dir/CheckFunctionExists.o: In function `main':
CheckFunctionExists.c:(.text+0x15): undefined reference to `getpeereid'
collect2: ld returned 1 exit status
make[1]: *** [cmTryCompileExec] Error 1
make[1]: Leaving directory `/home/kde-devel/kde/build/kdelibs/CMakeFiles/CMakeTmp'
make: *** [cmTryCompileExec/fast] Error 2


Determining if the function _NSGetEnviron exists failed with the following output:
/usr/bin/make -f CMakeFiles/cmTryCompileExec.dir/build.make CMakeFiles/cmTryCompileExec.dir/build
make[1]: Entering directory `/home/kde-devel/kde/build/kdelibs/CMakeFiles/CMakeTmp'
/usr/bin/cmake -E cmake_progress_report /home/kde-devel/kde/build/kdelibs/CMakeFiles/CMakeTmp/CMakeFiles 1
Building C object CMakeFiles/cmTryCompileExec.dir/CheckFunctionExists.o
/usr/bin/gcc  -Wno-long-long -std=iso9899:1990 -Wundef -Wcast-align -Werror-implicit-function-declaration -Wchar-subscripts -Wall -W -Wpointer-arith -Wwrite-strings -Wformat-security -Wmissing-format-attribute -fno-common  -DCHECK_FUNCTION_EXISTS=_NSGetEnviron   -D_XOPEN_SOURCE=500 -D_BSD_SOURCE -D_GNU_SOURCE -o CMakeFiles/cmTryCompileExec.dir/CheckFunctionExists.o   -c /usr/share/cmake-2.4/Modules/CheckFunctionExists.c
Linking C executable cmTryCompileExec
/usr/bin/cmake -P CMakeFiles/cmTryCompileExec.dir/cmake_clean_target.cmake
/usr/bin/gcc     -Wno-long-long -std=iso9899:1990 -Wundef -Wcast-align -Werror-implicit-function-declaration -Wchar-subscripts -Wall -W -Wpointer-arith -Wwrite-strings -Wformat-security -Wmissing-format-attribute -fno-common  -DCHECK_FUNCTION_EXISTS=_NSGetEnviron  -fPIC "CMakeFiles/cmTryCompileExec.dir/CheckFunctionExists.o"   -o cmTryCompileExec -rdynamic 
CMakeFiles/cmTryCompileExec.dir/CheckFunctionExists.o: In function `main':
CheckFunctionExists.c:(.text+0x15): undefined reference to `_NSGetEnviron'
collect2: ld returned 1 exit status
make[1]: *** [cmTryCompileExec] Error 1
make[1]: Leaving directory `/home/kde-devel/kde/build/kdelibs/CMakeFiles/CMakeTmp'
make: *** [cmTryCompileExec/fast] Error 2


Determining if the function volmgt_running exists in the volmgt failed with the following output:
/usr/bin/make -f CMakeFiles/cmTryCompileExec.dir/build.make CMakeFiles/cmTryCompileExec.dir/build
make[1]: Entering directory `/home/kde-devel/kde/build/kdelibs/CMakeFiles/CMakeTmp'
/usr/bin/cmake -E cmake_progress_report /home/kde-devel/kde/build/kdelibs/CMakeFiles/CMakeTmp/CMakeFiles 1
Building C object CMakeFiles/cmTryCompileExec.dir/CheckFunctionExists.o
/usr/bin/gcc  -Wno-long-long -std=iso9899:1990 -Wundef -Wcast-align -Werror-implicit-function-declaration -Wchar-subscripts -Wall -W -Wpointer-arith -Wwrite-strings -Wformat-security -Wmissing-format-attribute -fno-common  -DCHECK_FUNCTION_EXISTS=volmgt_running   -D_XOPEN_SOURCE=500 -D_BSD_SOURCE -D_GNU_SOURCE -o CMakeFiles/cmTryCompileExec.dir/CheckFunctionExists.o   -c /usr/share/cmake-2.4/Modules/CheckFunctionExists.c
Linking C executable cmTryCompileExec
/usr/bin/cmake -P CMakeFiles/cmTryCompileExec.dir/cmake_clean_target.cmake
/usr/bin/gcc     -Wno-long-long -std=iso9899:1990 -Wundef -Wcast-align -Werror-implicit-function-declaration -Wchar-subscripts -Wall -W -Wpointer-arith -Wwrite-strings -Wformat-security -Wmissing-format-attribute -fno-common  -DCHECK_FUNCTION_EXISTS=volmgt_running  -fPIC "CMakeFiles/cmTryCompileExec.dir/CheckFunctionExists.o"   -o cmTryCompileExec -rdynamic -lvolmgt 
/usr/bin/ld: cannot find -lvolmgt
collect2: ld returned 1 exit status
make[1]: *** [cmTryCompileExec] Error 1
make[1]: Leaving directory `/home/kde-devel/kde/build/kdelibs/CMakeFiles/CMakeTmp'
make: *** [cmTryCompileExec/fast] Error 2


Determining if the function res_init exists in the resolv failed with the following output:
/usr/bin/make -f CMakeFiles/cmTryCompileExec.dir/build.make CMakeFiles/cmTryCompileExec.dir/build
make[1]: Entering directory `/home/kde-devel/kde/build/kdelibs/CMakeFiles/CMakeTmp'
/usr/bin/cmake -E cmake_progress_report /home/kde-devel/kde/build/kdelibs/CMakeFiles/CMakeTmp/CMakeFiles 1
Building C object CMakeFiles/cmTryCompileExec.dir/CheckFunctionExists.o
/usr/bin/gcc  -Wno-long-long -std=iso9899:1990 -Wundef -Wcast-align -Werror-implicit-function-declaration -Wchar-subscripts -Wall -W -Wpointer-arith -Wwrite-strings -Wformat-security -Wmissing-format-attribute -fno-common  -DCHECK_FUNCTION_EXISTS=res_init   -D_XOPEN_SOURCE=500 -D_BSD_SOURCE -D_GNU_SOURCE -o CMakeFiles/cmTryCompileExec.dir/CheckFunctionExists.o   -c /usr/share/cmake-2.4/Modules/CheckFunctionExists.c
Linking C executable cmTryCompileExec
/usr/bin/cmake -P CMakeFiles/cmTryCompileExec.dir/cmake_clean_target.cmake
/usr/bin/gcc     -Wno-long-long -std=iso9899:1990 -Wundef -Wcast-align -Werror-implicit-function-declaration -Wchar-subscripts -Wall -W -Wpointer-arith -Wwrite-strings -Wformat-security -Wmissing-format-attribute -fno-common  -DCHECK_FUNCTION_EXISTS=res_init  -fPIC "CMakeFiles/cmTryCompileExec.dir/CheckFunctionExists.o"   -o cmTryCompileExec -rdynamic -lresolv 
CMakeFiles/cmTryCompileExec.dir/CheckFunctionExists.o: In function `main':
CheckFunctionExists.c:(.text+0x15): undefined reference to `res_init'
collect2: ld returned 1 exit status
make[1]: *** [cmTryCompileExec] Error 1
make[1]: Leaving directory `/home/kde-devel/kde/build/kdelibs/CMakeFiles/CMakeTmp'
make: *** [cmTryCompileExec/fast] Error 2


Determining if files sys/types.h;libutil.h exist failed with the following output:
/usr/bin/make -f CMakeFiles/cmTryCompileExec.dir/build.make CMakeFiles/cmTryCompileExec.dir/build
make[1]: Entering directory `/home/kde-devel/kde/build/kdelibs/CMakeFiles/CMakeTmp'
/usr/bin/cmake -E cmake_progress_report /home/kde-devel/kde/build/kdelibs/CMakeFiles/CMakeTmp/CMakeFiles 1
Building C object CMakeFiles/cmTryCompileExec.dir/CheckIncludeFiles.o
/usr/bin/gcc  -Wno-long-long -std=iso9899:1990 -Wundef -Wcast-align -Werror-implicit-function-declaration -Wchar-subscripts -Wall -W -Wpointer-arith -Wwrite-strings -Wformat-security -Wmissing-format-attribute -fno-common     -D_XOPEN_SOURCE=500 -D_BSD_SOURCE -D_GNU_SOURCE -o CMakeFiles/cmTryCompileExec.dir/CheckIncludeFiles.o   -c /home/kde-devel/kde/build/kdelibs/CMakeFiles/CMakeTmp/CheckIncludeFiles.c
/home/kde-devel/kde/build/kdelibs/CMakeFiles/CMakeTmp/CheckIncludeFiles.c:3:21: error: libutil.h: No such file or directory
make[1]: Leaving directory `/home/kde-devel/kde/build/kdelibs/CMakeFiles/CMakeTmp'
make[1]: *** [CMakeFiles/cmTryCompileExec.dir/CheckIncludeFiles.o] Error 1
make: *** [cmTryCompileExec/fast] Error 2

Source:
/* */
#include <sys/types.h>
#include <libutil.h>


int main(){return 0;}

Determining if files util.h exist failed with the following output:
/usr/bin/make -f CMakeFiles/cmTryCompileExec.dir/build.make CMakeFiles/cmTryCompileExec.dir/build
make[1]: Entering directory `/home/kde-devel/kde/build/kdelibs/CMakeFiles/CMakeTmp'
/usr/bin/cmake -E cmake_progress_report /home/kde-devel/kde/build/kdelibs/CMakeFiles/CMakeTmp/CMakeFiles 1
Building C object CMakeFiles/cmTryCompileExec.dir/CheckIncludeFiles.o
/usr/bin/gcc  -Wno-long-long -std=iso9899:1990 -Wundef -Wcast-align -Werror-implicit-function-declaration -Wchar-subscripts -Wall -W -Wpointer-arith -Wwrite-strings -Wformat-security -Wmissing-format-attribute -fno-common     -D_XOPEN_SOURCE=500 -D_BSD_SOURCE -D_GNU_SOURCE -o CMakeFiles/cmTryCompileExec.dir/CheckIncludeFiles.o   -c /home/kde-devel/kde/build/kdelibs/CMakeFiles/CMakeTmp/CheckIncludeFiles.c
/home/kde-devel/kde/build/kdelibs/CMakeFiles/CMakeTmp/CheckIncludeFiles.c:2:18: error: util.h: No such file or directory
make[1]: *** [CMakeFiles/cmTryCompileExec.dir/CheckIncludeFiles.o] Error 1
make[1]: Leaving directory `/home/kde-devel/kde/build/kdelibs/CMakeFiles/CMakeTmp'
make: *** [cmTryCompileExec/fast] Error 2

Source:
/* */
#include <util.h>


int main(){return 0;}

Determining if files sys/filio.h exist failed with the following output:
/usr/bin/make -f CMakeFiles/cmTryCompileExec.dir/build.make CMakeFiles/cmTryCompileExec.dir/build
make[1]: Entering directory `/home/kde-devel/kde/build/kdelibs/CMakeFiles/CMakeTmp'
/usr/bin/cmake -E cmake_progress_report /home/kde-devel/kde/build/kdelibs/CMakeFiles/CMakeTmp/CMakeFiles 1
Building C object CMakeFiles/cmTryCompileExec.dir/CheckIncludeFiles.o
/usr/bin/gcc  -Wno-long-long -std=iso9899:1990 -Wundef -Wcast-align -Werror-implicit-function-declaration -Wchar-subscripts -Wall -W -Wpointer-arith -Wwrite-strings -Wformat-security -Wmissing-format-attribute -fno-common     -D_XOPEN_SOURCE=500 -D_BSD_SOURCE -D_GNU_SOURCE -o CMakeFiles/cmTryCompileExec.dir/CheckIncludeFiles.o   -c /home/kde-devel/kde/build/kdelibs/CMakeFiles/CMakeTmp/CheckIncludeFiles.c
/home/kde-devel/kde/build/kdelibs/CMakeFiles/CMakeTmp/CheckIncludeFiles.c:2:23: error: sys/filio.h: No such file or directory
make[1]: *** [CMakeFiles/cmTryCompileExec.dir/CheckIncludeFiles.o] Error 1
make[1]: Leaving directory `/home/kde-devel/kde/build/kdelibs/CMakeFiles/CMakeTmp'
make: *** [cmTryCompileExec/fast] Error 2

Source:
/* */
#include <sys/filio.h>


int main(){return 0;}

Determining if the function addToUtmp exists in the utempter failed with the following output:
/usr/bin/make -f CMakeFiles/cmTryCompileExec.dir/build.make CMakeFiles/cmTryCompileExec.dir/build
make[1]: Entering directory `/home/kde-devel/kde/build/kdelibs/CMakeFiles/CMakeTmp'
/usr/bin/cmake -E cmake_progress_report /home/kde-devel/kde/build/kdelibs/CMakeFiles/CMakeTmp/CMakeFiles 1
Building C object CMakeFiles/cmTryCompileExec.dir/CheckFunctionExists.o
/usr/bin/gcc  -Wno-long-long -std=iso9899:1990 -Wundef -Wcast-align -Werror-implicit-function-declaration -Wchar-subscripts -Wall -W -Wpointer-arith -Wwrite-strings -Wformat-security -Wmissing-format-attribute -fno-common  -DCHECK_FUNCTION_EXISTS=addToUtmp   -D_XOPEN_SOURCE=500 -D_BSD_SOURCE -D_GNU_SOURCE -o CMakeFiles/cmTryCompileExec.dir/CheckFunctionExists.o   -c /usr/share/cmake-2.4/Modules/CheckFunctionExists.c
Linking C executable cmTryCompileExec
/usr/bin/cmake -P CMakeFiles/cmTryCompileExec.dir/cmake_clean_target.cmake
/usr/bin/gcc     -Wno-long-long -std=iso9899:1990 -Wundef -Wcast-align -Werror-implicit-function-declaration -Wchar-subscripts -Wall -W -Wpointer-arith -Wwrite-strings -Wformat-security -Wmissing-format-attribute -fno-common  -DCHECK_FUNCTION_EXISTS=addToUtmp  -fPIC "CMakeFiles/cmTryCompileExec.dir/CheckFunctionExists.o"   -o cmTryCompileExec -rdynamic -lutempter 
/usr/bin/ld: cannot find -lutempter
collect2: ld returned 1 exit status
make[1]: Leaving directory `/home/kde-devel/kde/build/kdelibs/CMakeFiles/CMakeTmp'
make[1]: *** [cmTryCompileExec] Error 1
make: *** [cmTryCompileExec/fast] Error 2


Determining if files utempter.h exist failed with the following output:
/usr/bin/make -f CMakeFiles/cmTryCompileExec.dir/build.make CMakeFiles/cmTryCompileExec.dir/build
make[1]: Entering directory `/home/kde-devel/kde/build/kdelibs/CMakeFiles/CMakeTmp'
/usr/bin/cmake -E cmake_progress_report /home/kde-devel/kde/build/kdelibs/CMakeFiles/CMakeTmp/CMakeFiles 1
Building C object CMakeFiles/cmTryCompileExec.dir/CheckIncludeFiles.o
/usr/bin/gcc  -Wno-long-long -std=iso9899:1990 -Wundef -Wcast-align -Werror-implicit-function-declaration -Wchar-subscripts -Wall -W -Wpointer-arith -Wwrite-strings -Wformat-security -Wmissing-format-attribute -fno-common     -D_XOPEN_SOURCE=500 -D_BSD_SOURCE -D_GNU_SOURCE -o CMakeFiles/cmTryCompileExec.dir/CheckIncludeFiles.o   -c /home/kde-devel/kde/build/kdelibs/CMakeFiles/CMakeTmp/CheckIncludeFiles.c
/home/kde-devel/kde/build/kdelibs/CMakeFiles/CMakeTmp/CheckIncludeFiles.c:2:22: error: utempter.h: No such file or directory
make[1]: *** [CMakeFiles/cmTryCompileExec.dir/CheckIncludeFiles.o] Error 1
make[1]: Leaving directory `/home/kde-devel/kde/build/kdelibs/CMakeFiles/CMakeTmp'
make: *** [cmTryCompileExec/fast] Error 2

Source:
/* */
#include <utempter.h>


int main(){return 0;}

Determining if the function login exists failed with the following output:
/usr/bin/make -f CMakeFiles/cmTryCompileExec.dir/build.make CMakeFiles/cmTryCompileExec.dir/build
make[1]: Entering directory `/home/kde-devel/kde/build/kdelibs/CMakeFiles/CMakeTmp'
/usr/bin/cmake -E cmake_progress_report /home/kde-devel/kde/build/kdelibs/CMakeFiles/CMakeTmp/CMakeFiles 1
Building C object CMakeFiles/cmTryCompileExec.dir/CheckFunctionExists.o
/usr/bin/gcc  -Wno-long-long -std=iso9899:1990 -Wundef -Wcast-align -Werror-implicit-function-declaration -Wchar-subscripts -Wall -W -Wpointer-arith -Wwrite-strings -Wformat-security -Wmissing-format-attribute -fno-common  -DCHECK_FUNCTION_EXISTS=login   -D_XOPEN_SOURCE=500 -D_BSD_SOURCE -D_GNU_SOURCE -o CMakeFiles/cmTryCompileExec.dir/CheckFunctionExists.o   -c /usr/share/cmake-2.4/Modules/CheckFunctionExists.c
Linking C executable cmTryCompileExec
/usr/bin/cmake -P CMakeFiles/cmTryCompileExec.dir/cmake_clean_target.cmake
/usr/bin/gcc     -Wno-long-long -std=iso9899:1990 -Wundef -Wcast-align -Werror-implicit-function-declaration -Wchar-subscripts -Wall -W -Wpointer-arith -Wwrite-strings -Wformat-security -Wmissing-format-attribute -fno-common  -DCHECK_FUNCTION_EXISTS=login  -fPIC "CMakeFiles/cmTryCompileExec.dir/CheckFunctionExists.o"   -o cmTryCompileExec -rdynamic 
CMakeFiles/cmTryCompileExec.dir/CheckFunctionExists.o: In function `main':
CheckFunctionExists.c:(.text+0x15): undefined reference to `login'
collect2: ld returned 1 exit status
make[1]: *** [cmTryCompileExec] Error 1
make[1]: Leaving directory `/home/kde-devel/kde/build/kdelibs/CMakeFiles/CMakeTmp'
make: *** [cmTryCompileExec/fast] Error 2


Performing C++ SOURCE FILE Test HAVE_STRUCT_UTMP_UT_SYSLEN failed with the following output:
/usr/bin/make -f CMakeFiles/cmTryCompileExec.dir/build.make CMakeFiles/cmTryCompileExec.dir/build
make[1]: Entering directory `/home/kde-devel/kde/build/kdelibs/CMakeFiles/CMakeTmp'
/usr/bin/cmake -E cmake_progress_report /home/kde-devel/kde/build/kdelibs/CMakeFiles/CMakeTmp/CMakeFiles 1
Building CXX object CMakeFiles/cmTryCompileExec.dir/src.o
/usr/bin/c++   -Wnon-virtual-dtor -Wno-long-long -ansi -Wundef -Wcast-align -Wchar-subscripts -Wall -W -Wpointer-arith -Wformat-security -fno-exceptions -fno-check-new -fno-common -Woverloaded-virtual -fvisibility=hidden  -DHAVE_STRUCT_UTMP_UT_SYSLEN   -D_XOPEN_SOURCE=500 -D_BSD_SOURCE -D_GNU_SOURCE -o CMakeFiles/cmTryCompileExec.dir/src.o -c /home/kde-devel/kde/build/kdelibs/CMakeFiles/CMakeTmp/src.cxx
/home/kde-devel/kde/build/kdelibs/CMakeFiles/CMakeTmp/src.cxx: In function ‘int main()’:
/home/kde-devel/kde/build/kdelibs/CMakeFiles/CMakeTmp/src.cxx:7: error: ‘struct utmp’ has no member named ‘ut_syslen’
make[1]: Leaving directory `/home/kde-devel/kde/build/kdelibs/CMakeFiles/CMakeTmp'
make[1]: *** [CMakeFiles/cmTryCompileExec.dir/src.o] Error 1
make: *** [cmTryCompileExec/fast] Error 2

Source file was:

#include <utmp.h>

int main()
{
   struct utmp* tmp;
   tmp->ut_syslen;
  return 0;
}

Determining if the function openpty exists failed with the following output:
/usr/bin/make -f CMakeFiles/cmTryCompileExec.dir/build.make CMakeFiles/cmTryCompileExec.dir/build
make[1]: Entering directory `/home/kde-devel/kde/build/kdelibs/CMakeFiles/CMakeTmp'
/usr/bin/cmake -E cmake_progress_report /home/kde-devel/kde/build/kdelibs/CMakeFiles/CMakeTmp/CMakeFiles 1
Building C object CMakeFiles/cmTryCompileExec.dir/CheckFunctionExists.o
/usr/bin/gcc  -Wno-long-long -std=iso9899:1990 -Wundef -Wcast-align -Werror-implicit-function-declaration -Wchar-subscripts -Wall -W -Wpointer-arith -Wwrite-strings -Wformat-security -Wmissing-format-attribute -fno-common  -DCHECK_FUNCTION_EXISTS=openpty   -D_XOPEN_SOURCE=500 -D_BSD_SOURCE -D_GNU_SOURCE -o CMakeFiles/cmTryCompileExec.dir/CheckFunctionExists.o   -c /usr/share/cmake-2.4/Modules/CheckFunctionExists.c
Linking C executable cmTryCompileExec
/usr/bin/cmake -P CMakeFiles/cmTryCompileExec.dir/cmake_clean_target.cmake
/usr/bin/gcc     -Wno-long-long -std=iso9899:1990 -Wundef -Wcast-align -Werror-implicit-function-declaration -Wchar-subscripts -Wall -W -Wpointer-arith -Wwrite-strings -Wformat-security -Wmissing-format-attribute -fno-common  -DCHECK_FUNCTION_EXISTS=openpty  -fPIC "CMakeFiles/cmTryCompileExec.dir/CheckFunctionExists.o"   -o cmTryCompileExec -rdynamic 
CMakeFiles/cmTryCompileExec.dir/CheckFunctionExists.o: In function `main':
CheckFunctionExists.c:(.text+0x15): undefined reference to `openpty'
collect2: ld returned 1 exit status
make[1]: *** [cmTryCompileExec] Error 1
make[1]: Leaving directory `/home/kde-devel/kde/build/kdelibs/CMakeFiles/CMakeTmp'
make: *** [cmTryCompileExec/fast] Error 2


Determining if the function getmntinfo exists failed with the following output:
/usr/bin/make -f CMakeFiles/cmTryCompileExec.dir/build.make CMakeFiles/cmTryCompileExec.dir/build
make[1]: Entering directory `/home/kde-devel/kde/build/kdelibs/CMakeFiles/CMakeTmp'
/usr/bin/cmake -E cmake_progress_report /home/kde-devel/kde/build/kdelibs/CMakeFiles/CMakeTmp/CMakeFiles 1
Building C object CMakeFiles/cmTryCompileExec.dir/CheckFunctionExists.o
/usr/bin/gcc  -Wno-long-long -std=iso9899:1990 -Wundef -Wcast-align -Werror-implicit-function-declaration -Wchar-subscripts -Wall -W -Wpointer-arith -Wwrite-strings -Wformat-security -Wmissing-format-attribute -fno-common  -DCHECK_FUNCTION_EXISTS=getmntinfo   -D_XOPEN_SOURCE=500 -D_BSD_SOURCE -D_GNU_SOURCE -o CMakeFiles/cmTryCompileExec.dir/CheckFunctionExists.o   -c /usr/share/cmake-2.4/Modules/CheckFunctionExists.c
Linking C executable cmTryCompileExec
/usr/bin/cmake -P CMakeFiles/cmTryCompileExec.dir/cmake_clean_target.cmake
/usr/bin/gcc     -Wno-long-long -std=iso9899:1990 -Wundef -Wcast-align -Werror-implicit-function-declaration -Wchar-subscripts -Wall -W -Wpointer-arith -Wwrite-strings -Wformat-security -Wmissing-format-attribute -fno-common  -DCHECK_FUNCTION_EXISTS=getmntinfo  -fPIC "CMakeFiles/cmTryCompileExec.dir/CheckFunctionExists.o"   -o cmTryCompileExec -rdynamic 
CMakeFiles/cmTryCompileExec.dir/CheckFunctionExists.o: In function `main':
CheckFunctionExists.c:(.text+0x15): undefined reference to `getmntinfo'
collect2: ld returned 1 exit status
make[1]: *** [cmTryCompileExec] Error 1
make[1]: Leaving directory `/home/kde-devel/kde/build/kdelibs/CMakeFiles/CMakeTmp'
make: *** [cmTryCompileExec/fast] Error 2


Determining if the function mkstemps exists failed with the following output:
/usr/bin/make -f CMakeFiles/cmTryCompileExec.dir/build.make CMakeFiles/cmTryCompileExec.dir/build
make[1]: Entering directory `/home/kde-devel/kde/build/kdelibs/CMakeFiles/CMakeTmp'
/usr/bin/cmake -E cmake_progress_report /home/kde-devel/kde/build/kdelibs/CMakeFiles/CMakeTmp/CMakeFiles 1
Building C object CMakeFiles/cmTryCompileExec.dir/CheckFunctionExists.o
/usr/bin/gcc  -Wno-long-long -std=iso9899:1990 -Wundef -Wcast-align -Werror-implicit-function-declaration -Wchar-subscripts -Wall -W -Wpointer-arith -Wwrite-strings -Wformat-security -Wmissing-format-attribute -fno-common  -DCHECK_FUNCTION_EXISTS=mkstemps   -D_XOPEN_SOURCE=500 -D_BSD_SOURCE -D_GNU_SOURCE -o CMakeFiles/cmTryCompileExec.dir/CheckFunctionExists.o   -c /usr/share/cmake-2.4/Modules/CheckFunctionExists.c
Linking C executable cmTryCompileExec
/usr/bin/cmake -P CMakeFiles/cmTryCompileExec.dir/cmake_clean_target.cmake
/usr/bin/gcc     -Wno-long-long -std=iso9899:1990 -Wundef -Wcast-align -Werror-implicit-function-declaration -Wchar-subscripts -Wall -W -Wpointer-arith -Wwrite-strings -Wformat-security -Wmissing-format-attribute -fno-common  -DCHECK_FUNCTION_EXISTS=mkstemps  -fPIC "CMakeFiles/cmTryCompileExec.dir/CheckFunctionExists.o"   -o cmTryCompileExec -rdynamic 
CMakeFiles/cmTryCompileExec.dir/CheckFunctionExists.o: In function `main':
CheckFunctionExists.c:(.text+0x15): undefined reference to `mkstemps'
collect2: ld returned 1 exit status
make[1]: *** [cmTryCompileExec] Error 1
make[1]: Leaving directory `/home/kde-devel/kde/build/kdelibs/CMakeFiles/CMakeTmp'
make: *** [cmTryCompileExec/fast] Error 2


Determining if the function strlcpy exists failed with the following output:
/usr/bin/make -f CMakeFiles/cmTryCompileExec.dir/build.make CMakeFiles/cmTryCompileExec.dir/build
make[1]: Entering directory `/home/kde-devel/kde/build/kdelibs/CMakeFiles/CMakeTmp'
/usr/bin/cmake -E cmake_progress_report /home/kde-devel/kde/build/kdelibs/CMakeFiles/CMakeTmp/CMakeFiles 1
Building C object CMakeFiles/cmTryCompileExec.dir/CheckFunctionExists.o
/usr/bin/gcc  -Wno-long-long -std=iso9899:1990 -Wundef -Wcast-align -Werror-implicit-function-declaration -Wchar-subscripts -Wall -W -Wpointer-arith -Wwrite-strings -Wformat-security -Wmissing-format-attribute -fno-common  -DCHECK_FUNCTION_EXISTS=strlcpy   -D_XOPEN_SOURCE=500 -D_BSD_SOURCE -D_GNU_SOURCE -o CMakeFiles/cmTryCompileExec.dir/CheckFunctionExists.o   -c /usr/share/cmake-2.4/Modules/CheckFunctionExists.c
Linking C executable cmTryCompileExec
/usr/bin/cmake -P CMakeFiles/cmTryCompileExec.dir/cmake_clean_target.cmake
/usr/bin/gcc     -Wno-long-long -std=iso9899:1990 -Wundef -Wcast-align -Werror-implicit-function-declaration -Wchar-subscripts -Wall -W -Wpointer-arith -Wwrite-strings -Wformat-security -Wmissing-format-attribute -fno-common  -DCHECK_FUNCTION_EXISTS=strlcpy  -fPIC "CMakeFiles/cmTryCompileExec.dir/CheckFunctionExists.o"   -o cmTryCompileExec -rdynamic 
CMakeFiles/cmTryCompileExec.dir/CheckFunctionExists.o: In function `main':
CheckFunctionExists.c:(.text+0x15): undefined reference to `strlcpy'
collect2: ld returned 1 exit status
make[1]: *** [cmTryCompileExec] Error 1
make[1]: Leaving directory `/home/kde-devel/kde/build/kdelibs/CMakeFiles/CMakeTmp'
make: *** [cmTryCompileExec/fast] Error 2


Determining if the function strlcat exists failed with the following output:
/usr/bin/make -f CMakeFiles/cmTryCompileExec.dir/build.make CMakeFiles/cmTryCompileExec.dir/build
make[1]: Entering directory `/home/kde-devel/kde/build/kdelibs/CMakeFiles/CMakeTmp'
/usr/bin/cmake -E cmake_progress_report /home/kde-devel/kde/build/kdelibs/CMakeFiles/CMakeTmp/CMakeFiles 1
Building C object CMakeFiles/cmTryCompileExec.dir/CheckFunctionExists.o
/usr/bin/gcc  -Wno-long-long -std=iso9899:1990 -Wundef -Wcast-align -Werror-implicit-function-declaration -Wchar-subscripts -Wall -W -Wpointer-arith -Wwrite-strings -Wformat-security -Wmissing-format-attribute -fno-common  -DCHECK_FUNCTION_EXISTS=strlcat   -D_XOPEN_SOURCE=500 -D_BSD_SOURCE -D_GNU_SOURCE -o CMakeFiles/cmTryCompileExec.dir/CheckFunctionExists.o   -c /usr/share/cmake-2.4/Modules/CheckFunctionExists.c
Linking C executable cmTryCompileExec
/usr/bin/cmake -P CMakeFiles/cmTryCompileExec.dir/cmake_clean_target.cmake
/usr/bin/gcc     -Wno-long-long -std=iso9899:1990 -Wundef -Wcast-align -Werror-implicit-function-declaration -Wchar-subscripts -Wall -W -Wpointer-arith -Wwrite-strings -Wformat-security -Wmissing-format-attribute -fno-common  -DCHECK_FUNCTION_EXISTS=strlcat  -fPIC "CMakeFiles/cmTryCompileExec.dir/CheckFunctionExists.o"   -o cmTryCompileExec -rdynamic 
CMakeFiles/cmTryCompileExec.dir/CheckFunctionExists.o: In function `main':
CheckFunctionExists.c:(.text+0x15): undefined reference to `strlcat'
collect2: ld returned 1 exit status
make[1]: *** [cmTryCompileExec] Error 1
make[1]: Leaving directory `/home/kde-devel/kde/build/kdelibs/CMakeFiles/CMakeTmp'
make: *** [cmTryCompileExec/fast] Error 2


Performing C++ SOURCE FILE Test HAVE_MKSTEMPS_PROTO failed with the following output:
/usr/bin/make -f CMakeFiles/cmTryCompileExec.dir/build.make CMakeFiles/cmTryCompileExec.dir/build
make[1]: Entering directory `/home/kde-devel/kde/build/kdelibs/CMakeFiles/CMakeTmp'
/usr/bin/cmake -E cmake_progress_report /home/kde-devel/kde/build/kdelibs/CMakeFiles/CMakeTmp/CMakeFiles 1
Building CXX object CMakeFiles/cmTryCompileExec.dir/src.o
/usr/bin/c++   -Wnon-virtual-dtor -Wno-long-long -ansi -Wundef -Wcast-align -Wchar-subscripts -Wall -W -Wpointer-arith -Wformat-security -fno-exceptions -fno-check-new -fno-common -Woverloaded-virtual -fvisibility=hidden  -DHAVE_MKSTEMPS_PROTO   -D_XOPEN_SOURCE=500 -D_BSD_SOURCE -D_GNU_SOURCE -o CMakeFiles/cmTryCompileExec.dir/src.o -c /home/kde-devel/kde/build/kdelibs/CMakeFiles/CMakeTmp/src.cxx
/home/kde-devel/kde/build/kdelibs/CMakeFiles/CMakeTmp/src.cxx: In function ‘int main()’:
/home/kde-devel/kde/build/kdelibs/CMakeFiles/CMakeTmp/src.cxx:8: error: ‘mkstemps’ was not declared in this scope
/home/kde-devel/kde/build/kdelibs/CMakeFiles/CMakeTmp/src.cxx:8: warning: unused variable ‘i’
make[1]: *** [CMakeFiles/cmTryCompileExec.dir/src.o] Error 1
make[1]: Leaving directory `/home/kde-devel/kde/build/kdelibs/CMakeFiles/CMakeTmp'
make: *** [cmTryCompileExec/fast] Error 2

Source file was:

#include <stdlib.h>
#include <unistd.h>

int main()
{
#ifndef mkstemps
   int i = sizeof(&mkstemps);
#endif
  return 0;
}

Performing C++ SOURCE FILE Test HAVE_STRLCAT_PROTO failed with the following output:
/usr/bin/make -f CMakeFiles/cmTryCompileExec.dir/build.make CMakeFiles/cmTryCompileExec.dir/build
make[1]: Entering directory `/home/kde-devel/kde/build/kdelibs/CMakeFiles/CMakeTmp'
/usr/bin/cmake -E cmake_progress_report /home/kde-devel/kde/build/kdelibs/CMakeFiles/CMakeTmp/CMakeFiles 1
Building CXX object CMakeFiles/cmTryCompileExec.dir/src.o
/usr/bin/c++   -Wnon-virtual-dtor -Wno-long-long -ansi -Wundef -Wcast-align -Wchar-subscripts -Wall -W -Wpointer-arith -Wformat-security -fno-exceptions -fno-check-new -fno-common -Woverloaded-virtual -fvisibility=hidden  -DHAVE_STRLCAT_PROTO   -D_XOPEN_SOURCE=500 -D_BSD_SOURCE -D_GNU_SOURCE -o CMakeFiles/cmTryCompileExec.dir/src.o -c /home/kde-devel/kde/build/kdelibs/CMakeFiles/CMakeTmp/src.cxx
/home/kde-devel/kde/build/kdelibs/CMakeFiles/CMakeTmp/src.cxx: In function ‘int main()’:
/home/kde-devel/kde/build/kdelibs/CMakeFiles/CMakeTmp/src.cxx:7: error: ‘strlcat’ was not declared in this scope
/home/kde-devel/kde/build/kdelibs/CMakeFiles/CMakeTmp/src.cxx:7: warning: unused variable ‘i’
make[1]: *** [CMakeFiles/cmTryCompileExec.dir/src.o] Error 1
make[1]: Leaving directory `/home/kde-devel/kde/build/kdelibs/CMakeFiles/CMakeTmp'
make: *** [cmTryCompileExec/fast] Error 2

Source file was:

#include <string.h>

int main()
{
#ifndef strlcat
   int i = sizeof(&strlcat);
#endif
  return 0;
}

Performing C++ SOURCE FILE Test HAVE_STRLCPY_PROTO failed with the following output:
/usr/bin/make -f CMakeFiles/cmTryCompileExec.dir/build.make CMakeFiles/cmTryCompileExec.dir/build
make[1]: Entering directory `/home/kde-devel/kde/build/kdelibs/CMakeFiles/CMakeTmp'
/usr/bin/cmake -E cmake_progress_report /home/kde-devel/kde/build/kdelibs/CMakeFiles/CMakeTmp/CMakeFiles 1
Building CXX object CMakeFiles/cmTryCompileExec.dir/src.o
/usr/bin/c++   -Wnon-virtual-dtor -Wno-long-long -ansi -Wundef -Wcast-align -Wchar-subscripts -Wall -W -Wpointer-arith -Wformat-security -fno-exceptions -fno-check-new -fno-common -Woverloaded-virtual -fvisibility=hidden  -DHAVE_STRLCPY_PROTO   -D_XOPEN_SOURCE=500 -D_BSD_SOURCE -D_GNU_SOURCE -o CMakeFiles/cmTryCompileExec.dir/src.o -c /home/kde-devel/kde/build/kdelibs/CMakeFiles/CMakeTmp/src.cxx
/home/kde-devel/kde/build/kdelibs/CMakeFiles/CMakeTmp/src.cxx: In function ‘int main()’:
/home/kde-devel/kde/build/kdelibs/CMakeFiles/CMakeTmp/src.cxx:7: error: ‘strlcpy’ was not declared in this scope
/home/kde-devel/kde/build/kdelibs/CMakeFiles/CMakeTmp/src.cxx:7: warning: unused variable ‘i’
make[1]: *** [CMakeFiles/cmTryCompileExec.dir/src.o] Error 1
make[1]: Leaving directory `/home/kde-devel/kde/build/kdelibs/CMakeFiles/CMakeTmp'
make: *** [cmTryCompileExec/fast] Error 2

Source file was:

#include <string.h>

int main()
{
#ifndef strlcpy
   int i = sizeof(&strlcpy);
#endif
  return 0;
}

Performing C++ SOURCE FILE Test GETMNTINFO_USES_STATVFS failed with the following output:
/usr/bin/make -f CMakeFiles/cmTryCompileExec.dir/build.make CMakeFiles/cmTryCompileExec.dir/build
make[1]: Entering directory `/home/kde-devel/kde/build/kdelibs/CMakeFiles/CMakeTmp'
/usr/bin/cmake -E cmake_progress_report /home/kde-devel/kde/build/kdelibs/CMakeFiles/CMakeTmp/CMakeFiles 1
Building CXX object CMakeFiles/cmTryCompileExec.dir/src.o
/usr/bin/c++   -Wnon-virtual-dtor -Wno-long-long -ansi -Wundef -Wcast-align -Wchar-subscripts -Wall -W -Wpointer-arith -Wformat-security -fno-exceptions -fno-check-new -fno-common -Woverloaded-virtual -fvisibility=hidden  -DGETMNTINFO_USES_STATVFS   -D_XOPEN_SOURCE=500 -D_BSD_SOURCE -D_GNU_SOURCE -o CMakeFiles/cmTryCompileExec.dir/src.o -c /home/kde-devel/kde/build/kdelibs/CMakeFiles/CMakeTmp/src.cxx
/home/kde-devel/kde/build/kdelibs/CMakeFiles/CMakeTmp/src.cxx: In function ‘int main()’:
/home/kde-devel/kde/build/kdelibs/CMakeFiles/CMakeTmp/src.cxx:7: error: ‘getmntinfo’ was not declared in this scope
make[1]: *** [CMakeFiles/cmTryCompileExec.dir/src.o] Error 1
make[1]: Leaving directory `/home/kde-devel/kde/build/kdelibs/CMakeFiles/CMakeTmp'
make: *** [cmTryCompileExec/fast] Error 2

Source file was:

  #include <sys/types.h>
  #include <sys/statvfs.h>
  int main(){
    struct statvfs *mntbufp;
    int flags;
    return getmntinfo(&mntbufp, flags);
  }

Determining the endianes of the system passed. The system is little endianTest produced following output:
/usr/bin/make -f CMakeFiles/cmTryCompileExec.dir/build.make CMakeFiles/cmTryCompileExec.dir/build
make[1]: Entering directory `/home/kde-devel/kde/build/kdelibs/CMakeFiles/CMakeTmp'
/usr/bin/cmake -E cmake_progress_report /home/kde-devel/kde/build/kdelibs/CMakeFiles/CMakeTmp/CMakeFiles 1
Building C object CMakeFiles/cmTryCompileExec.dir/TestBigEndian.o
/usr/bin/gcc  -Wno-long-long -std=iso9899:1990 -Wundef -Wcast-align -Werror-implicit-function-declaration -Wchar-subscripts -Wall -W -Wpointer-arith -Wwrite-strings -Wformat-security -Wmissing-format-attribute -fno-common     -o CMakeFiles/cmTryCompileExec.dir/TestBigEndian.o   -c /usr/share/cmake-2.4/Modules/TestBigEndian.c
Linking C executable cmTryCompileExec
/usr/bin/cmake -P CMakeFiles/cmTryCompileExec.dir/cmake_clean_target.cmake
/usr/bin/gcc     -Wno-long-long -std=iso9899:1990 -Wundef -Wcast-align -Werror-implicit-function-declaration -Wchar-subscripts -Wall -W -Wpointer-arith -Wwrite-strings -Wformat-security -Wmissing-format-attribute -fno-common    -fPIC "CMakeFiles/cmTryCompileExec.dir/TestBigEndian.o"   -o cmTryCompileExec -rdynamic 
make[1]: Leaving directory `/home/kde-devel/kde/build/kdelibs/CMakeFiles/CMakeTmp'


Determining if the function connect exists in the socket failed with the following output:
/usr/bin/make -f CMakeFiles/cmTryCompileExec.dir/build.make CMakeFiles/cmTryCompileExec.dir/build
make[1]: Entering directory `/home/kde-devel/kde/build/kdelibs/CMakeFiles/CMakeTmp'
/usr/bin/cmake -E cmake_progress_report /home/kde-devel/kde/build/kdelibs/CMakeFiles/CMakeTmp/CMakeFiles 1
Building C object CMakeFiles/cmTryCompileExec.dir/CheckFunctionExists.o
/usr/bin/gcc  -Wno-long-long -std=iso9899:1990 -Wundef -Wcast-align -Werror-implicit-function-declaration -Wchar-subscripts -Wall -W -Wpointer-arith -Wwrite-strings -Wformat-security -Wmissing-format-attribute -fno-common  -DCHECK_FUNCTION_EXISTS=connect   -D_XOPEN_SOURCE=500 -D_BSD_SOURCE -D_GNU_SOURCE -o CMakeFiles/cmTryCompileExec.dir/CheckFunctionExists.o   -c /usr/share/cmake-2.4/Modules/CheckFunctionExists.c
Linking C executable cmTryCompileExec
/usr/bin/cmake -P CMakeFiles/cmTryCompileExec.dir/cmake_clean_target.cmake
/usr/bin/gcc     -Wno-long-long -std=iso9899:1990 -Wundef -Wcast-align -Werror-implicit-function-declaration -Wchar-subscripts -Wall -W -Wpointer-arith -Wwrite-strings -Wformat-security -Wmissing-format-attribute -fno-common  -DCHECK_FUNCTION_EXISTS=connect  -fPIC "CMakeFiles/cmTryCompileExec.dir/CheckFunctionExists.o"   -o cmTryCompileExec -rdynamic -lsocket 
/usr/bin/ld: cannot find -lsocket
collect2: ld returned 1 exit status
make[1]: *** [cmTryCompileExec] Error 1
make[1]: Leaving directory `/home/kde-devel/kde/build/kdelibs/CMakeFiles/CMakeTmp'
make: *** [cmTryCompileExec/fast] Error 2


Performing C++ SOURCE FILE Test HAVE_STRUCT_SOCKADDR_SA_LEN failed with the following output:
/usr/bin/make -f CMakeFiles/cmTryCompileExec.dir/build.make CMakeFiles/cmTryCompileExec.dir/build
make[1]: Entering directory `/home/kde-devel/kde/build/kdelibs/CMakeFiles/CMakeTmp'
/usr/bin/cmake -E cmake_progress_report /home/kde-devel/kde/build/kdelibs/CMakeFiles/CMakeTmp/CMakeFiles 1
Building CXX object CMakeFiles/cmTryCompileExec.dir/src.o
/usr/bin/c++   -Wnon-virtual-dtor -Wno-long-long -ansi -Wundef -Wcast-align -Wchar-subscripts -Wall -W -Wpointer-arith -Wformat-security -fno-exceptions -fno-check-new -fno-common -Woverloaded-virtual -fvisibility=hidden  -DHAVE_STRUCT_SOCKADDR_SA_LEN   -D_XOPEN_SOURCE=500 -D_BSD_SOURCE -D_GNU_SOURCE -o CMakeFiles/cmTryCompileExec.dir/src.o -c /home/kde-devel/kde/build/kdelibs/CMakeFiles/CMakeTmp/src.cxx
/home/kde-devel/kde/build/kdelibs/CMakeFiles/CMakeTmp/src.cxx: In function ‘int main()’:
/home/kde-devel/kde/build/kdelibs/CMakeFiles/CMakeTmp/src.cxx:8: error: ‘struct sockaddr’ has no member named ‘sa_len’
make[1]: *** [CMakeFiles/cmTryCompileExec.dir/src.o] Error 1
make[1]: Leaving directory `/home/kde-devel/kde/build/kdelibs/CMakeFiles/CMakeTmp'
make: *** [cmTryCompileExec/fast] Error 2

Source file was:

#include <sys/types.h>
#include <sys/socket.h>

int main()
{
   struct sockaddr* tmp;
   tmp->sa_len;
  return 0;
}

Determining if the function pthread_attr_get_np exists in the pthread failed with the following output:
/usr/bin/make -f CMakeFiles/cmTryCompileExec.dir/build.make CMakeFiles/cmTryCompileExec.dir/build
make[1]: Entering directory `/home/kde-devel/kde/build/kdelibs/CMakeFiles/CMakeTmp'
/usr/bin/cmake -E cmake_progress_report /home/kde-devel/kde/build/kdelibs/CMakeFiles/CMakeTmp/CMakeFiles 1
Building C object CMakeFiles/cmTryCompileExec.dir/CheckFunctionExists.o
/usr/bin/gcc  -Wno-long-long -std=iso9899:1990 -Wundef -Wcast-align -Werror-implicit-function-declaration -Wchar-subscripts -Wall -W -Wpointer-arith -Wwrite-strings -Wformat-security -Wmissing-format-attribute -fno-common  -DCHECK_FUNCTION_EXISTS=pthread_attr_get_np   -D_XOPEN_SOURCE=500 -D_BSD_SOURCE -D_GNU_SOURCE -o CMakeFiles/cmTryCompileExec.dir/CheckFunctionExists.o   -c /usr/share/cmake-2.4/Modules/CheckFunctionExists.c
Linking C executable cmTryCompileExec
/usr/bin/cmake -P CMakeFiles/cmTryCompileExec.dir/cmake_clean_target.cmake
/usr/bin/gcc     -Wno-long-long -std=iso9899:1990 -Wundef -Wcast-align -Werror-implicit-function-declaration -Wchar-subscripts -Wall -W -Wpointer-arith -Wwrite-strings -Wformat-security -Wmissing-format-attribute -fno-common  -DCHECK_FUNCTION_EXISTS=pthread_attr_get_np  -fPIC "CMakeFiles/cmTryCompileExec.dir/CheckFunctionExists.o"   -o cmTryCompileExec -rdynamic -lpthread 
CMakeFiles/cmTryCompileExec.dir/CheckFunctionExists.o: In function `main':
CheckFunctionExists.c:(.text+0x15): undefined reference to `pthread_attr_get_np'
collect2: ld returned 1 exit status
make[1]: *** [cmTryCompileExec] Error 1
make[1]: Leaving directory `/home/kde-devel/kde/build/kdelibs/CMakeFiles/CMakeTmp'
make: *** [cmTryCompileExec/fast] Error 2


Determining if files ieeefp.h exist failed with the following output:
/usr/bin/make -f CMakeFiles/cmTryCompileExec.dir/build.make CMakeFiles/cmTryCompileExec.dir/build
make[1]: Entering directory `/home/kde-devel/kde/build/kdelibs/CMakeFiles/CMakeTmp'
/usr/bin/cmake -E cmake_progress_report /home/kde-devel/kde/build/kdelibs/CMakeFiles/CMakeTmp/CMakeFiles 1
Building C object CMakeFiles/cmTryCompileExec.dir/CheckIncludeFiles.o
/usr/bin/gcc  -Wno-long-long -std=iso9899:1990 -Wundef -Wcast-align -Werror-implicit-function-declaration -Wchar-subscripts -Wall -W -Wpointer-arith -Wwrite-strings -Wformat-security -Wmissing-format-attribute -fno-common     -D_XOPEN_SOURCE=500 -D_BSD_SOURCE -D_GNU_SOURCE -o CMakeFiles/cmTryCompileExec.dir/CheckIncludeFiles.o   -c /home/kde-devel/kde/build/kdelibs/CMakeFiles/CMakeTmp/CheckIncludeFiles.c
/home/kde-devel/kde/build/kdelibs/CMakeFiles/CMakeTmp/CheckIncludeFiles.c:2:20: error: ieeefp.h: No such file or directory
make[1]: *** [CMakeFiles/cmTryCompileExec.dir/CheckIncludeFiles.o] Error 1
make[1]: Leaving directory `/home/kde-devel/kde/build/kdelibs/CMakeFiles/CMakeTmp'
make: *** [cmTryCompileExec/fast] Error 2

Source:
/* */
#include <ieeefp.h>


int main(){return 0;}

Determining if files pthread.h;pthread_np.h exist failed with the following output:
/usr/bin/make -f CMakeFiles/cmTryCompileExec.dir/build.make CMakeFiles/cmTryCompileExec.dir/build
make[1]: Entering directory `/home/kde-devel/kde/build/kdelibs/CMakeFiles/CMakeTmp'
/usr/bin/cmake -E cmake_progress_report /home/kde-devel/kde/build/kdelibs/CMakeFiles/CMakeTmp/CMakeFiles 1
Building C object CMakeFiles/cmTryCompileExec.dir/CheckIncludeFiles.o
/usr/bin/gcc  -Wno-long-long -std=iso9899:1990 -Wundef -Wcast-align -Werror-implicit-function-declaration -Wchar-subscripts -Wall -W -Wpointer-arith -Wwrite-strings -Wformat-security -Wmissing-format-attribute -fno-common     -D_XOPEN_SOURCE=500 -D_BSD_SOURCE -D_GNU_SOURCE -o CMakeFiles/cmTryCompileExec.dir/CheckIncludeFiles.o   -c /home/kde-devel/kde/build/kdelibs/CMakeFiles/CMakeTmp/CheckIncludeFiles.c
/home/kde-devel/kde/build/kdelibs/CMakeFiles/CMakeTmp/CheckIncludeFiles.c:3:24: error: pthread_np.h: No such file or directory
make[1]: *** [CMakeFiles/cmTryCompileExec.dir/CheckIncludeFiles.o] Error 1
make[1]: Leaving directory `/home/kde-devel/kde/build/kdelibs/CMakeFiles/CMakeTmp'
make: *** [cmTryCompileExec/fast] Error 2

Source:
/* */
#include <pthread.h>
#include <pthread_np.h>


int main(){return 0;}

Determining if files valgrind/memcheck.h exist failed with the following output:
/usr/bin/make -f CMakeFiles/cmTryCompileExec.dir/build.make CMakeFiles/cmTryCompileExec.dir/build
make[1]: Entering directory `/home/kde-devel/kde/build/kdelibs/CMakeFiles/CMakeTmp'
/usr/bin/cmake -E cmake_progress_report /home/kde-devel/kde/build/kdelibs/CMakeFiles/CMakeTmp/CMakeFiles 1
Building C object CMakeFiles/cmTryCompileExec.dir/CheckIncludeFiles.o
/usr/bin/gcc  -Wno-long-long -std=iso9899:1990 -Wundef -Wcast-align -Werror-implicit-function-declaration -Wchar-subscripts -Wall -W -Wpointer-arith -Wwrite-strings -Wformat-security -Wmissing-format-attribute -fno-common     -D_XOPEN_SOURCE=500 -D_BSD_SOURCE -D_GNU_SOURCE -o CMakeFiles/cmTryCompileExec.dir/CheckIncludeFiles.o   -c /home/kde-devel/kde/build/kdelibs/CMakeFiles/CMakeTmp/CheckIncludeFiles.c
/home/kde-devel/kde/build/kdelibs/CMakeFiles/CMakeTmp/CheckIncludeFiles.c:2:31: error: valgrind/memcheck.h: No such file or directory
make[1]: *** [CMakeFiles/cmTryCompileExec.dir/CheckIncludeFiles.o] Error 1
make[1]: Leaving directory `/home/kde-devel/kde/build/kdelibs/CMakeFiles/CMakeTmp'
make: *** [cmTryCompileExec/fast] Error 2

Source:
/* */
#include <valgrind/memcheck.h>


int main(){return 0;}

Determining if the function _finite exists failed with the following output:
/usr/bin/make -f CMakeFiles/cmTryCompileExec.dir/build.make CMakeFiles/cmTryCompileExec.dir/build
make[1]: Entering directory `/home/kde-devel/kde/build/kdelibs/CMakeFiles/CMakeTmp'
/usr/bin/cmake -E cmake_progress_report /home/kde-devel/kde/build/kdelibs/CMakeFiles/CMakeTmp/CMakeFiles 1
Building C object CMakeFiles/cmTryCompileExec.dir/CheckFunctionExists.o
/usr/bin/gcc  -Wno-long-long -std=iso9899:1990 -Wundef -Wcast-align -Werror-implicit-function-declaration -Wchar-subscripts -Wall -W -Wpointer-arith -Wwrite-strings -Wformat-security -Wmissing-format-attribute -fno-common  -DCHECK_FUNCTION_EXISTS=_finite   -D_XOPEN_SOURCE=500 -D_BSD_SOURCE -D_GNU_SOURCE -o CMakeFiles/cmTryCompileExec.dir/CheckFunctionExists.o   -c /usr/share/cmake-2.4/Modules/CheckFunctionExists.c
Linking C executable cmTryCompileExec
/usr/bin/cmake -P CMakeFiles/cmTryCompileExec.dir/cmake_clean_target.cmake
/usr/bin/gcc     -Wno-long-long -std=iso9899:1990 -Wundef -Wcast-align -Werror-implicit-function-declaration -Wchar-subscripts -Wall -W -Wpointer-arith -Wwrite-strings -Wformat-security -Wmissing-format-attribute -fno-common  -DCHECK_FUNCTION_EXISTS=_finite  -fPIC "CMakeFiles/cmTryCompileExec.dir/CheckFunctionExists.o"   -o cmTryCompileExec -rdynamic -lm 
CMakeFiles/cmTryCompileExec.dir/CheckFunctionExists.o: In function `main':
CheckFunctionExists.c:(.text+0x15): undefined reference to `_finite'
collect2: ld returned 1 exit status
make[1]: Leaving directory `/home/kde-devel/kde/build/kdelibs/CMakeFiles/CMakeTmp'
make[1]: *** [cmTryCompileExec] Error 1
make: *** [cmTryCompileExec/fast] Error 2


Determining if files machine/soundcard.h exist failed with the following output:
/usr/bin/make -f CMakeFiles/cmTryCompileExec.dir/build.make CMakeFiles/cmTryCompileExec.dir/build
make[1]: Entering directory `/home/kde-devel/kde/build/kdelibs/CMakeFiles/CMakeTmp'
/usr/bin/cmake -E cmake_progress_report /home/kde-devel/kde/build/kdelibs/CMakeFiles/CMakeTmp/CMakeFiles 1
Building C object CMakeFiles/cmTryCompileExec.dir/CheckIncludeFiles.o
/usr/bin/gcc  -Wno-long-long -std=iso9899:1990 -Wundef -Wcast-align -Werror-implicit-function-declaration -Wchar-subscripts -Wall -W -Wpointer-arith -Wwrite-strings -Wformat-security -Wmissing-format-attribute -fno-common     -D_XOPEN_SOURCE=500 -D_BSD_SOURCE -D_GNU_SOURCE -o CMakeFiles/cmTryCompileExec.dir/CheckIncludeFiles.o   -c /home/kde-devel/kde/build/kdelibs/CMakeFiles/CMakeTmp/CheckIncludeFiles.c
/home/kde-devel/kde/build/kdelibs/CMakeFiles/CMakeTmp/CheckIncludeFiles.c:2:31: error: machine/soundcard.h: No such file or directory
make[1]: *** [CMakeFiles/cmTryCompileExec.dir/CheckIncludeFiles.o] Error 1
make[1]: Leaving directory `/home/kde-devel/kde/build/kdelibs/CMakeFiles/CMakeTmp'
make: *** [cmTryCompileExec/fast] Error 2

Source:
/* */
#include <machine/soundcard.h>


int main(){return 0;}

Determining if files linux/awe_voice.h exist failed with the following output:
/usr/bin/make -f CMakeFiles/cmTryCompileExec.dir/build.make CMakeFiles/cmTryCompileExec.dir/build
make[1]: Entering directory `/home/kde-devel/kde/build/kdelibs/CMakeFiles/CMakeTmp'
/usr/bin/cmake -E cmake_progress_report /home/kde-devel/kde/build/kdelibs/CMakeFiles/CMakeTmp/CMakeFiles 1
Building C object CMakeFiles/cmTryCompileExec.dir/CheckIncludeFiles.o
/usr/bin/gcc  -Wno-long-long -std=iso9899:1990 -Wundef -Wcast-align -Werror-implicit-function-declaration -Wchar-subscripts -Wall -W -Wpointer-arith -Wwrite-strings -Wformat-security -Wmissing-format-attribute -fno-common     -D_XOPEN_SOURCE=500 -D_BSD_SOURCE -D_GNU_SOURCE -o CMakeFiles/cmTryCompileExec.dir/CheckIncludeFiles.o   -c /home/kde-devel/kde/build/kdelibs/CMakeFiles/CMakeTmp/CheckIncludeFiles.c
/home/kde-devel/kde/build/kdelibs/CMakeFiles/CMakeTmp/CheckIncludeFiles.c:2:29: error: linux/awe_voice.h: No such file or directory
make[1]: *** [CMakeFiles/cmTryCompileExec.dir/CheckIncludeFiles.o] Error 1
make[1]: Leaving directory `/home/kde-devel/kde/build/kdelibs/CMakeFiles/CMakeTmp'
make: *** [cmTryCompileExec/fast] Error 2

Source:
/* */
#include <linux/awe_voice.h>


int main(){return 0;}

Determining if files awe_voice.h exist failed with the following output:
/usr/bin/make -f CMakeFiles/cmTryCompileExec.dir/build.make CMakeFiles/cmTryCompileExec.dir/build
make[1]: Entering directory `/home/kde-devel/kde/build/kdelibs/CMakeFiles/CMakeTmp'
/usr/bin/cmake -E cmake_progress_report /home/kde-devel/kde/build/kdelibs/CMakeFiles/CMakeTmp/CMakeFiles 1
Building C object CMakeFiles/cmTryCompileExec.dir/CheckIncludeFiles.o
/usr/bin/gcc  -Wno-long-long -std=iso9899:1990 -Wundef -Wcast-align -Werror-implicit-function-declaration -Wchar-subscripts -Wall -W -Wpointer-arith -Wwrite-strings -Wformat-security -Wmissing-format-attribute -fno-common     -D_XOPEN_SOURCE=500 -D_BSD_SOURCE -D_GNU_SOURCE -o CMakeFiles/cmTryCompileExec.dir/CheckIncludeFiles.o   -c /home/kde-devel/kde/build/kdelibs/CMakeFiles/CMakeTmp/CheckIncludeFiles.c
/home/kde-devel/kde/build/kdelibs/CMakeFiles/CMakeTmp/CheckIncludeFiles.c:2:23: error: awe_voice.h: No such file or directory
make[1]: *** [CMakeFiles/cmTryCompileExec.dir/CheckIncludeFiles.o] Error 1
make[1]: Leaving directory `/home/kde-devel/kde/build/kdelibs/CMakeFiles/CMakeTmp'
make: *** [cmTryCompileExec/fast] Error 2

Source:
/* */
#include <awe_voice.h>


int main(){return 0;}

Determining if files /usr/src/sys/i386/isa/sound/awe_voice.h exist failed with the following output:
/usr/bin/make -f CMakeFiles/cmTryCompileExec.dir/build.make CMakeFiles/cmTryCompileExec.dir/build
make[1]: Entering directory `/home/kde-devel/kde/build/kdelibs/CMakeFiles/CMakeTmp'
/usr/bin/cmake -E cmake_progress_report /home/kde-devel/kde/build/kdelibs/CMakeFiles/CMakeTmp/CMakeFiles 1
Building C object CMakeFiles/cmTryCompileExec.dir/CheckIncludeFiles.o
/usr/bin/gcc  -Wno-long-long -std=iso9899:1990 -Wundef -Wcast-align -Werror-implicit-function-declaration -Wchar-subscripts -Wall -W -Wpointer-arith -Wwrite-strings -Wformat-security -Wmissing-format-attribute -fno-common     -D_XOPEN_SOURCE=500 -D_BSD_SOURCE -D_GNU_SOURCE -o CMakeFiles/cmTryCompileExec.dir/CheckIncludeFiles.o   -c /home/kde-devel/kde/build/kdelibs/CMakeFiles/CMakeTmp/CheckIncludeFiles.c
/home/kde-devel/kde/build/kdelibs/CMakeFiles/CMakeTmp/CheckIncludeFiles.c:2:51: error: /usr/src/sys/i386/isa/sound/awe_voice.h: No such file or directory
make[1]: *** [CMakeFiles/cmTryCompileExec.dir/CheckIncludeFiles.o] Error 1
make[1]: Leaving directory `/home/kde-devel/kde/build/kdelibs/CMakeFiles/CMakeTmp'
make: *** [cmTryCompileExec/fast] Error 2

Source:
/* */
#include </usr/src/sys/i386/isa/sound/awe_voice.h>


int main(){return 0;}

Determining if files /usr/src/sys/gnu/i386/isa/sound/awe_voice.h exist failed with the following output:
/usr/bin/make -f CMakeFiles/cmTryCompileExec.dir/build.make CMakeFiles/cmTryCompileExec.dir/build
make[1]: Entering directory `/home/kde-devel/kde/build/kdelibs/CMakeFiles/CMakeTmp'
/usr/bin/cmake -E cmake_progress_report /home/kde-devel/kde/build/kdelibs/CMakeFiles/CMakeTmp/CMakeFiles 1
Building C object CMakeFiles/cmTryCompileExec.dir/CheckIncludeFiles.o
/usr/bin/gcc  -Wno-long-long -std=iso9899:1990 -Wundef -Wcast-align -Werror-implicit-function-declaration -Wchar-subscripts -Wall -W -Wpointer-arith -Wwrite-strings -Wformat-security -Wmissing-format-attribute -fno-common     -D_XOPEN_SOURCE=500 -D_BSD_SOURCE -D_GNU_SOURCE -o CMakeFiles/cmTryCompileExec.dir/CheckIncludeFiles.o   -c /home/kde-devel/kde/build/kdelibs/CMakeFiles/CMakeTmp/CheckIncludeFiles.c
/home/kde-devel/kde/build/kdelibs/CMakeFiles/CMakeTmp/CheckIncludeFiles.c:2:55: error: /usr/src/sys/gnu/i386/isa/sound/awe_voice.h: No such file or directory
make[1]: *** [CMakeFiles/cmTryCompileExec.dir/CheckIncludeFiles.o] Error 1
make[1]: Leaving directory `/home/kde-devel/kde/build/kdelibs/CMakeFiles/CMakeTmp'
make: *** [cmTryCompileExec/fast] Error 2

Source:
/* */
#include </usr/src/sys/gnu/i386/isa/sound/awe_voice.h>


int main(){return 0;}

Performing C++ SOURCE FILE Test HAVE_PPC_ALTIVEC failed with the following output:
/usr/bin/make -f CMakeFiles/cmTryCompileExec.dir/build.make CMakeFiles/cmTryCompileExec.dir/build
make[1]: Entering directory `/home/kde-devel/kde/build/kdelibs/CMakeFiles/CMakeTmp'
/usr/bin/cmake -E cmake_progress_report /home/kde-devel/kde/build/kdelibs/CMakeFiles/CMakeTmp/CMakeFiles 1
Building CXX object CMakeFiles/cmTryCompileExec.dir/src.o
/usr/bin/c++   -Wnon-virtual-dtor -Wno-long-long -ansi -Wundef -Wcast-align -Wchar-subscripts -Wall -W -Wpointer-arith -Wformat-security -fno-exceptions -fno-check-new -fno-common -Woverloaded-virtual -fvisibility=hidden  -DHAVE_PPC_ALTIVEC   -D_XOPEN_SOURCE=500 -D_BSD_SOURCE -D_GNU_SOURCE -o CMakeFiles/cmTryCompileExec.dir/src.o -c /home/kde-devel/kde/build/kdelibs/CMakeFiles/CMakeTmp/src.cxx
/tmp/ccRbvCGg.s: Assembler messages:
/tmp/ccRbvCGg.s:16: Error: no such instruction: `mtspr 256,%eax'
/tmp/ccRbvCGg.s:16: Error: no such instruction: `vand %v0,%v0,%v0'
make[1]: *** [CMakeFiles/cmTryCompileExec.dir/src.o] Error 1
make[1]: Leaving directory `/home/kde-devel/kde/build/kdelibs/CMakeFiles/CMakeTmp'
make: *** [cmTryCompileExec/fast] Error 2

Source file was:
 int main() { __asm__("mtspr 256, %0; vand %%v0, %%v0, %%v0" : : "r"(-1) ); }
Determining if files sys/pstat.h exist failed with the following output:
/usr/bin/make -f CMakeFiles/cmTryCompileExec.dir/build.make CMakeFiles/cmTryCompileExec.dir/build
make[1]: Entering directory `/home/kde-devel/kde/build/kdelibs/CMakeFiles/CMakeTmp'
/usr/bin/cmake -E cmake_progress_report /home/kde-devel/kde/build/kdelibs/CMakeFiles/CMakeTmp/CMakeFiles 1
Building C object CMakeFiles/cmTryCompileExec.dir/CheckIncludeFiles.o
/usr/bin/gcc  -Wno-long-long -std=iso9899:1990 -Wundef -Wcast-align -Werror-implicit-function-declaration -Wchar-subscripts -Wall -W -Wpointer-arith -Wwrite-strings -Wformat-security -Wmissing-format-attribute -fno-common     -D_XOPEN_SOURCE=500 -D_BSD_SOURCE -D_GNU_SOURCE -o CMakeFiles/cmTryCompileExec.dir/CheckIncludeFiles.o   -c /home/kde-devel/kde/build/kdelibs/CMakeFiles/CMakeTmp/CheckIncludeFiles.c
/home/kde-devel/kde/build/kdelibs/CMakeFiles/CMakeTmp/CheckIncludeFiles.c:2:23: error: sys/pstat.h: No such file or directory
make[1]: *** [CMakeFiles/cmTryCompileExec.dir/CheckIncludeFiles.o] Error 1
make[1]: Leaving directory `/home/kde-devel/kde/build/kdelibs/CMakeFiles/CMakeTmp'
make: *** [cmTryCompileExec/fast] Error 2

Source:
/* */
#include <sys/pstat.h>


int main(){return 0;}

Determining if the function pstat exists failed with the following output:
/usr/bin/make -f CMakeFiles/cmTryCompileExec.dir/build.make CMakeFiles/cmTryCompileExec.dir/build
make[1]: Entering directory `/home/kde-devel/kde/build/kdelibs/CMakeFiles/CMakeTmp'
/usr/bin/cmake -E cmake_progress_report /home/kde-devel/kde/build/kdelibs/CMakeFiles/CMakeTmp/CMakeFiles 1
Building C object CMakeFiles/cmTryCompileExec.dir/CheckFunctionExists.o
/usr/bin/gcc  -Wno-long-long -std=iso9899:1990 -Wundef -Wcast-align -Werror-implicit-function-declaration -Wchar-subscripts -Wall -W -Wpointer-arith -Wwrite-strings -Wformat-security -Wmissing-format-attribute -fno-common  -DCHECK_FUNCTION_EXISTS=pstat   -D_XOPEN_SOURCE=500 -D_BSD_SOURCE -D_GNU_SOURCE -o CMakeFiles/cmTryCompileExec.dir/CheckFunctionExists.o   -c /usr/share/cmake-2.4/Modules/CheckFunctionExists.c
Linking C executable cmTryCompileExec
/usr/bin/cmake -P CMakeFiles/cmTryCompileExec.dir/cmake_clean_target.cmake
/usr/bin/gcc     -Wno-long-long -std=iso9899:1990 -Wundef -Wcast-align -Werror-implicit-function-declaration -Wchar-subscripts -Wall -W -Wpointer-arith -Wwrite-strings -Wformat-security -Wmissing-format-attribute -fno-common  -DCHECK_FUNCTION_EXISTS=pstat  -fPIC "CMakeFiles/cmTryCompileExec.dir/CheckFunctionExists.o"   -o cmTryCompileExec -rdynamic 
CMakeFiles/cmTryCompileExec.dir/CheckFunctionExists.o: In function `main':
CheckFunctionExists.c:(.text+0x15): undefined reference to `pstat'
collect2: ld returned 1 exit status
make[1]: *** [cmTryCompileExec] Error 1
make[1]: Leaving directory `/home/kde-devel/kde/build/kdelibs/CMakeFiles/CMakeTmp'
make: *** [cmTryCompileExec/fast] Error 2


Determining if the function setproctitle exists failed with the following output:
/usr/bin/make -f CMakeFiles/cmTryCompileExec.dir/build.make CMakeFiles/cmTryCompileExec.dir/build
make[1]: Entering directory `/home/kde-devel/kde/build/kdelibs/CMakeFiles/CMakeTmp'
/usr/bin/cmake -E cmake_progress_report /home/kde-devel/kde/build/kdelibs/CMakeFiles/CMakeTmp/CMakeFiles 1
Building C object CMakeFiles/cmTryCompileExec.dir/CheckFunctionExists.o
/usr/bin/gcc  -Wno-long-long -std=iso9899:1990 -Wundef -Wcast-align -Werror-implicit-function-declaration -Wchar-subscripts -Wall -W -Wpointer-arith -Wwrite-strings -Wformat-security -Wmissing-format-attribute -fno-common  -DCHECK_FUNCTION_EXISTS=setproctitle   -D_XOPEN_SOURCE=500 -D_BSD_SOURCE -D_GNU_SOURCE -o CMakeFiles/cmTryCompileExec.dir/CheckFunctionExists.o   -c /usr/share/cmake-2.4/Modules/CheckFunctionExists.c
Linking C executable cmTryCompileExec
/usr/bin/cmake -P CMakeFiles/cmTryCompileExec.dir/cmake_clean_target.cmake
/usr/bin/gcc     -Wno-long-long -std=iso9899:1990 -Wundef -Wcast-align -Werror-implicit-function-declaration -Wchar-subscripts -Wall -W -Wpointer-arith -Wwrite-strings -Wformat-security -Wmissing-format-attribute -fno-common  -DCHECK_FUNCTION_EXISTS=setproctitle  -fPIC "CMakeFiles/cmTryCompileExec.dir/CheckFunctionExists.o"   -o cmTryCompileExec -rdynamic 
CMakeFiles/cmTryCompileExec.dir/CheckFunctionExists.o: In function `main':
CheckFunctionExists.c:(.text+0x15): undefined reference to `setproctitle'
collect2: ld returned 1 exit status
make[1]: *** [cmTryCompileExec] Error 1
make[1]: Leaving directory `/home/kde-devel/kde/build/kdelibs/CMakeFiles/CMakeTmp'
make: *** [cmTryCompileExec/fast] Error 2