JoeMacBook:current_make Joe$ make
(cd macosx ; xcodebuild -alltargets -configuration UB clean | sed '/^$/d' )
=== CLEANING NATIVE TARGET libhb WITH CONFIGURATION UB ===
Checking Dependencies...
Clean.Remove clean /Users/Joe/Projects/Handbrake/current_make/macosx/../libhb/libhb.a
/bin/rm -rf /Users/Joe/Projects/Handbrake/current_make/macosx/../libhb/libhb.a
Clean.Remove clean /Users/Joe/Projects/Handbrake/current_make/macosx/build/HandBrake.build/UB/libhb.build
/bin/rm -rf /Users/Joe/Projects/Handbrake/current_make/macosx/build/HandBrake.build/UB/libhb.build
=== CLEANING NATIVE TARGET HandBrake WITH CONFIGURATION UB ===
Checking Dependencies...
Clean.Remove clean /Users/Joe/Projects/Handbrake/current_make/macosx/../HandBrake.app
/bin/rm -rf /Users/Joe/Projects/Handbrake/current_make/macosx/../HandBrake.app
Clean.Remove clean /Users/Joe/Projects/Handbrake/current_make/macosx/build/HandBrake.build/UB/HandBrake.build
/bin/rm -rf /Users/Joe/Projects/Handbrake/current_make/macosx/build/HandBrake.build/UB/HandBrake.build
=== CLEANING NATIVE TARGET HandBrakeCLI WITH CONFIGURATION UB ===
Checking Dependencies...
Clean.Remove clean /Users/Joe/Projects/Handbrake/current_make/macosx/../HandBrakeCLI
/bin/rm -rf /Users/Joe/Projects/Handbrake/current_make/macosx/../HandBrakeCLI
Clean.Remove clean /Users/Joe/Projects/Handbrake/current_make/macosx/build/HandBrake.build/UB/HandBrakeCLI.build
/bin/rm -rf /Users/Joe/Projects/Handbrake/current_make/macosx/build/HandBrake.build/UB/HandBrakeCLI.build
=== CLEANING NATIVE TARGET libhb dlib WITH CONFIGURATION UB ===
Checking Dependencies...
Clean.Remove clean /Users/Joe/Projects/Handbrake/current_make/macosx/../libhb/libhb.dylib
/bin/rm -rf /Users/Joe/Projects/Handbrake/current_make/macosx/../libhb/libhb.dylib
Clean.Remove clean "/Users/Joe/Projects/Handbrake/current_make/macosx/build/HandBrake.build/UB/libhb dlib.build"
/bin/rm -rf "/Users/Joe/Projects/Handbrake/current_make/macosx/build/HandBrake.build/UB/libhb dlib.build"
** CLEAN SUCCEEDED **
(./DownloadMacOsXContribBinaries.sh ; cd macosx ; xcodebuild -target libhb -target HandBrake -target HandBrakeCLI -configuration UB OTHER_CFLAGS_QUOTED_1="-DHB_VERSION=\\\""0.9.2"\\\" -DHB_BUILD=2008021900 " build | sed '/^$/d' )
Please connect to the Internet (could not resolve download.m0k.org).
=== BUILDING NATIVE TARGET libhb WITH CONFIGURATION UB ===
Checking Dependencies...
CompileC build/HandBrake.build/UB/libhb.build/Objects-normal/ppc/declpcm.o /Users/Joe/Projects/Handbrake/current_make/macosx/../libhb/declpcm.c normal ppc c com.apple.compilers.gcc.4_0
cd /Users/Joe/Projects/Handbrake/current_make/macosx
/Developer/usr/bin/gcc-4.0 -x c -arch ppc -pipe -Wno-trigraphs -fpascal-strings -fasm-blocks -Os -DJOB_GROUPS=1 -fmessage-length=0 -mtune=G5 -mfix-and-continue -mmacosx-version-min=10.3 -gdwarf-2 -I/Users/Joe/Projects/Handbrake/current_make/macosx/build/HandBrake.build/UB/libhb.build/hb.hmap -DWORDS_BIGENDIAN -F/Users/Joe/Projects/Handbrake/current_make/macosx/../libhb -I/Users/Joe/Projects/Handbrake/current_make/macosx/../libhb/include -I/Users/Joe/Projects/Handbrake/current_make/macosx/../contrib/include -I/Users/Joe/Projects/Handbrake/current_make/macosx/build/HandBrake.build/UB/libhb.build/DerivedSources -D__LIBHB__ -DSYS_DARWIN -DHB_VERSION="0.9.2" -DHB_BUILD=2008021900 -DUSE_PTHREAD -isysroot /Developer/SDKs/MacOSX10.5.sdk -c /Users/Joe/Projects/Handbrake/current_make/macosx/../libhb/declpcm.c -o /Users/Joe/Projects/Handbrake/current_make/macosx/build/HandBrake.build/UB/libhb.build/Objects-normal/ppc/declpcm.o
CompileC build/HandBrake.build/UB/libhb.build/Objects-normal/ppc/decmpeg2.o /Users/Joe/Projects/Handbrake/current_make/macosx/../libhb/decmpeg2.c normal ppc c com.apple.compilers.gcc.4_0
cd /Users/Joe/Projects/Handbrake/current_make/macosx
/Developer/usr/bin/gcc-4.0 -x c -arch ppc -pipe -Wno-trigraphs -fpascal-strings -fasm-blocks -Os -DJOB_GROUPS=1 -fmessage-length=0 -mtune=G5 -mfix-and-continue -mmacosx-version-min=10.3 -gdwarf-2 -I/Users/Joe/Projects/Handbrake/current_make/macosx/build/HandBrake.build/UB/libhb.build/hb.hmap -DWORDS_BIGENDIAN -F/Users/Joe/Projects/Handbrake/current_make/macosx/../libhb -I/Users/Joe/Projects/Handbrake/current_make/macosx/../libhb/include -I/Users/Joe/Projects/Handbrake/current_make/macosx/../contrib/include -I/Users/Joe/Projects/Handbrake/current_make/macosx/build/HandBrake.build/UB/libhb.build/DerivedSources -D__LIBHB__ -DSYS_DARWIN -DHB_VERSION="0.9.2" -DHB_BUILD=2008021900 -DUSE_PTHREAD -isysroot /Developer/SDKs/MacOSX10.5.sdk -c /Users/Joe/Projects/Handbrake/current_make/macosx/../libhb/decmpeg2.c -o /Users/Joe/Projects/Handbrake/current_make/macosx/build/HandBrake.build/UB/libhb.build/Objects-normal/ppc/decmpeg2.o
/Users/Joe/Projects/Handbrake/current_make/macosx/../libhb/decmpeg2.c:9:28: error: mpeg2dec/mpeg2.h: No such file or directory
/Users/Joe/Projects/Handbrake/current_make/macosx/../libhb/decmpeg2.c:38: error: syntax error before ‘mpeg2dec_t’
/Users/Joe/Projects/Handbrake/current_make/macosx/../libhb/decmpeg2.c:38: warning: no semicolon at end of struct or union
/Users/Joe/Projects/Handbrake/current_make/macosx/../libhb/decmpeg2.c:39: error: syntax error before ‘*’ token
/Users/Joe/Projects/Handbrake/current_make/macosx/../libhb/decmpeg2.c:39: warning: data definition has no type or storage class
/Users/Joe/Projects/Handbrake/current_make/macosx/../libhb/decmpeg2.c:47: error: syntax error before ‘}’ token
/Users/Joe/Projects/Handbrake/current_make/macosx/../libhb/decmpeg2.c: In function ‘hb_libmpeg2_init’:
/Users/Joe/Projects/Handbrake/current_make/macosx/../libhb/decmpeg2.c:56: error: invalid application of ‘sizeof’ to incomplete type ‘hb_libmpeg2_t’
/Users/Joe/Projects/Handbrake/current_make/macosx/../libhb/decmpeg2.c:58: error: dereferencing pointer to incomplete type
/Users/Joe/Projects/Handbrake/current_make/macosx/../libhb/decmpeg2.c:59: error: dereferencing pointer to incomplete type
/Users/Joe/Projects/Handbrake/current_make/macosx/../libhb/decmpeg2.c:59: error: dereferencing pointer to incomplete type
/Users/Joe/Projects/Handbrake/current_make/macosx/../libhb/decmpeg2.c:60: error: dereferencing pointer to incomplete type
/Users/Joe/Projects/Handbrake/current_make/macosx/../libhb/decmpeg2.c:61: error: dereferencing pointer to incomplete type
/Users/Joe/Projects/Handbrake/current_make/macosx/../libhb/decmpeg2.c: In function ‘hb_libmpeg2_decode’:
/Users/Joe/Projects/Handbrake/current_make/macosx/../libhb/decmpeg2.c:74: error: ‘mpeg2_state_t’ undeclared (first use in this function)
/Users/Joe/Projects/Handbrake/current_make/macosx/../libhb/decmpeg2.c:74: error: (Each undeclared identifier is reported only once
/Users/Joe/Projects/Handbrake/current_make/macosx/../libhb/decmpeg2.c:74: error: for each function it appears in.)
/Users/Joe/Projects/Handbrake/current_make/macosx/../libhb/decmpeg2.c:74: error: syntax error before ‘state’
/Users/Joe/Projects/Handbrake/current_make/macosx/../libhb/decmpeg2.c:82: error: dereferencing pointer to incomplete type
/Users/Joe/Projects/Handbrake/current_make/macosx/../libhb/decmpeg2.c:85: error: dereferencing pointer to incomplete type
/Users/Joe/Projects/Handbrake/current_make/macosx/../libhb/decmpeg2.c:90: error: ‘state’ undeclared (first use in this function)
/Users/Joe/Projects/Handbrake/current_make/macosx/../libhb/decmpeg2.c:90: error: dereferencing pointer to incomplete type
/Users/Joe/Projects/Handbrake/current_make/macosx/../libhb/decmpeg2.c:91: error: ‘STATE_BUFFER’ undeclared (first use in this function)
/Users/Joe/Projects/Handbrake/current_make/macosx/../libhb/decmpeg2.c:96: error: ‘STATE_SEQUENCE’ undeclared (first use in this function)
/Users/Joe/Projects/Handbrake/current_make/macosx/../libhb/decmpeg2.c:98: error: dereferencing pointer to incomplete type
/Users/Joe/Projects/Handbrake/current_make/macosx/../libhb/decmpeg2.c:98: error: dereferencing pointer to incomplete type
/Users/Joe/Projects/Handbrake/current_make/macosx/../libhb/decmpeg2.c:98: error: dereferencing pointer to incomplete type
/Users/Joe/Projects/Handbrake/current_make/macosx/../libhb/decmpeg2.c:100: error: dereferencing pointer to incomplete type
/Users/Joe/Projects/Handbrake/current_make/macosx/../libhb/decmpeg2.c:100: error: dereferencing pointer to incomplete type
/Users/Joe/Projects/Handbrake/current_make/macosx/../libhb/decmpeg2.c:101: error: dereferencing pointer to incomplete type
/Users/Joe/Projects/Handbrake/current_make/macosx/../libhb/decmpeg2.c:101: error: dereferencing pointer to incomplete type
/Users/Joe/Projects/Handbrake/current_make/macosx/../libhb/decmpeg2.c:102: error: dereferencing pointer to incomplete type
/Users/Joe/Projects/Handbrake/current_make/macosx/../libhb/decmpeg2.c:102: error: dereferencing pointer to incomplete type
/Users/Joe/Projects/Handbrake/current_make/macosx/../libhb/decmpeg2.c:104: error: dereferencing pointer to incomplete type
/Users/Joe/Projects/Handbrake/current_make/macosx/../libhb/decmpeg2.c:115: error: dereferencing pointer to incomplete type
/Users/Joe/Projects/Handbrake/current_make/macosx/../libhb/decmpeg2.c:118: error: dereferencing pointer to incomplete type
/Users/Joe/Projects/Handbrake/current_make/macosx/../libhb/decmpeg2.c:127: error: ‘STATE_GOP’ undeclared (first use in this function)
/Users/Joe/Projects/Handbrake/current_make/macosx/../libhb/decmpeg2.c:127: error: dereferencing pointer to incomplete type
/Users/Joe/Projects/Handbrake/current_make/macosx/../libhb/decmpeg2.c:130: error: dereferencing pointer to incomplete type
/Users/Joe/Projects/Handbrake/current_make/macosx/../libhb/decmpeg2.c:132: error: ‘STATE_SLICE’ undeclared (first use in this function)
/Users/Joe/Projects/Handbrake/current_make/macosx/../libhb/decmpeg2.c:132: error: ‘STATE_END’ undeclared (first use in this function)
/Users/Joe/Projects/Handbrake/current_make/macosx/../libhb/decmpeg2.c:133: error: dereferencing pointer to incomplete type
/Users/Joe/Projects/Handbrake/current_make/macosx/../libhb/decmpeg2.c:135: error: dereferencing pointer to incomplete type
/Users/Joe/Projects/Handbrake/current_make/macosx/../libhb/decmpeg2.c:136: error: ‘PIC_MASK_CODING_TYPE’ undeclared (first use in this function)
/Users/Joe/Projects/Handbrake/current_make/macosx/../libhb/decmpeg2.c:136: error: ‘PIC_FLAG_CODING_TYPE_I’ undeclared (first use in this function)
/Users/Joe/Projects/Handbrake/current_make/macosx/../libhb/decmpeg2.c:138: error: dereferencing pointer to incomplete type
/Users/Joe/Projects/Handbrake/current_make/macosx/../libhb/decmpeg2.c:141: error: dereferencing pointer to incomplete type
/Users/Joe/Projects/Handbrake/current_make/macosx/../libhb/decmpeg2.c:144: error: dereferencing pointer to incomplete type
/Users/Joe/Projects/Handbrake/current_make/macosx/../libhb/decmpeg2.c:149: error: dereferencing pointer to incomplete type
/Users/Joe/Projects/Handbrake/current_make/macosx/../libhb/decmpeg2.c:151: error: dereferencing pointer to incomplete type
/Users/Joe/Projects/Handbrake/current_make/macosx/../libhb/decmpeg2.c:151: error: dereferencing pointer to incomplete type
/Users/Joe/Projects/Handbrake/current_make/macosx/../libhb/decmpeg2.c:164: error: dereferencing pointer to incomplete type
/Users/Joe/Projects/Handbrake/current_make/macosx/../libhb/decmpeg2.c:165: error: dereferencing pointer to incomplete type
/Users/Joe/Projects/Handbrake/current_make/macosx/../libhb/decmpeg2.c:165: error: dereferencing pointer to incomplete type
/Users/Joe/Projects/Handbrake/current_make/macosx/../libhb/decmpeg2.c:166: error: dereferencing pointer to incomplete type
/Users/Joe/Projects/Handbrake/current_make/macosx/../libhb/decmpeg2.c:166: error: dereferencing pointer to incomplete type
/Users/Joe/Projects/Handbrake/current_make/macosx/../libhb/decmpeg2.c:167: error: dereferencing pointer to incomplete type
/Users/Joe/Projects/Handbrake/current_make/macosx/../libhb/decmpeg2.c:168: error: dereferencing pointer to incomplete type
/Users/Joe/Projects/Handbrake/current_make/macosx/../libhb/decmpeg2.c:168: error: dereferencing pointer to incomplete type
/Users/Joe/Projects/Handbrake/current_make/macosx/../libhb/decmpeg2.c:169: error: dereferencing pointer to incomplete type
/Users/Joe/Projects/Handbrake/current_make/macosx/../libhb/decmpeg2.c:169: error: dereferencing pointer to incomplete type
/Users/Joe/Projects/Handbrake/current_make/macosx/../libhb/decmpeg2.c:170: error: dereferencing pointer to incomplete type
/Users/Joe/Projects/Handbrake/current_make/macosx/../libhb/decmpeg2.c:171: error: dereferencing pointer to incomplete type
/Users/Joe/Projects/Handbrake/current_make/macosx/../libhb/decmpeg2.c:171: error: dereferencing pointer to incomplete type
/Users/Joe/Projects/Handbrake/current_make/macosx/../libhb/decmpeg2.c:173: error: dereferencing pointer to incomplete type
/Users/Joe/Projects/Handbrake/current_make/macosx/../libhb/decmpeg2.c:173: error: ‘PIC_FLAG_TAGS’ undeclared (first use in this function)
/Users/Joe/Projects/Handbrake/current_make/macosx/../libhb/decmpeg2.c:176: error: dereferencing pointer to incomplete type
/Users/Joe/Projects/Handbrake/current_make/macosx/../libhb/decmpeg2.c:177: error: dereferencing pointer to incomplete type
/Users/Joe/Projects/Handbrake/current_make/macosx/../libhb/decmpeg2.c:183: error: dereferencing pointer to incomplete type
/Users/Joe/Projects/Handbrake/current_make/macosx/../libhb/decmpeg2.c:187: error: dereferencing pointer to incomplete type
/Users/Joe/Projects/Handbrake/current_make/macosx/../libhb/decmpeg2.c:188: error: dereferencing pointer to incomplete type
/Users/Joe/Projects/Handbrake/current_make/macosx/../libhb/decmpeg2.c:188: error: dereferencing pointer to incomplete type
/Users/Joe/Projects/Handbrake/current_make/macosx/../libhb/decmpeg2.c:189: error: dereferencing pointer to incomplete type
/Users/Joe/Projects/Handbrake/current_make/macosx/../libhb/decmpeg2.c:195: error: dereferencing pointer to incomplete type
/Users/Joe/Projects/Handbrake/current_make/macosx/../libhb/decmpeg2.c:197: error: dereferencing pointer to incomplete type
/Users/Joe/Projects/Handbrake/current_make/macosx/../libhb/decmpeg2.c:224: error: ‘PIC_FLAG_PROGRESSIVE_FRAME’ undeclared (first use in this function)
/Users/Joe/Projects/Handbrake/current_make/macosx/../libhb/decmpeg2.c:224: error: ‘PIC_FLAG_TOP_FIELD_FIRST’ undeclared (first use in this function)
/Users/Joe/Projects/Handbrake/current_make/macosx/../libhb/decmpeg2.c:284: error: dereferencing pointer to incomplete type
/Users/Joe/Projects/Handbrake/current_make/macosx/../libhb/decmpeg2.c:289: error: ‘STATE_INVALID’ undeclared (first use in this function)
/Users/Joe/Projects/Handbrake/current_make/macosx/../libhb/decmpeg2.c:291: error: dereferencing pointer to incomplete type
/Users/Joe/Projects/Handbrake/current_make/macosx/../libhb/decmpeg2.c: In function ‘hb_libmpeg2_info’:
/Users/Joe/Projects/Handbrake/current_make/macosx/../libhb/decmpeg2.c:305: error: dereferencing pointer to incomplete type
/Users/Joe/Projects/Handbrake/current_make/macosx/../libhb/decmpeg2.c:306: error: dereferencing pointer to incomplete type
/Users/Joe/Projects/Handbrake/current_make/macosx/../libhb/decmpeg2.c:307: error: dereferencing pointer to incomplete type
/Users/Joe/Projects/Handbrake/current_make/macosx/../libhb/decmpeg2.c:309: error: dereferencing pointer to incomplete type
/Users/Joe/Projects/Handbrake/current_make/macosx/../libhb/decmpeg2.c:309: error: ‘PIC_FLAG_PROGRESSIVE_FRAME’ undeclared (first use in this function)
/Users/Joe/Projects/Handbrake/current_make/macosx/../libhb/decmpeg2.c:309: error: dereferencing pointer to incomplete type
/Users/Joe/Projects/Handbrake/current_make/macosx/../libhb/decmpeg2.c:317: error: dereferencing pointer to incomplete type
/Users/Joe/Projects/Handbrake/current_make/macosx/../libhb/decmpeg2.c:320: error: dereferencing pointer to incomplete type
/Users/Joe/Projects/Handbrake/current_make/macosx/../libhb/decmpeg2.c:321: error: dereferencing pointer to incomplete type
/Users/Joe/Projects/Handbrake/current_make/macosx/../libhb/decmpeg2.c: In function ‘hb_libmpeg2_close’:
/Users/Joe/Projects/Handbrake/current_make/macosx/../libhb/decmpeg2.c:333: error: dereferencing pointer to incomplete type
/Users/Joe/Projects/Handbrake/current_make/macosx/../libhb/decmpeg2.c: In function ‘decmpeg2Work’:
/Users/Joe/Projects/Handbrake/current_make/macosx/../libhb/decmpeg2.c:384: error: dereferencing pointer to incomplete type
** BUILD FAILED **
JoeMacBook:current_make Joe$