rendered paste bodyprograms/charmap-dir.c:269: warning: too many arguments for format
make[2]: Leaving directory `/var/tmp/paludis/sys-libs/glibc-2.7-r1/work/glibc-2.7/locale'
/usr/bin/make -j3 -s subdir=localedata -C localedata ..=../ others
/usr/bin/make -j3 -s subdir=assert -C assert ..=../ others
make[2]: Entering directory `/var/tmp/paludis/sys-libs/glibc-2.7-r1/work/glibc-2.7/assert'
make[2]: Leaving directory `/var/tmp/paludis/sys-libs/glibc-2.7-r1/work/glibc-2.7/assert'
/usr/bin/make -j3 -s subdir=ctype -C ctype ..=../ others
make[2]: Entering directory `/var/tmp/paludis/sys-libs/glibc-2.7-r1/work/glibc-2.7/ctype'
make[2]: Leaving directory `/var/tmp/paludis/sys-libs/glibc-2.7-r1/work/glibc-2.7/ctype'
/usr/bin/make -j3 -s subdir=intl -C intl ..=../ others
make[2]: Entering directory `/var/tmp/paludis/sys-libs/glibc-2.7-r1/work/glibc-2.7/intl'
make[2]: Leaving directory `/var/tmp/paludis/sys-libs/glibc-2.7-r1/work/glibc-2.7/intl'
/usr/bin/make -j3 -s subdir=catgets -C catgets ..=../ others
make[2]: Entering directory `/var/tmp/paludis/sys-libs/glibc-2.7-r1/work/glibc-2.7/catgets'
make[2]: Leaving directory `/var/tmp/paludis/sys-libs/glibc-2.7-r1/work/glibc-2.7/catgets'
make[2]: Entering directory `/var/tmp/paludis/sys-libs/glibc-2.7-r1/work/glibc-2.7/catgets'
make[2]: Leaving directory `/var/tmp/paludis/sys-libs/glibc-2.7-r1/work/glibc-2.7/catgets'
/usr/bin/make -j3 -s subdir=math -C math ..=../ others
make[2]: Entering directory `/var/tmp/paludis/sys-libs/glibc-2.7-r1/work/glibc-2.7/math'
make[2]: Leaving directory `/var/tmp/paludis/sys-libs/glibc-2.7-r1/work/glibc-2.7/math'
make[2]: Entering directory `/var/tmp/paludis/sys-libs/glibc-2.7-r1/work/glibc-2.7/math'
{standard input}: Assembler messages:
{standard input}:41: Error: suffix or operands invalid for `fnstsw'
make[2]: *** [/var/tmp/paludis/sys-libs/glibc-2.7-r1/work/build-default-i686-pc-linux-gnu-nptl/math/ftestexcept.o] Error 1
make[2]: *** Waiting for unfinished jobs....
make[2]: Leaving directory `/var/tmp/paludis/sys-libs/glibc-2.7-r1/work/glibc-2.7/math'
make[1]: *** [math/others] Error 2
make[1]: Leaving directory `/var/tmp/paludis/sys-libs/glibc-2.7-r1/work/glibc-2.7'
make: *** [all] Error 2
!!! ERROR in sys-libs/glibc-2.7-r1:
!!! In toolchain-glibc_src_compile at line 122
!!! make for default failed
!!! Call stack:
!!! * toolchain-glibc_src_compile (/var/paludis/repositories/gentoo/sys-libs/glibc/files/eblits/src_compile.eblit:122)
!!! * eblit-glibc-src_compile (/var/paludis/repositories/gentoo/sys-libs/glibc/files/eblits/src_compile.eblit:179)
!!! * eblit-run (/var/tmp/paludis/sys-libs/glibc-2.7-r1/temp/loadsaveenv:1454)
!!! * src_compile (/var/tmp/paludis/sys-libs/glibc-2.7-r1/temp/loadsaveenv:4374)
!!! * ebuild_f_compile (/usr/libexec/paludis/0/src_compile.bash:51)
!!! * ebuild_main (/usr/libexec/paludis/ebuild.bash:457)
!!! * main (/usr/libexec/paludis/ebuild.bash:475)
diefunc: making ebuild PID 12484 exit with error
die trap: exiting with error.
Install error:
* In program paludis -i glibc:
* When performing install action from command line:
* When executing install task:
* When installing 'sys-libs/glibc-2.7-r1:2.2::gentoo':
* Install error: Install failed for 'sys-libs/glibc-2.7-r1:2.2::gentoo'