mbonfils@BONFILS:~/perso/paintown-3.0$ scons
scons: Reading SConscript files ...
Checking for C header file allegro.h... (cached) yes
Checking for C header file ft2build.h... (cached) yes
Checking for C header file png.h... (cached) yes
scons: done reading SConscript files.
scons: Building targets ...
g++ -o build/object/actor.o -c -Wall -Werror -O2 -fno-rtti -Woverloaded-virtual -Ibuild -Ibuild/hawknl -I/usr/include -I/usr/include/libpng12 -I/usr/include/freetype2 build/object/actor.cpp
In file included from build/object/object.h:11,
from build/object/object_nonattack.h:7,
from build/object/actor.cpp:1:
build/network/network.h:5:23: error: hawknl/nl.h: Aucun fichier ou répertoire de ce type
In file included from build/object/object.h:11,
from build/object/object_nonattack.h:7,
from build/object/actor.cpp:1:
build/network/network.h:12: error: ‘NLsocket’ does not name a type
build/network/network.h:42: error: expected `)' before ‘socket’
build/network/network.h:56: error: ‘Socket’ has not been declared
build/network/network.h:62: error: ‘NLsocket’ was not declared in this scope
build/network/network.h:63: error: variable or field ‘send16’ declared void
build/network/network.h:63: error: ‘NLsocket’ was not declared in this scope
build/network/network.h:63: error: expected primary-expression before ‘length’
build/network/network.h:64: error: ‘NLsocket’ was not declared in this scope
build/network/network.h:64: error: expected primary-expression before ‘const’
build/network/network.h:65: error: variable or field ‘sendStr’ declared void
build/network/network.h:65: error: ‘NLsocket’ was not declared in this scope
build/network/network.h:65: error: expected primary-expression before ‘const’
build/network/network.h:66: error: variable or field ‘sendBytes’ declared void
build/network/network.h:66: error: ‘NLsocket’ was not declared in this scope
build/network/network.h:66: error: expected primary-expression before ‘const’
build/network/network.h:66: error: expected primary-expression before ‘int’
build/network/network.h:67: error: variable or field ‘readBytes’ declared void
build/network/network.h:67: error: ‘NLsocket’ was not declared in this scope
build/network/network.h:67: error: expected primary-expression before ‘*’ token
build/network/network.h:67: error: ‘data’ was not declared in this scope
build/network/network.h:67: error: expected primary-expression before ‘int’
build/network/network.h:72: error: variable or field ‘listen’ declared void
build/network/network.h:72: error: ‘Socket’ was not declared in this scope
build/network/network.h:73: error: ‘Socket’ does not name a type
build/network/network.h:75: error: ‘Socket’ does not name a type
build/network/network.h:76: error: ‘Socket’ does not name a type
build/network/network.h:77: error: variable or field ‘close’ declared void
build/network/network.h:77: error: ‘Socket’ was not declared in this scope
build/network/network.h:80: error: ‘Socket’ was not declared in this scope
build/network/network.h:80: error: template argument 1 is invalid
build/network/network.h:80: error: template argument 2 is invalid
build/network/network.h:80: error: invalid type in declaration before ‘;’ token
cc1plus: warnings being treated as errors
build/network/network.h:80: warning: ‘Network::open_sockets’ defined but not used
scons: *** [build/object/actor.o] Error 1
scons: building terminated because of errors.