ipt.pro
make[2]: Leaving directory `/home/kde-devel/kde/build/qt-copy/src/plugins/script'
make[2]: Entering directory `/home/kde-devel/kde/build/qt-copy/src/plugins/script'
cd qtdbus/ && /usr/bin/make -f Makefile
make[3]: Entering directory `/home/kde-devel/kde/build/qt-copy/src/plugins/script/qtdbus'
/home/kde-devel/kde/build/qt-copy/bin/qmake QMAKE_ABSOLUTE_SOURCE_PATH=/home/kde-devel/kde/src/qt-copy/src/plugins/script/qtdbus -spec /home/kde-devel/kde/src/qt-copy/mkspecs/linux-g++ -unix -o Makefile /home/kde-devel/kde/src/qt-copy/src/plugins/script/qtdbus/qtdbus.pro
make[3]: Leaving directory `/home/kde-devel/kde/build/qt-copy/src/plugins/script/qtdbus'
rm -f libqtaccessiblewidgets.so
g++ -Wl,--no-undefined -Wl,-rpath,/home/kde-devel/qt-copy/lib -Wl,-rpath,/home/kde-devel/qt-copy/lib -shared -o libqtaccessiblewidgets.so .obj/debug-shared/main.o .obj/debug-shared/simplewidgets.o .obj/debug-shared/rangecontrols.o .obj/debug-shared/complexwidgets.o .obj/debug-shared/qaccessiblewidgets.o .obj/debug-shared/qaccessiblemenu.o -L/home/kde-devel/kde/build/qt-copy/lib -lQtGui -L/home/kde-devel/kde/build/qt-copy/lib -L/usr/X11R6/lib -lpng -lSM -lICE -pthread -pthread -lXi -lXrender -lXrandr -lfreetype -lfontconfig -lXext -lX11 -lQtCore -lz -lm -pthread -lgthread-2.0 -lrt -lglib-2.0 -lpthread -ldl
make[3]: Entering directory `/home/kde-devel/kde/build/qt-copy/src/plugins/script/qtdbus'
g++ -c -pipe -g -g -fvisibility=hidden -fvisibility-inlines-hidden -D_REENTRANT -Wall -W -fPIC -DQT_PLUGIN -DQT_SCRIPT_LIB -DQT_GUI_LIB -DQT_CORE_LIB -D_LARGEFILE64_SOURCE -D_LARGEFILE_SOURCE -DQT_SHARED -I/home/kde-devel/kde/src/qt-copy/mkspecs/linux-g++ -I/home/kde-devel/kde/src/qt-copy/src/plugins/script/qtdbus -I../../../../include/QtCore -I../../../../include/QtCore -I../../../../include/QtGui -I../../../../include/QtGui -I../../../../include/QtScript -I../../../../include/QtScript -I../../../../include -I../../../../include/QtDBus -I../../../../include -I.moc/debug-shared -I.uic/debug-shared -I. -o .obj/debug-shared/main.o /home/kde-devel/kde/src/qt-copy/src/plugins/script/qtdbus/main.cpp
/usr/include/math.h:30: error: expected constructor, destructor, or type conversion before ‘extern’
../../../../include/QtCore/../../../../src/qt-copy/src/corelib/kernel/qmath.h:51: error: ‘QT_BEGIN_NAMESPACE’ does not name a type
../../../../include/QtCore/../../../../src/qt-copy/src/corelib/kernel/qmath.h:65: error: ‘qFloor’ declared as an ‘inline’ variable
../../../../include/QtCore/../../../../src/qt-copy/src/corelib/kernel/qmath.h:65: error: ‘qreal’ was not declared in this scope
../../../../include/QtCore/../../../../src/qt-copy/src/corelib/kernel/qmath.h:66: error: expected ‘,’ or ‘;’ before ‘{’ token
../../../../include/QtCore/../../../../src/qt-copy/src/corelib/kernel/qmath.h:75: error: ‘qreal’ does not name a type
../../../../include/QtCore/../../../../src/qt-copy/src/corelib/kernel/qmath.h:85: error: ‘qreal’ does not name a type
../../../../include/QtCore/../../../../src/qt-copy/src/corelib/kernel/qmath.h:95: error: ‘qreal’ does not name a type
../../../../include/QtCore/../../../../src/qt-copy/src/corelib/kernel/qmath.h:105: error: ‘qreal’ does not name a type
../../../../include/QtCore/../../../../src/qt-copy/src/corelib/kernel/qmath.h:115: error: ‘QT_END_NAMESPACE’ does not name a type
/usr/include/c++/4.1.3/cstddef:54: error: ‘::ptrdiff_t’ has not been declared
/usr/include/c++/4.1.3/bits/postypes.h:78: error: ‘ptrdiff_t’ does not name a type
/usr/include/c++/4.1.3/bits/stl_iterator_base_types.h:104: error: expected type-specifier before ‘ptrdiff_t’
/usr/include/c++/4.1.3/bits/stl_iterator_base_types.h:104: error: expected `>' before ‘ptrdiff_t’
/usr/include/c++/4.1.3/bits/stl_iterator_base_types.h:115: error: ‘_Pointer’ does not name a type
/usr/include/c++/4.1.3/bits/stl_iterator_base_types.h:117: error: ‘_Reference’ does not name a type
/usr/include/c++/4.1.3/bits/stl_iterator_base_types.h:141: error: ‘ptrdiff_t’ does not name a type
/usr/include/c++/4.1.3/bits/stl_iterator_base_types.h:151: error: ‘ptrdiff_t’ does not name a type
/usr/include/c++/4.1.3/bits/stl_iterator.h:97: error: wrong number of template arguments (5, should be 3)
/usr/include/c++/4.1.3/bits/stl_iterator_base_types.h:106: error: provided for ‘template<class _Category, class _Tp, class _Distance> struct std::iterator’
/usr/include/c++/4.1.3/bits/stl_iterator.h:384: error: wrong number of template arguments (5, should be 3)
/usr/include/c++/4.1.3/bits/stl_iterator_base_types.h:106: error: provided for ‘template<class _Category, class _Tp, class _Distance> struct std::iterator’
/usr/include/c++/4.1.3/bits/stl_iterator.h:459: error: wrong number of template arguments (5, should be 3)
/usr/include/c++/4.1.3/bits/stl_iterator_base_types.h:106: error: provided for ‘template<class _Category, class _Tp, class _Distance> struct std::iterator’
/usr/include/c++/4.1.3/bits/stl_iterator.h:537: error: wrong number of template arguments (5, should be 3)
/usr/include/c++/4.1.3/bits/stl_iterator_base_types.h:106: error: provided for ‘template<class _Category, class _Tp, class _Distance> struct std::iterator’
mv -f libqtaccessiblewidgets.so ../../../../plugins/accessible/
/usr/include/c++/4.1.3/bits/stl_algobase.h: In static member function ‘static _Tp* std::__copy_backward<true, std::random_access_iterator_tag>::copy_b(const _Tp*, const _Tp*, _Tp*)’:
/usr/include/c++/4.1.3/bits/stl_algobase.h:424: error: ‘ptrdiff_t’ does not name a type
/usr/include/c++/4.1.3/bits/stl_algobase.h:425: error: ‘_Num’ was not declared in this scope
/usr/include/c++/4.1.3/ext/new_allocator.h: At global scope:
/usr/include/c++/4.1.3/ext/new_allocator.h:54: error: ‘ptrdiff_t’ does not name a type
/usr/include/c++/4.1.3/bits/allocator.h:65: error: ‘ptrdiff_t’ does not name a type
/usr/include/c++/4.1.3/bits/allocator.h:86: error: ‘ptrdiff_t’ does not name a type
/usr/include/c++/4.1.3/bits/stl_raw_storage_iter.h:72: error: wrong number of template arguments (5, should be 3)
/usr/include/c++/4.1.3/bits/stl_iterator_base_types.h:106: error: provided for ‘template<class _Category, class _Tp, class _Distance> struct std::iterator’
/usr/include/c++/4.1.3/memory:73: error: ‘ptrdiff_t’ was not declared in this scope
/usr/include/c++/4.1.3/memory:73: error: template argument 2 is invalid
/usr/include/c++/4.1.3/memory:74: error: invalid type in declaration before ‘(’ token
/usr/include/c++/4.1.3/memory:74: error: template declaration of ‘int std::__get_temporary_buffer’
/usr/include/c++/4.1.3/memory:74: error: ‘ptrdiff_t’ was not declared in this scope
/usr/include/c++/4.1.3/memory:74: error: expected primary-expression before ‘*’ token
/usr/include/c++/4.1.3/memory:74: error: expected primary-expression before ‘)’ token
/usr/include/c++/4.1.3/memory:109: error: ‘ptrdiff_t’ was not declared in this scope
/usr/include/c++/4.1.3/memory:109: error: template argument 2 is invalid
/usr/include/c++/4.1.3/memory:110: error: invalid type in declaration before ‘(’ token
/usr/include/c++/4.1.3/memory:110: error: ‘std::get_temporary_buffer’ declared as an ‘inline’ variable
/usr/include/c++/4.1.3/memory:110: error: template declaration of ‘int std::get_temporary_buffer’
/usr/include/c++/4.1.3/memory:110: error: ‘ptrdiff_t’ was not declared in this scope
/usr/include/c++/4.1.3/bits/stl_tempbuf.h:85: error: ‘ptrdiff_t’ does not name a type
/usr/include/c++/4.1.3/bits/stl_tempbuf.h:88: error: ‘size_type’ does not name a type
/usr/include/c++/4.1.3/bits/stl_tempbuf.h:89: error: ‘size_type’ does not name a type
/usr/include/c++/4.1.3/bits/stl_tempbuf.h:101: error: ‘size_type’ does not name a type
/usr/include/c++/4.1.3/bits/stl_tempbuf.h:106: error: ‘size_type’ does not name a type
/usr/include/c++/4.1.3/bits/stl_tempbuf.h: In member function ‘void std::_Temporary_buffer<_ForwardIterator, _Tp>::_M_initialize_buffer(const _Tp&, __false_type)’:
/usr/include/c++/4.1.3/bits/stl_tempbuf.h:97: error: ‘_M_len’ was not declared in this scope
/usr/include/c++/4.1.3/bits/stl_tempbuf.h: In member function ‘_Tp* std::_Temporary_buffer<_ForwardIterator, _Tp>::end()’:
/usr/include/c++/4.1.3/bits/stl_tempbuf.h:118: error: ‘_M_len’ was not declared in this scope
/usr/include/c++/4.1.3/bits/stl_tempbuf.h: In destructor ‘std::_Temporary_buffer<_ForwardIterator, _Tp>::~_Temporary_buffer()’:
/usr/include/c++/4.1.3/bits/stl_tempbuf.h:128: error: ‘_M_len’ was not declared in this scope
/usr/include/c++/4.1.3/bits/stl_tempbuf.h: In constructor ‘std::_Temporary_buffer<_ForwardIterator, _Tp>::_Temporary_buffer(_ForwardIterator, _ForwardIterator)’:
/usr/include/c++/4.1.3/bits/stl_tempbuf.h:144: error: class ‘std::_Temporary_buffer<_ForwardIterator, _Tp>’ does not have any field named ‘_M_original_len’
/usr/include/c++/4.1.3/bits/stl_tempbuf.h:145: error: class ‘std::_Temporary_buffer<_ForwardIterator, _Tp>’ does not have any field named ‘_M_len’
/usr/include/c++/4.1.3/bits/stl_tempbuf.h:152: error: ‘size_type’ was not declared in this scope
/usr/include/c++/4.1.3/bits/stl_tempbuf.h:152: error: template argument 2 is invalid
/usr/include/c++/4.1.3/bits/stl_tempbuf.h:152: error: invalid type in declaration before ‘(’ token
/usr/include/c++/4.1.3/bits/stl_tempbuf.h:152: error: ‘get_temporary_buffer’ was not declared in this scope
/usr/include/c++/4.1.3/bits/stl_tempbuf.h:153: error: expected primary-expression before ‘>’ token
/usr/include/c++/4.1.3/bits/stl_tempbuf.h:153: error: ‘_M_original_len’ was not declared in this scope
/usr/include/c++/4.1.3/bits/stl_tempbuf.h:154: error: request for member ‘first’ in ‘__p’, which is of non-class type ‘int’
/usr/include/c++/4.1.3/bits/stl_tempbuf.h:155: error: ‘_M_len’ was not declared in this scope
/usr/include/c++/4.1.3/bits/stl_tempbuf.h:155: error: request for member ‘second’ in ‘__p’, which is of non-class type ‘int’
/usr/include/c++/4.1.3/bits/stl_tempbuf.h:163: error: ‘_M_len’ was not declared in this scope
(test -z "../../../../plugins/accessible/" || cd "../../../../plugins/accessible/" ; targ=`basename libqtaccessiblewidgets.so`; objcopy --only-keep-debug "$targ" "$targ.debug" && objcopy --strip-debug "$targ" && objcopy --add-gnu-debuglink="$targ.debug" "$targ" && chmod -x "$targ.debug" ) ;
/usr/include/c++/4.1.3/bits/basic_string.h: At global scope:
/usr/include/c++/4.1.3/bits/basic_string.h: In instantiation of ‘std::basic_string<char, std::char_traits<char>, std::allocator<char> >’:
/usr/include/c++/4.1.3/bits/basic_string.tcc:974: instantiated from here
/usr/include/c++/4.1.3/bits/basic_string.h:120: error: no type named ‘difference_type’ in ‘struct std::allocator<char>’
/usr/include/c++/4.1.3/bits/basic_string.h: In instantiation of ‘std::basic_string<wchar_t, std::char_traits<wchar_t>, std::allocator<wchar_t> >’:
/usr/include/c++/4.1.3/bits/basic_string.tcc:989: instantiated from here
/usr/include/c++/4.1.3/bits/basic_string.h:120: error: no type named ‘difference_type’ in ‘struct std::allocator<wchar_t>’
make[3]: Leaving directory `/home/kde-devel/kde/build/qt-copy/src/plugins/accessible/widgets'
cd compat/ && /usr/bin/make -f Makefile
/usr/include/c++/4.1.3/bits/stl_iterator.h: In instantiation of ‘__gnu_cxx::__normal_iterator<wchar_t*, std::basic_string<wchar_t, std::char_traits<wchar_t>, std::allocator<wchar_t> > >’:
../../../../include/QtCore/../../../../src/qt-copy/src/corelib/tools/qstring.h:1009: instantiated from here
/usr/include/c++/4.1.3/bits/stl_iterator.h:643: error: no type named ‘difference_type’ in ‘struct std::iterator_traits<wchar_t*>’
/usr/include/c++/4.1.3/bits/stl_iterator.h:695: error: no type named ‘difference_type’ in ‘struct std::iterator_traits<wchar_t*>’
/usr/include/c++/4.1.3/bits/stl_iterator.h:699: error: no type named ‘difference_type’ in ‘struct std::iterator_traits<wchar_t*>’
/usr/include/c++/4.1.3/bits/stl_iterator.h:703: error: no type named ‘difference_type’ in ‘struct std::iterator_traits<wchar_t*>’
/usr/include/c++/4.1.3/bits/stl_iterator.h:707: error: no type named ‘difference_type’ in ‘struct std::iterator_traits<wchar_t*>’
/usr/include/c++/4.1.3/bits/stl_iterator.h:711: error: no type named ‘difference_type’ in ‘struct std::iterator_traits<wchar_t*>’
/usr/include/c++/4.1.3/bits/ios_base.h:457: error: ‘streamsize’ does not name a type
/usr/include/c++/4.1.3/bits/ios_base.h:458: error: ‘streamsize’ does not name a type
/usr/include/c++/4.1.3/bits/ios_base.h:617: error: ‘streamsize’ does not name a type
/usr/include/c++/4.1.3/bits/ios_base.h:625: error: ‘streamsize’ does not name a type
/usr/include/c++/4.1.3/bits/ios_base.h:639: error: ‘streamsize’ does not name a type
/usr/include/c++/4.1.3/bits/ios_base.h:647: error: ‘streamsize’ does not name a type
/usr/include/c++/4.1.3/streambuf:58: error: expected constructor, destructor, or type conversion before ‘__copy_streambufs’
/usr/include/c++/4.1.3/streambuf:153: error: ‘streamsize’ does not name a type
/usr/include/c++/4.1.3/streambuf:241: error: ‘streamsize’ has not been declared
/usr/include/c++/4.1.3/streambuf:267: error: ‘streamsize’ does not name a type
/usr/include/c++/4.1.3/streambuf:340: error: ‘streamsize’ does not name a type
/usr/include/c++/4.1.3/streambuf:432: error: ‘streamsize’ does not name a type
/usr/include/c++/4.1.3/streambuf:574: error: ‘streamsize’ has not been declared
/usr/include/c++/4.1.3/streambuf:631: error: ‘streamsize’ does not name a type
/usr/include/c++/4.1.3/streambuf:647: error: ‘streamsize’ does not name a type
/usr/include/c++/4.1.3/streambuf:724: error: ‘streamsize’ does not name a type
/usr/include/c++/4.1.3/streambuf:795: error: expected constructor, destructor, or type conversion before ‘__copy_streambufs’
/usr/include/c++/4.1.3/streambuf:800: error: expected constructor, destructor, or type conversion before ‘__copy_streambufs’
/usr/include/c++/4.1.3/bits/streambuf.tcc:49: error: expected constructor, destructor, or type conversion before ‘basic_streambuf’
/usr/include/c++/4.1.3/bits/streambuf.tcc:83: error: expected constructor, destructor, or type conversion before ‘basic_streambuf’
/usr/include/c++/4.1.3/bits/streambuf.tcc:120: error: expected constructor, destructor, or type conversion before ‘__copy_streambufs’
/usr/include/c++/4.1.3/bits/streambuf.tcc:142: error: explicit instantiation of non-template ‘int std::streamsize’
/usr/include/c++/4.1.3/bits/streambuf.tcc:143: error: expected `;' before ‘__copy_streambufs’
/usr/include/c++/4.1.3/bits/streambuf.tcc:148: error: explicit instantiation of non-template ‘int std::streamsize’
/usr/include/c++/4.1.3/bits/streambuf.tcc:149: error: expected `;' before ‘__copy_streambufs’
/usr/include/c++/4.1.3/bits/streambuf_iterator.h:53: error: wrong number of template arguments (5, should be 3)
/usr/include/c++/4.1.3/bits/stl_iterator_base_types.h:106: error: provided for ‘template<class _Category, class _Tp, class _Distance> struct std::iterator’
/usr/include/c++/4.1.3/bits/streambuf_iterator.h:192: error: wrong number of template arguments (5, should be 3)
/usr/include/c++/4.1.3/bits/stl_iterator_base_types.h:106: error: provided for ‘template<class _Category, class _Tp, class _Distance> struct std::iterator’
/usr/include/c++/4.1.3/bits/streambuf_iterator.h:248: error: ‘streamsize’ has not been declared
/usr/include/c++/4.1.3/bits/locale_facets.h:91: error: expected ‘,’ or ‘...’ before ‘__newlen’
make[3]: Entering directory `/home/kde-devel/kde/build/qt-copy/src/plugins/accessible/compat'
/home/kde-devel/kde/build/qt-copy/bin/qmake QMAKE_ABSOLUTE_SOURCE_PATH=/home/kde-devel/kde/src/qt-copy/src/plugins/accessible/compat -spec /home/kde-devel/kde/src/qt-copy/mkspecs/linux-g++ -unix -o Makefile /home/kde-devel/kde/src/qt-copy/src/plugins/accessible/compat/compat.pro
/usr/include/c++/4.1.3/bits/locale_facets.h:2415: error: ‘streamsize’ has not been declared
/usr/include/c++/4.1.3/ostream:266: error: ‘streamsize’ has not been declared
/usr/include/c++/4.1.3/ostream:290: error: ‘streamsize’ has not been declared
/usr/include/c++/4.1.3/ostream: In member function ‘void std::basic_ostream<_CharT, _Traits>::_M_write(const _CharT*, int)’:
/usr/include/c++/4.1.3/ostream:268: error: ‘streamsize’ was not declared in this scope
/usr/include/c++/4.1.3/ostream:268: error: expected `;' before ‘__put’
/usr/include/c++/4.1.3/ostream:269: error: ‘__put’ was not declared in this scope
/usr/include/c++/4.1.3/bits/locale_facets.tcc: At global scope:
/usr/include/c++/4.1.3/bits/locale_facets.tcc:836: error: ‘streamsize’ has not been declared
/usr/include/c++/4.1.3/bits/locale_facets.tcc: In member function ‘_OutIter std::num_put<_CharT, _OutIter>::_M_insert_int(_OutIter, std::ios_base&, _CharT, _ValueT) const’:
/usr/include/c++/4.1.3/bits/locale_facets.tcc:1018: error: ‘streamsize’ does not name a type
/usr/include/c++/4.1.3/bits/locale_facets.tcc:1019: error: ‘__w’ was not declared in this scope
/usr/include/c++/4.1.3/bits/locale_facets.tcc:1019: error: expected type-specifier before ‘streamsize’
/usr/include/c++/4.1.3/bits/locale_facets.tcc:1019: error: expected `>' before ‘streamsize’
/usr/include/c++/4.1.3/bits/locale_facets.tcc:1019: error: expected `(' before ‘streamsize’
/usr/include/c++/4.1.3/bits/locale_facets.tcc:1019: error: ‘streamsize’ was not declared in this scope
/usr/include/c++/4.1.3/bits/locale_facets.tcc:1020: error: expected `)' before ‘{’ token
/usr/include/c++/4.1.3/bits/locale_facets.tcc: In member function ‘_OutIter std::num_put<_CharT, _OutIter>::_M_insert_float(_OutIter, std::ios_base&, _CharT, char, _ValueT) const’:
/usr/include/c++/4.1.3/bits/locale_facets.tcc:1081: error: ‘streamsize’ was not declared in this scope
/usr/include/c++/4.1.3/bits/locale_facets.tcc:1081: error: expected `;' before ‘__prec’
/usr/include/c++/4.1.3/bits/locale_facets.tcc:1082: error: ‘__prec’ was not declared in this scope
/usr/include/c++/4.1.3/bits/locale_facets.tcc:1082: error: expected type-specifier before ‘streamsize’
/usr/include/c++/4.1.3/bits/locale_facets.tcc:1082: error: expected `>' before ‘streamsize’
/usr/include/c++/4.1.3/bits/locale_facets.tcc:1082: error: expected `(' before ‘streamsize’
/usr/include/c++/4.1.3/bits/locale_facets.tcc:1083: error: expected `)' before ‘__prec’
/usr/include/c++/4.1.3/bits/locale_facets.tcc:1100: error: ‘__prec’ was not declared in this scope
/usr/include/c++/4.1.3/bits/locale_facets.tcc:1157: error: expected `;' before ‘__off’
/usr/include/c++/4.1.3/bits/locale_facets.tcc:1160: error: ‘__off’ was not declared in this scope
/usr/include/c++/4.1.3/bits/locale_facets.tcc:1166: error: ‘__off’ was not declared in this scope
/usr/include/c++/4.1.3/bits/locale_facets.tcc:1174: error: ‘streamsize’ does not name a type
/usr/include/c++/4.1.3/bits/locale_facets.tcc:1175: error: ‘__w’ was not declared in this scope
/usr/include/c++/4.1.3/bits/locale_facets.tcc:1175: error: expected type-specifier before ‘streamsize’
/usr/include/c++/4.1.3/bits/locale_facets.tcc:1175: error: expected `>' before ‘streamsize’
/usr/include/c++/4.1.3/bits/locale_facets.tcc:1175: error: expected `(' before ‘streamsize’
/usr/include/c++/4.1.3/bits/locale_facets.tcc:1176: error: expected `)' before ‘{’ token
/usr/include/c++/4.1.3/bits/locale_facets.tcc: In member function ‘virtual _OutIter std::num_put<_CharT, _OutIter>::do_put(_OutIter, std::ios_base&, _CharT, bool) const’:
/usr/include/c++/4.1.3/bits/locale_facets.tcc:1212: error: ‘streamsize’ does not name a type
/usr/include/c++/4.1.3/bits/locale_facets.tcc:1213: error: ‘__w’ was not declared in this scope
/usr/include/c++/4.1.3/bits/locale_facets.tcc:1213: error: expected type-specifier before ‘streamsize’
/usr/include/c++/4.1.3/bits/locale_facets.tcc:1213: error: expected `>' before ‘streamsize’
/usr/include/c++/4.1.3/bits/locale_facets.tcc:1213: error: expected `(' before ‘streamsize’
/usr/include/c++/4.1.3/bits/locale_facets.tcc:1213: error: ‘streamsize’ was not declared in this scope
/usr/include/c++/4.1.3/bits/locale_facets.tcc:1214: error: expected `)' before ‘{’ token
/usr/include/c++/4.1.3/bits/stl_iterator.h: At global scope:
/usr/include/c++/4.1.3/bits/stl_iterator.h: In instantiation of ‘__gnu_cxx::__normal_iterator<char*, std::basic_string<char, std::char_traits<char>, std::allocator<char> > >’:
/usr/include/c++/4.1.3/bits/locale_facets.tcc:1478: instantiated from here
/usr/include/c++/4.1.3/bits/stl_iterator.h:643: error: no type named ‘difference_type’ in ‘struct std::iterator_traits<char*>’
/usr/include/c++/4.1.3/bits/stl_iterator.h:695: error: no type named ‘difference_type’ in ‘struct std::iterator_traits<char*>’
/usr/include/c++/4.1.3/bits/stl_iterator.h:699: error: no type named ‘difference_type’ in ‘struct std::iterator_traits<char*>’
/usr/include/c++/4.1.3/bits/stl_iterator.h:703: error: no type named ‘difference_type’ in ‘struct std::iterator_traits<char*>’
/usr/include/c++/4.1.3/bits/stl_iterator.h:707: error: no type named ‘difference_type’ in ‘struct std::iterator_traits<char*>’
/usr/include/c++/4.1.3/bits/stl_iterator.h:711: error: no type named ‘difference_type’ in ‘struct std::iterator_traits<char*>’
/usr/include/c++/4.1.3/bits/locale_facets.tcc: In member function ‘_OutIter std::money_put<_CharT, _OutIter>::_M_insert(_OutIter, std::ios_base&, _CharT, const std::basic_string<_CharT, std::char_traits<_CharT>, std::allocator<_CharT> >&) const’:
/usr/include/c++/4.1.3/bits/locale_facets.tcc:1668: error: ‘class std::ios_base’ has no member named ‘width’
/usr/include/c++/4.1.3/bits/locale_facets.tcc:1728: error: ‘class std::ios_base’ has no member named ‘width’
/usr/include/c++/4.1.3/bits/locale_facets.tcc: At global scope:
/usr/include/c++/4.1.3/bits/locale_facets.tcc:2473: error: expected ‘,’ or ‘...’ before ‘__newlen’
/usr/include/c++/4.1.3/bits/locale_facets.tcc: In static member function ‘static void std::__pad<_CharT, _Traits>::_S_pad(std::ios_base&, _CharT, _CharT*, const _CharT*, int)’:
/usr/include/c++/4.1.3/bits/locale_facets.tcc:2476: error: ‘__newlen’ was not declared in this scope
/usr/include/c++/4.1.3/bits/locale_facets.tcc:2476: error: ‘__oldlen’ was not declared in this scope
/usr/include/c++/4.1.3/bits/locale_facets.tcc:2488: error: ‘__num’ was not declared in this scope
/usr/include/c++/4.1.3/bits/ostream.tcc: At global scope:
/usr/include/c++/4.1.3/bits/ostream.tcc:483: error: ‘streamsize’ has not been declared
/usr/include/c++/4.1.3/bits/ostream.tcc: In function ‘std::basic_ostream<_CharT, _Traits>& std::operator<<(std::basic_ostream<_CharT, _Traits>&, _CharT)’:
/usr/include/c++/4.1.3/bits/ostream.tcc:605: error: ‘streamsize’ does not name a type
/usr/include/c++/4.1.3/bits/ostream.tcc:606: error: ‘streamsize’ was not declared in this scope
/usr/include/c++/4.1.3/bits/ostream.tcc:606: error: expected `;' before ‘__len’
/usr/include/c++/4.1.3/bits/ostream.tcc:608: error: ‘__w’ was not declared in this scope
/usr/include/c++/4.1.3/bits/ostream.tcc:608: error: ‘__len’ was not declared in this scope
/usr/include/c++/4.1.3/bits/ostream.tcc:616: error: ‘__len’ was not declared in this scope
/usr/include/c++/4.1.3/bits/ostream.tcc: In function ‘std::basic_ostream<char, _Traits>& std::operator<<(std::basic_ostream<char, _Traits>&, char)’:
/usr/include/c++/4.1.3/bits/ostream.tcc:636: error: ‘streamsize’ does not name a type
/usr/include/c++/4.1.3/bits/ostream.tcc:637: error: ‘streamsize’ was not declared in this scope
/usr/include/c++/4.1.3/bits/ostream.tcc:637: error: expected `;' before ‘__len’
/usr/include/c++/4.1.3/bits/ostream.tcc:639: error: ‘__w’ was not declared in this scope
/usr/include/c++/4.1.3/bits/ostream.tcc:639: error: ‘__len’ was not declared in this scope
/usr/include/c++/4.1.3/bits/ostream.tcc:646: error: ‘__len’ was not declared in this scope
/usr/include/c++/4.1.3/bits/ostream.tcc: In function ‘std::basic_ostream<_CharT, _Traits>& std::operator<<(std::basic_ostream<_CharT, _Traits>&, const _CharT*)’:
/usr/include/c++/4.1.3/bits/ostream.tcc:665: error: ‘streamsize’ does not name a type
/usr/include/c++/4.1.3/bits/ostream.tcc:666: error: ‘streamsize’ was not declared in this scope
/usr/include/c++/4.1.3/bits/ostream.tcc:666: error: expected `;' before ‘__len’
/usr/include/c++/4.1.3/bits/ostream.tcc:667: error: ‘__w’ was not declared in this scope
/usr/include/c++/4.1.3/bits/ostream.tcc:667: error: ‘__len’ was not declared in this scope
/usr/include/c++/4.1.3/bits/ostream.tcc:677: error: ‘__len’ was not declared in this scope
/usr/include/c++/4.1.3/bits/ostream.tcc: In function ‘std::basic_ostream<_CharT, _Traits>& std::operator<<(std::basic_ostream<_CharT, _Traits>&, const char*)’:
/usr/include/c++/4.1.3/bits/ostream.tcc:709: error: ‘streamsize’ does not name a type
/usr/include/c++/4.1.3/bits/ostream.tcc:710: error: ‘streamsize’ was not declared in this scope
/usr/include/c++/4.1.3/bits/ostream.tcc:710: error: expected `;' before ‘__len’
/usr/include/c++/4.1.3/bits/ostream.tcc:711: error: ‘__w’ was not declared in this scope
/usr/include/c++/4.1.3/bits/ostream.tcc:711: error: ‘__len’ was not declared in this scope
/usr/include/c++/4.1.3/bits/ostream.tcc:721: error: ‘__len’ was not declared in this scope
/usr/include/c++/4.1.3/bits/ostream.tcc: In function ‘std::basic_ostream<char, _Traits>& std::operator<<(std::basic_ostream<char, _Traits>&, const char*)’:
/usr/include/c++/4.1.3/bits/ostream.tcc:743: error: ‘streamsize’ does not name a type
/usr/include/c++/4.1.3/bits/ostream.tcc:744: error: ‘streamsize’ was not declared in this scope
/usr/include/c++/4.1.3/bits/ostream.tcc:744: error: expected `;' before ‘__len’
/usr/include/c++/4.1.3/bits/ostream.tcc:745: error: ‘__w’ was not declared in this scope
/usr/include/c++/4.1.3/bits/ostream.tcc:745: error: ‘__len’ was not declared in this scope
/usr/include/c++/4.1.3/bits/ostream.tcc:753: error: ‘__len’ was not declared in this scope
/usr/include/c++/4.1.3/bits/ostream.tcc: In function ‘std::basic_ostream<_CharT, _Traits>& std::operator<<(std::basic_ostream<_CharT, _Traits>&, const std::basic_string<_CharT, _Traits, _Alloc>&)’:
/usr/include/c++/4.1.3/bits/ostream.tcc:774: error: ‘streamsize’ does not name a type
/usr/include/c++/4.1.3/bits/ostream.tcc:775: error: ‘streamsize’ was not declared in this scope
/usr/include/c++/4.1.3/bits/ostream.tcc:775: error: expected `;' before ‘__len’
/usr/include/c++/4.1.3/bits/ostream.tcc:780: error: ‘__w’ was not declared in this scope
/usr/include/c++/4.1.3/bits/ostream.tcc:780: error: ‘__len’ was not declared in this scope
/usr/include/c++/4.1.3/bits/ostream.tcc:789: error: ‘__len’ was not declared in this scope
/usr/include/c++/4.1.3/istream: At global scope:
/usr/include/c++/4.1.3/istream:92: error: ‘streamsize’ does not name a type
/usr/include/c++/4.1.3/istream:239: error: ‘streamsize’ does not name a type
/usr/include/c++/4.1.3/istream:313: error: ‘streamsize’ has not been declared
/usr/include/c++/4.1.3/istream:324: error: ‘streamsize’ has not been declared
/usr/include/c++/4.1.3/istream:386: error: ‘streamsize’ has not been declared
/usr/include/c++/4.1.3/istream:397: error: ‘streamsize’ has not been declared
/usr/include/c++/4.1.3/istream:424: error: expected ‘;’ before ‘(’ token
/usr/include/c++/4.1.3/istream:427: error: expected ‘;’ before ‘(’ token
/usr/include/c++/4.1.3/istream:456: error: ‘streamsize’ has not been declared
/usr/include/c++/4.1.3/istream:474: error: ‘streamsize’ does not name a type
/usr/include/c++/4.1.3/istream: In constructor ‘std::basic_istream<_CharT, _Traits>::basic_istream(std::basic_streambuf<_CharT, _Traits>*)’:
/usr/include/c++/4.1.3/istream:104: error: class ‘std::basic_istream<_CharT, _Traits>’ does not have any field named ‘_M_gcount’
/usr/include/c++/4.1.3/istream:104: error: there are no arguments to ‘streamsize’ that depend on a template parameter, so a declaration of ‘streamsize’ must be available
/usr/include/c++/4.1.3/istream:104: error: (if you use ‘-fpermissive’, G++ will accept your code, but allowing the use of an undeclared name is deprecated)
/usr/include/c++/4.1.3/istream: In destructor ‘virtual std::basic_istream<_CharT, _Traits>::~basic_istream()’:
/usr/include/c++/4.1.3/istream:114: error: ‘_M_gcount’ was not declared in this scope
/usr/include/c++/4.1.3/istream:114: error: there are no arguments to ‘streamsize’ that depend on a template parameter, so a declaration of ‘streamsize’ must be available
/usr/include/c++/4.1.3/istream: In constructor ‘std::basic_istream<_CharT, _Traits>::basic_istream()’:
/usr/include/c++/4.1.3/istream:574: error: class ‘std::basic_istream<_CharT, _Traits>’ does not have any field named ‘_M_gcount’
/usr/include/c++/4.1.3/istream:574: error: there are no arguments to ‘streamsize’ that depend on a template parameter, so a declaration of ‘streamsize’ must be available
/usr/include/c++/4.1.3/istream: At global scope:
/usr/include/c++/4.1.3/istream:581: error: ‘streamsize’ has not been declared
/usr/include/c++/4.1.3/istream:586: error: ‘std::basic_istream<char, std::char_traits<char> >& std::basic_istream<char, std::char_traits<char> >::ignore’ is not a static member of ‘struct std::basic_istream<char, std::char_traits<char> >’
/usr/include/c++/4.1.3/istream:586: error: ‘streamsize’ was not declared in this scope
/usr/include/c++/4.1.3/istream:591: error: ‘std::basic_istream<char, std::char_traits<char> >& std::basic_istream<char, std::char_traits<char> >::ignore’ is not a static member of ‘struct std::basic_istream<char, std::char_traits<char> >’
/usr/include/c++/4.1.3/istream:591: error: ‘streamsize’ was not declared in this scope
/usr/include/c++/4.1.3/istream:591: error: expected primary-expression before ‘__delim’
/usr/include/c++/4.1.3/istream:591: error: initializer expression list treated as compound expression
/usr/include/c++/4.1.3/istream:597: error: ‘streamsize’ has not been declared
/usr/include/c++/4.1.3/istream:602: error: ‘std::basic_istream<wchar_t, std::char_traits<wchar_t> >& std::basic_istream<wchar_t, std::char_traits<wchar_t> >::ignore’ is not a static member of ‘struct std::basic_istream<wchar_t, std::char_traits<wchar_t> >’
/usr/include/c++/4.1.3/istream:602: error: ‘streamsize’ was not declared in this scope
/usr/include/c++/4.1.3/istream:607: error: ‘std::basic_istream<wchar_t, std::char_traits<wchar_t> >& std::basic_istream<wchar_t, std::char_traits<wchar_t> >::ignore’ is not a static member of ‘struct std::basic_istream<wchar_t, std::char_traits<wchar_t> >’
/usr/include/c++/4.1.3/istream:607: error: ‘streamsize’ was not declared in this scope
/usr/include/c++/4.1.3/istream:607: error: expected primary-expression before ‘__delim’
/usr/include/c++/4.1.3/istream:607: error: initializer expression list treated as compound expression
/usr/include/c++/4.1.3/bits/istream.tcc: In member function ‘typename std::basic_istream<_CharT, _Traits>::int_type std::basic_istream<_CharT, _Traits>::get()’:
/usr/include/c++/4.1.3/bits/istream.tcc:449: error: ‘_M_gcount’ was not declared in this scope
/usr/include/c++/4.1.3/bits/istream.tcc: In member function ‘std::basic_istream<_CharT, _Traits>& std::basic_istream<_CharT, _Traits>::get(_CharT&)’:
/usr/include/c++/4.1.3/bits/istream.tcc:478: error: ‘_M_gcount’ was not declared in this scope
/usr/include/c++/4.1.3/bits/istream.tcc: At global scope:
/usr/include/c++/4.1.3/bits/istream.tcc:508: error: ‘streamsize’ has not been declared
/usr/include/c++/4.1.3/bits/istream.tcc: In member function ‘std::basic_istream<_CharT, _Traits>& std::basic_istream<_CharT, _Traits>::get(_CharT*, int, _CharT)’:
/usr/include/c++/4.1.3/bits/istream.tcc:510: error: ‘_M_gcount’ was not declared in this scope
/usr/include/c++/4.1.3/bits/istream.tcc: In member function ‘std::basic_istream<_CharT, _Traits>& std::basic_istream<_CharT, _Traits>::get(std::basic_streambuf<_CharT, _Traits>&, _CharT)’:
/usr/include/c++/4.1.3/bits/istream.tcc:552: error: ‘_M_gcount’ was not declared in this scope
/usr/include/c++/4.1.3/bits/istream.tcc: At global scope:
/usr/include/c++/4.1.3/bits/istream.tcc:589: error: ‘streamsize’ has not been declared
/usr/include/c++/4.1.3/bits/istream.tcc: In member function ‘std::basic_istream<_CharT, _Traits>& std::basic_istream<_CharT, _Traits>::getline(_CharT*, int, _CharT)’:
/usr/include/c++/4.1.3/bits/istream.tcc:591: error: ‘_M_gcount’ was not declared in this scope
/usr/include/c++/4.1.3/bits/istream.tcc: In member function ‘std::basic_istream<_CharT, _Traits>& std::basic_istream<_CharT, _Traits>::ignore()’:
/usr/include/c++/4.1.3/bits/istream.tcc:646: error: ‘_M_gcount’ was not declared in this scope
/usr/include/c++/4.1.3/bits/istream.tcc: At global scope:
/usr/include/c++/4.1.3/bits/istream.tcc:672: error: ‘std::basic_istream<_CharT, _Traits>& std::basic_istream<_CharT, _Traits>::ignore’ is not a static member of ‘class std::basic_istream<_CharT, _Traits>’
/usr/include/c++/4.1.3/bits/istream.tcc:672: error: template definition of non-template ‘std::basic_istream<_CharT, _Traits>& std::basic_istream<_CharT, _Traits>::ignore’
/usr/include/c++/4.1.3/bits/istream.tcc:672: error: ‘streamsize’ was not declared in this scope
/usr/include/c++/4.1.3/bits/istream.tcc:673: error: expected `;' before ‘{’ token
/usr/include/c++/4.1.3/bits/istream.tcc:728: error: ‘std::basic_istream<_CharT, _Traits>& std::basic_istream<_CharT, _Traits>::ignore’ is not a static member of ‘class std::basic_istream<_CharT, _Traits>’
/usr/include/c++/4.1.3/bits/istream.tcc:728: error: template definition of non-template ‘std::basic_istream<_CharT, _Traits>& std::basic_istream<_CharT, _Traits>::ignore’
/usr/include/c++/4.1.3/bits/istream.tcc:728: error: ‘streamsize’ was not declared in this scope
/usr/include/c++/4.1.3/bits/istream.tcc:728: error: expected primary-expression before ‘__delim’
/usr/include/c++/4.1.3/bits/istream.tcc:729: error: expected `;' before ‘{’ token
/usr/include/c++/4.1.3/bits/istream.tcc: In member function ‘typename std::basic_istream<_CharT, _Traits>::int_type std::basic_istream<_CharT, _Traits>::peek()’:
/usr/include/c++/4.1.3/bits/istream.tcc:789: error: ‘_M_gcount’ was not declared in this scope
/usr/include/c++/4.1.3/bits/istream.tcc: At global scope:
/usr/include/c++/4.1.3/bits/istream.tcc:811: error: ‘streamsize’ has not been declared
/usr/include/c++/4.1.3/bits/istream.tcc: In member function ‘std::basic_istream<_CharT, _Traits>& std::basic_istream<_CharT, _Traits>::read(_CharT*, int)’:
/usr/include/c++/4.1.3/bits/istream.tcc:813: error: ‘_M_gcount’ was not declared in this scope
/usr/include/c++/4.1.3/bits/istream.tcc: At global scope:
/usr/include/c++/4.1.3/bits/istream.tcc:834: error: expected constructor, destructor, or type conversion before ‘basic_istream’
/usr/include/c++/4.1.3/bits/istream.tcc: In member function ‘std::basic_istream<_CharT, _Traits>& std::basic_istream<_CharT, _Traits>::putback(_CharT)’:
/usr/include/c++/4.1.3/bits/istream.tcc:866: error: ‘_M_gcount’ was not declared in this scope
/usr/include/c++/4.1.3/bits/istream.tcc: In member function ‘std::basic_istream<_CharT, _Traits>& std::basic_istream<_CharT, _Traits>::unget()’:
/usr/include/c++/4.1.3/bits/istream.tcc:894: error: ‘_M_gcount’ was not declared in this scope
/usr/include/c++/4.1.3/bits/istream.tcc: In function ‘std::basic_istream<_CharT, _Traits>& std::operator>>(std::basic_istream<_CharT, _Traits>&, _CharT2*)’:
/usr/include/c++/4.1.3/bits/istream.tcc:1058: error: ‘streamsize’ was not declared in this scope
/usr/include/c++/4.1.3/bits/istream.tcc:1058: error: expected `;' before ‘__extracted’
/usr/include/c++/4.1.3/bits/istream.tcc:1066: error: expected `;' before ‘__num’
/usr/include/c++/4.1.3/bits/istream.tcc:1067: error: ‘__num’ was not declared in this scope
/usr/include/c++/4.1.3/bits/istream.tcc:1068: error: ‘streamsize’ cannot appear in a constant-expression
/usr/include/c++/4.1.3/bits/istream.tcc:1068: error: template argument 1 is invalid
/usr/include/c++/4.1.3/bits/istream.tcc:1076: error: ‘__extracted’ was not declared in this scope
/usr/include/c++/4.1.3/bits/istream.tcc:1076: error: ‘__num’ was not declared in this scope
/usr/include/c++/4.1.3/bits/istream.tcc:1096: error: ‘__extracted’ was not declared in this scope
/usr/include/c++/4.1.3/bits/istream.tcc: In function ‘std::basic_istream<_CharT, _Traits>& std::operator>>(std::basic_istream<_CharT, _Traits>&, std::basic_string<_CharT, _Traits, _Alloc>&)’:
/usr/include/c++/4.1.3/bits/istream.tcc:1151: error: ‘streamsize’ does not name a type
/usr/include/c++/4.1.3/bits/istream.tcc:1152: error: ‘__w’ was not declared in this scope
/usr/include/c++/4.1.3/bits/stream_iterator.h: At global scope:
/usr/include/c++/4.1.3/bits/stream_iterator.h:46: error: expected type-specifier before ‘ptrdiff_t’
/usr/include/c++/4.1.3/bits/stream_iterator.h:46: error: expected `>' before ‘ptrdiff_t’
/usr/include/c++/4.1.3/bits/stream_iterator.h:48: error: wrong number of template arguments (5, should be 3)
/usr/include/c++/4.1.3/bits/stl_iterator_base_types.h:106: error: provided for ‘template<class _Category, class _Tp, class _Distance> struct std::iterator’
/usr/include/c++/4.1.3/bits/stream_iterator.h:153: error: wrong number of template arguments (5, should be 3)
/usr/include/c++/4.1.3/bits/stl_iterator_base_types.h:106: error: provided for ‘template<class _Category, class _Tp, class _Distance> struct std::iterator’
/usr/include/c++/4.1.3/bits/stl_list.h:116: error: ‘ptrdiff_t’ does not name a type
/usr/include/c++/4.1.3/bits/stl_list.h:194: error: ‘ptrdiff_t’ does not name a type
/usr/include/c++/4.1.3/bits/stl_list.h:419: error: ‘ptrdiff_t’ does not name a type
../../../../include/QtCore/../../../../src/qt-copy/src/corelib/tools/qlist.h:156: error: ‘ptrdiff_t’ does not name a type
../../../../include/QtCore/../../../../src/qt-copy/src/corelib/tools/qlist.h:203: error: ‘ptrdiff_t’ does not name a type
../../../../include/QtCore/../../../../src/qt-copy/src/corelib/tools/qlist.h:279: error: ‘ptrdiff_t’ does not name a type
/usr/include/c++/4.1.3/bits/stl_tree.h:158: error: ‘ptrdiff_t’ does not name a type
/usr/include/c++/4.1.3/bits/stl_tree.h:230: error: ‘ptrdiff_t’ does not name a type
/usr/include/c++/4.1.3/bits/stl_tree.h:348: error: ‘ptrdiff_t’ does not name a type
../../../../include/QtCore/../../../../src/qt-copy/src/corelib/tools/qmap.h:202: error: ‘ptrdiff_t’ does not name a type
../../../../include/QtCore/../../../../src/qt-copy/src/corelib/tools/qmap.h:270: error: ‘ptrdiff_t’ does not name a type
../../../../include/QtCore/../../../../src/qt-copy/src/corelib/tools/qmap.h:373: error: ‘ptrdiff_t’ does not name a type
/usr/include/c++/4.1.3/bits/stl_vector.h:181: error: ‘ptrdiff_t’ does not name a type
/usr/include/c++/4.1.3/bits/stl_bvector.h:110: error: template argument 3 is invalid
/usr/include/c++/4.1.3/bits/stl_bvector.h:139: error: ‘ptrdiff_t’ has not been declared
/usr/include/c++/4.1.3/bits/stl_bvector.h: In member function ‘void std::_Bit_iterator_base::_M_incr(int)’:
/usr/include/c++/4.1.3/bits/stl_bvector.h:141: error: ‘difference_type’ was not declared in this scope
/usr/include/c++/4.1.3/bits/stl_bvector.h:141: error: expected `;' before ‘__n’
/usr/include/c++/4.1.3/bits/stl_bvector.h:142: error: ‘__n’ was not declared in this scope
/usr/include/c++/4.1.3/bits/stl_bvector.h: At global scope:
/usr/include/c++/4.1.3/bits/stl_bvector.h:182: error: expected initializer before ‘operator’
/usr/include/c++/4.1.3/bits/stl_bvector.h:234: error: declaration of ‘operator+=’ as non-function
/usr/include/c++/4.1.3/bits/stl_bvector.h:234: error: expected ‘;’ before ‘(’ token
/usr/include/c++/4.1.3/bits/stl_bvector.h:240: error: expected `;' before ‘iterator’
/usr/include/c++/4.1.3/bits/stl_bvector.h:241: error: declaration of ‘operator-=’ as non-function
/usr/include/c++/4.1.3/bits/stl_bvector.h:241: error: expected ‘;’ before ‘(’ token
/usr/include/c++/4.1.3/bits/stl_bvector.h:247: error: expected `;' before ‘iterator’
/usr/include/c++/4.1.3/bits/stl_bvector.h:248: error: ‘difference_type’ has not been declared
/usr/include/c++/4.1.3/bits/stl_bvector.h:255: error: ‘difference_type’ has not been declared
/usr/include/c++/4.1.3/bits/stl_bvector.h:262: error: ‘difference_type’ has not been declared
/usr/include/c++/4.1.3/bits/stl_bvector.h: In member function ‘std::_Bit_iterator std::_Bit_iterator::operator+(int) const’:
/usr/include/c++/4.1.3/bits/stl_bvector.h:251: error: no match for ‘operator+=’ in ‘__tmp += __i’
/usr/include/c++/4.1.3/bits/stl_bvector.h: In member function ‘std::_Bit_iterator std::_Bit_iterator::operator-(int) const’:
/usr/include/c++/4.1.3/bits/stl_bvector.h:258: error: no match for ‘operator-=’ in ‘__tmp -= __i’
/usr/include/c++/4.1.3/bits/stl_bvector.h: At global scope:
/usr/include/c++/4.1.3/bits/stl_bvector.h:267: error: declaration of ‘operator+’ as non-function
/usr/include/c++/4.1.3/bits/stl_bvector.h:267: error: ‘ptrdiff_t’ was not declared in this scope
/usr/include/c++/4.1.3/bits/stl_bvector.h:267: error: expected primary-expression before ‘const’
/usr/include/c++/4.1.3/bits/stl_bvector.h:320: error: declaration of ‘operator+=’ as non-function
/usr/include/c++/4.1.3/bits/stl_bvector.h:320: error: expected ‘;’ before ‘(’ token
/usr/include/c++/4.1.3/bits/stl_bvector.h:326: error: expected `;' before ‘const_iterator’
/usr/include/c++/4.1.3/bits/stl_bvector.h:327: error: declaration of ‘operator-=’ as non-function
/usr/include/c++/4.1.3/bits/stl_bvector.h:327: error: expected ‘;’ before ‘(’ token
/usr/include/c++/4.1.3/bits/stl_bvector.h:333: error: expected `;' before ‘const_iterator’
/usr/include/c++/4.1.3/bits/stl_bvector.h:334: error: ‘difference_type’ has not been declared
/usr/include/c++/4.1.3/bits/stl_bvector.h:341: error: ‘difference_type’ has not been declared
/usr/include/c++/4.1.3/bits/stl_bvector.h:348: error: ‘difference_type’ has not been declared
/usr/include/c++/4.1.3/bits/stl_bvector.h: In member function ‘std::_Bit_const_iterator std::_Bit_const_iterator::operator+(int) const’:
/usr/include/c++/4.1.3/bits/stl_bvector.h:337: error: no match for ‘operator+=’ in ‘__tmp += __i’
/usr/include/c++/4.1.3/bits/stl_bvector.h: In member function ‘std::_Bit_const_iterator std::_Bit_const_iterator::operator-(int) const’:
/usr/include/c++/4.1.3/bits/stl_bvector.h:344: error: no match for ‘operator-=’ in ‘__tmp -= __i’
/usr/include/c++/4.1.3/bits/stl_bvector.h: At global scope:
/usr/include/c++/4.1.3/bits/stl_bvector.h:353: error: declaration of ‘operator+’ as non-function
/usr/include/c++/4.1.3/bits/stl_bvector.h:353: error: ‘ptrdiff_t’ was not declared in this scope
/usr/include/c++/4.1.3/bits/stl_bvector.h:353: error: expected primary-expression before ‘const’
/usr/include/c++/4.1.3/bits/stl_bvector.h:431: error: ‘ptrdiff_t’ does not name a type
/usr/include/c++/4.1.3/bits/stl_bvector.h: In member function ‘void std::vector<bool, _Alloc>::_M_initialize(size_t)’:
/usr/include/c++/4.1.3/bits/stl_bvector.h:461: error: there are no arguments to ‘difference_type’ that depend on a template parameter, so a declaration of ‘difference_type’ must be available
/usr/include/c++/4.1.3/bits/stl_bvector.h: In member function ‘void std::vector<bool, _Alloc>::_M_insert_range(std::_Bit_iterator, _ForwardIterator, _ForwardIterator, std::forward_iterator_tag)’:
/usr/include/c++/4.1.3/bits/stl_bvector.h:536: error: there are no arguments to ‘difference_type’ that depend on a template parameter, so a declaration of ‘difference_type’ must be available
/usr/include/c++/4.1.3/bits/stl_bvector.h:538: error: there are no arguments to ‘difference_type’ that depend on a template parameter, so a declaration of ‘difference_type’ must be available
/usr/include/c++/4.1.3/bits/stl_iterator_base_types.h: At global scope:
/usr/include/c++/4.1.3/bits/stl_iterator_base_types.h: In instantiation of ‘std::iterator_traits<std::_Bit_iterator>’:
/usr/include/c++/4.1.3/bits/stl_iterator.h:105: instantiated from ‘std::reverse_iterator<std::_Bit_iterator>’
/usr/include/c++/4.1.3/bits/stl_bvector.h:577: instantiated from here
/usr/include/c++/4.1.3/bits/stl_iterator_base_types.h:129: error: no type named ‘iterator_category’ in ‘struct std::_Bit_iterator’
/usr/include/c++/4.1.3/bits/stl_iterator_base_types.h:130: error: no type named ‘value_type’ in ‘struct std::_Bit_iterator’
/usr/include/c++/4.1.3/bits/stl_iterator_base_types.h:131: error: no type named ‘difference_type’ in ‘struct std::_Bit_iterator’
/usr/include/c++/4.1.3/bits/stl_iterator_base_types.h: In instantiation of ‘std::iterator_traits<std::_Bit_const_iterator>’:
/usr/include/c++/4.1.3/bits/stl_iterator.h:105: instantiated from ‘std::reverse_iterator<std::_Bit_const_iterator>’
/usr/include/c++/4.1.3/bits/stl_bvector.h:581: instantiated from here
/usr/include/c++/4.1.3/bits/stl_iterator_base_types.h:129: error: no type named ‘iterator_category’ in ‘struct std::_Bit_const_iterator’
/usr/include/c++/4.1.3/bits/stl_iterator_base_types.h:130: error: no type named ‘value_type’ in ‘struct std::_Bit_const_iterator’
/usr/include/c++/4.1.3/bits/stl_iterator_base_types.h:131: error: no type named ‘difference_type’ in ‘struct std::_Bit_const_iterator’
/usr/include/c++/4.1.3/bits/stl_bvector.h: In member function ‘std::_Bit_reference std::vector<bool, _Alloc>::operator[](size_t)’:
/usr/include/c++/4.1.3/bits/stl_bvector.h:609: error: there are no arguments to ‘difference_type’ that depend on a template parameter, so a declaration of ‘difference_type’ must be available
/usr/include/c++/4.1.3/bits/stl_bvector.h: In member function ‘bool std::vector<bool, _Alloc>::operator[](size_t) const’:
/usr/include/c++/4.1.3/bits/stl_bvector.h:613: error: there are no arguments to ‘difference_type’ that depend on a template parameter, so a declaration of ‘difference_type’ must be available
/usr/include/c++/4.1.3/bits/stl_bvector.h: In member function ‘std::_Bit_iterator std::vector<bool, _Alloc>::insert(std::_Bit_iterator, bool)’:
/usr/include/c++/4.1.3/bits/stl_bvector.h:849: error: ‘difference_type’ does not name a type
/usr/include/c++/4.1.3/bits/stl_bvector.h:855: error: ‘__n’ was not declared in this scope
/usr/include/c++/4.1.3/bits/stl_bvector.h: In member function ‘void std::vector<bool, _Alloc>::_M_fill_insert(std::_Bit_iterator, size_t, bool)’:
/usr/include/c++/4.1.3/bits/stl_bvector.h:891: error: there are no arguments to ‘difference_type’ that depend on a template parameter, so a declaration of ‘difference_type’ must be available
/usr/include/c++/4.1.3/bits/stl_bvector.h:892: error: there are no arguments to ‘difference_type’ that depend on a template parameter, so a declaration of ‘difference_type’ must be available
/usr/include/c++/4.1.3/bits/stl_bvector.h:893: error: there are no arguments to ‘difference_type’ that depend on a template parameter, so a declaration of ‘difference_type’ must be available
/usr/include/c++/4.1.3/bits/stl_bvector.h:902: error: there are no arguments to ‘difference_type’ that depend on a template parameter, so a declaration of ‘difference_type’ must be available
/usr/include/c++/4.1.3/bits/stl_bvector.h: In member function ‘void std::vector<bool, _Alloc>::resize(size_t, bool)’:
/usr/include/c++/4.1.3/bits/stl_bvector.h:939: error: there are no arguments to ‘difference_type’ that depend on a template parameter, so a declaration of ‘difference_type’ must be available
../../../../include/QtCore/../../../../src/qt-copy/src/corelib/tools/qvector.h: At global scope:
../../../../include/QtCore/../../../../src/qt-copy/src/corelib/tools/qvector.h:255: error: ‘ptrdiff_t’ does not name a type
../../../../include/QtCore/../../../../src/qt-copy/src/corelib/concurrent/qfuture.h:116: error: ‘ptrdiff_t’ does not name a type
../../../../include/QtCore/../../../../src/qt-copy/src/corelib/tools/qhash.h:319: error: ‘ptrdiff_t’ does not name a type
../../../../include/QtCore/../../../../src/qt-copy/src/corelib/tools/qhash.h:384: error: ‘ptrdiff_t’ does not name a type
../../../../include/QtCore/../../../../src/qt-copy/src/corelib/tools/qhash.h:468: error: ‘ptrdiff_t’ does not name a type
../../../../include/QtCore/../../../../src/qt-copy/src/corelib/tools/qset.h:100: error: ‘ptrdiff_t’ does not name a type
../../../../include/QtCore/../../../../src/qt-copy/src/corelib/tools/qset.h:135: error: ‘ptrdiff_t’ does not name a type
../../../../include/QtCore/../../../../src/qt-copy/src/corelib/tools/qset.h:191: error: ‘ptrdiff_t’ does not name a type
make[3]: Leaving directory `/home/kde-devel/kde/build/qt-copy/src/plugins/accessible/compat'
make[3]: Entering directory `/home/kde-devel/kde/build/qt-copy/src/plugins/accessible/compat'
make[3]: Nothing to be done for `first'.
make[3]: Leaving directory `/home/kde-devel/kde/build/qt-copy/src/plugins/accessible/compat'
make[2]: Leaving directory `/home/kde-devel/kde/build/qt-copy/src/plugins/accessible'
cd codecs/ && /usr/bin/make -f Makefile
make[2]: Entering directory `/home/kde-devel/kde/build/qt-copy/src/plugins/codecs'
/home/kde-devel/kde/build/qt-copy/bin/qmake QMAKE_ABSOLUTE_SOURCE_PATH=/home/kde-devel/kde/src/qt-copy/src/plugins/codecs -spec /home/kde-devel/kde/src/qt-copy/mkspecs/linux-g++ -unix -o Makefile /home/kde-devel/kde/src/qt-copy/src/plugins/codecs/codecs.pro
../../../../include/QtCore/../../../../src/qt-copy/src/corelib/tools/qlinkedlist.h:118: error: ‘ptrdiff_t’ does not name a type
../../../../include/QtCore/../../../../src/qt-copy/src/corelib/tools/qlinkedlist.h:151: error: ‘ptrdiff_t’ does not name a type
../../../../include/QtCore/../../../../src/qt-copy/src/corelib/tools/qlinkedlist.h:215: error: ‘ptrdiff_t’ does not name a type
make[2]: Leaving directory `/home/kde-devel/kde/build/qt-copy/src/plugins/codecs'
make[2]: Entering directory `/home/kde-devel/kde/build/qt-copy/src/plugins/codecs'
cd cn/ && /usr/bin/make -f Makefile
make[3]: Entering directory `/home/kde-devel/kde/build/qt-copy/src/plugins/codecs/cn'
"/home/kde-devel/kde/build/qt-copy/bin/qmake" -spec /home/kde-devel/kde/src/qt-copy/mkspecs/linux-g++ -o "/home/kde-devel/kde/build/qt-copy/./src/plugins/codecs/cn" "/home/kde-devel/kde/src/qt-copy/src/plugins/codecs/cn/cn.pro"
make[3]: *** [.obj/debug-shared/main.o] Error 1
make[3]: Leaving directory `/home/kde-devel/kde/build/qt-copy/src/plugins/script/qtdbus'
make[2]: *** [sub-qtdbus-make_default] Error 2
make[2]: Leaving directory `/home/kde-devel/kde/build/qt-copy/src/plugins/script'
make[1]: *** [sub-script-make_default] Error 2
make[1]: *** Waiting for unfinished jobs....
cd jp/ && /usr/bin/make -f Makefile
make[3]: Entering directory `/home/kde-devel/kde/build/qt-copy/src/plugins/codecs/jp'
"/home/kde-devel/kde/build/qt-copy/bin/qmake" -spec /home/kde-devel/kde/src/qt-copy/mkspecs/linux-g++ -o "/home/kde-devel/kde/build/qt-copy/./src/plugins/codecs/jp" "/home/kde-devel/kde/src/qt-copy/src/plugins/codecs/jp/jp.pro"
cd "/home/kde-devel/kde/build/qt-copy/./src/plugins/codecs/cn"
/usr/bin/make Makefile
make[4]: Entering directory `/home/kde-devel/kde/build/qt-copy/src/plugins/codecs/cn'
make[4]: `Makefile' is up to date.
make[4]: Leaving directory `/home/kde-devel/kde/build/qt-copy/src/plugins/codecs/cn'
make[3]: Leaving directory `/home/kde-devel/kde/build/qt-copy/src/plugins/codecs/cn'
make[3]: Entering directory `/home/kde-devel/kde/build/qt-copy/src/plugins/codecs/cn'
g++ -c -pipe -g -g -Wall -W -fvisibility=hidden -fvisibility-inlines-hidden -D_REENTRANT -fPIC -DQT_PLUGIN -DQT_CORE_LIB -D_LARGEFILE64_SOURCE -D_LARGEFILE_SOURCE -DQT_SHARED -I/home/kde-devel/kde/src/qt-copy/mkspecs/linux-g++ -I/home/kde-devel/kde/src/qt-copy/src/plugins/codecs/cn -I../../../../include/QtCore -I../../../../include/QtCore -I../../../../include -I../../../../include -I.moc/debug-shared -I.uic/debug-shared -I. -o .obj/debug-shared/qgb18030codec.o /home/kde-devel/kde/src/qt-copy/src/plugins/codecs/cn/qgb18030codec.cpp
cd "/home/kde-devel/kde/build/qt-copy/./src/plugins/codecs/jp"
/usr/bin/make Makefile
make[4]: Entering directory `/home/kde-devel/kde/build/qt-copy/src/plugins/codecs/jp'
make[4]: `Makefile' is up to date.
make[4]: Leaving directory `/home/kde-devel/kde/build/qt-copy/src/plugins/codecs/jp'
make[3]: Leaving directory `/home/kde-devel/kde/build/qt-copy/src/plugins/codecs/jp'
make[3]: Entering directory `/home/kde-devel/kde/build/qt-copy/src/plugins/codecs/jp'
g++ -c -pipe -g -g -Wall -W -fvisibility=hidden -fvisibility-inlines-hidden -D_REENTRANT -fPIC -DQT_PLUGIN -DQT_CORE_LIB -D_LARGEFILE64_SOURCE -D_LARGEFILE_SOURCE -DQT_SHARED -I/home/kde-devel/kde/src/qt-copy/mkspecs/linux-g++ -I/home/kde-devel/kde/src/qt-copy/src/plugins/codecs/jp -I../../../../include/QtCore -I../../../../include/QtCore -I../../../../include -I../../../../include -I.moc/debug-shared -I.uic/debug-shared -I. -o .obj/debug-shared/qeucjpcodec.o /home/kde-devel/kde/src/qt-copy/src/plugins/codecs/jp/qeucjpcodec.cpp
g++ -c -pipe -g -g -Wall -W -fvisibility=hidden -fvisibility-inlines-hidden -D_REENTRANT -fPIC -DQT_PLUGIN -DQT_CORE_LIB -D_LARGEFILE64_SOURCE -D_LARGEFILE_SOURCE -DQT_SHARED -I/home/kde-devel/kde/src/qt-copy/mkspecs/linux-g++ -I/home/kde-devel/kde/src/qt-copy/src/plugins/codecs/jp -I../../../../include/QtCore -I../../../../include/QtCore -I../../../../include -I../../../../include -I.moc/debug-shared -I.uic/debug-shared -I. -o .obj/debug-shared/qjiscodec.o /home/kde-devel/kde/src/qt-copy/src/plugins/codecs/jp/qjiscodec.cpp
g++ -c -pipe -g -g -Wall -W -fvisibility=hidden -fvisibility-inlines-hidden -D_REENTRANT -fPIC -DQT_PLUGIN -DQT_CORE_LIB -D_LARGEFILE64_SOURCE -D_LARGEFILE_SOURCE -DQT_SHARED -I/home/kde-devel/kde/src/qt-copy/mkspecs/linux-g++ -I/home/kde-devel/kde/src/qt-copy/src/plugins/codecs/cn -I../../../../include/QtCore -I../../../../include/QtCore -I../../../../include -I../../../../include -I.moc/debug-shared -I.uic/debug-shared -I. -o .obj/debug-shared/main.o /home/kde-devel/kde/src/qt-copy/src/plugins/codecs/cn/main.cpp
g++ -c -pipe -g -g -Wall -W -fvisibility=hidden -fvisibility-inlines-hidden -D_REENTRANT -fPIC -DQT_PLUGIN -DQT_CORE_LIB -D_LARGEFILE64_SOURCE -D_LARGEFILE_SOURCE -DQT_SHARED -I/home/kde-devel/kde/src/qt-copy/mkspecs/linux-g++ -I/home/kde-devel/kde/src/qt-copy/src/plugins/codecs/jp -I../../../../include/QtCore -I../../../../include/QtCore -I../../../../include -I../../../../include -I.moc/debug-shared -I.uic/debug-shared -I. -o .obj/debug-shared/qsjiscodec.o /home/kde-devel/kde/src/qt-copy/src/plugins/codecs/jp/qsjiscodec.cpp
rm -f libqcncodecs.so
g++ -Wl,--no-undefined -Wl,-rpath,/home/kde-devel/qt-copy/lib -Wl,-rpath,/home/kde-devel/qt-copy/lib -shared -o libqcncodecs.so .obj/debug-shared/qgb18030codec.o .obj/debug-shared/main.o -L/home/kde-devel/kde/build/qt-copy/lib -lQtCore -L/home/kde-devel/kde/build/qt-copy/lib -lz -lm -pthread -lgthread-2.0 -lrt -lglib-2.0 -lpthread -ldl
mv -f libqcncodecs.so ../../../../plugins/codecs/
(test -z "../../../../plugins/codecs/" || cd "../../../../plugins/codecs/" ; targ=`basename libqcncodecs.so`; objcopy --only-keep-debug "$targ" "$targ.debug" && objcopy --strip-debug "$targ" && objcopy --add-gnu-debuglink="$targ.debug" "$targ" && chmod -x "$targ.debug" ) ;
make[3]: Leaving directory `/home/kde-devel/kde/build/qt-copy/src/plugins/codecs/cn'
cd tw/ && /usr/bin/make -f Makefile
make[3]: Entering directory `/home/kde-devel/kde/build/qt-copy/src/plugins/codecs/tw'
"/home/kde-devel/kde/build/qt-copy/bin/qmake" -spec /home/kde-devel/kde/src/qt-copy/mkspecs/linux-g++ -o "/home/kde-devel/kde/build/qt-copy/./src/plugins/codecs/tw" "/home/kde-devel/kde/src/qt-copy/src/plugins/codecs/tw/tw.pro"
g++ -c -pipe -g -g -Wall -W -fvisibility=hidden -fvisibility-inlines-hidden -D_REENTRANT -fPIC -DQT_PLUGIN -DQT_CORE_LIB -D_LARGEFILE64_SOURCE -D_LARGEFILE_SOURCE -DQT_SHARED -I/home/kde-devel/kde/src/qt-copy/mkspecs/linux-g++ -I/home/kde-devel/kde/src/qt-copy/src/plugins/codecs/jp -I../../../../include/QtCore -I../../../../include/QtCore -I../../../../include -I../../../../include -I.moc/debug-shared -I.uic/debug-shared -I. -o .obj/debug-shared/qjpunicode.o /home/kde-devel/kde/src/qt-copy/src/plugins/codecs/jp/qjpunicode.cpp
cd "/home/kde-devel/kde/build/qt-copy/./src/plugins/codecs/tw"
/usr/bin/make Makefile
make[4]: Entering directory `/home/kde-devel/kde/build/qt-copy/src/plugins/codecs/tw'
make[4]: `Makefile' is up to date.
make[4]: Leaving directory `/home/kde-devel/kde/build/qt-copy/src/plugins/codecs/tw'
make[3]: Leaving directory `/home/kde-devel/kde/build/qt-copy/src/plugins/codecs/tw'
make[3]: Entering directory `/home/kde-devel/kde/build/qt-copy/src/plugins/codecs/tw'
g++ -c -pipe -g -g -Wall -W -fvisibility=hidden -fvisibility-inlines-hidden -D_REENTRANT -fPIC -DQT_PLUGIN -DQT_CORE_LIB -D_LARGEFILE64_SOURCE -D_LARGEFILE_SOURCE -DQT_SHARED -I/home/kde-devel/kde/src/qt-copy/mkspecs/linux-g++ -I/home/kde-devel/kde/src/qt-copy/src/plugins/codecs/tw -I../../../../include/QtCore -I../../../../include/QtCore -I../../../../include -I../../../../include -I.moc/debug-shared -I.uic/debug-shared -I. -o .obj/debug-shared/qbig5codec.o /home/kde-devel/kde/src/qt-copy/src/plugins/codecs/tw/qbig5codec.cpp
g++ -c -pipe -g -g -Wall -W -fvisibility=hidden -fvisibility-inlines-hidden -D_REENTRANT -fPIC -DQT_PLUGIN -DQT_CORE_LIB -D_LARGEFILE64_SOURCE -D_LARGEFILE_SOURCE -DQT_SHARED -I/home/kde-devel/kde/src/qt-copy/mkspecs/linux-g++ -I/home/kde-devel/kde/src/qt-copy/src/plugins/codecs/jp -I../../../../include/QtCore -I../../../../include/QtCore -I../../../../include -I../../../../include -I.moc/debug-shared -I.uic/debug-shared -I. -o .obj/debug-shared/main.o /home/kde-devel/kde/src/qt-copy/src/plugins/codecs/jp/main.cpp
g++ -c -pipe -g -g -Wall -W -fvisibility=hidden -fvisibility-inlines-hidden -D_REENTRANT -fPIC -DQT_PLUGIN -DQT_CORE_LIB -D_LARGEFILE64_SOURCE -D_LARGEFILE_SOURCE -DQT_SHARED -I/home/kde-devel/kde/src/qt-copy/mkspecs/linux-g++ -I/home/kde-devel/kde/src/qt-copy/src/plugins/codecs/jp -I../../../../include/QtCore -I../../../../include/QtCore -I../../../../include -I../../../../include -I.moc/debug-shared -I.uic/debug-shared -I. -o .obj/debug-shared/qfontjpcodec.o /home/kde-devel/kde/src/qt-copy/src/plugins/codecs/jp/qfontjpcodec.cpp
g++ -c -pipe -g -g -Wall -W -fvisibility=hidden -fvisibility-inlines-hidden -D_REENTRANT -fPIC -DQT_PLUGIN -DQT_CORE_LIB -D_LARGEFILE64_SOURCE -D_LARGEFILE_SOURCE -DQT_SHARED -I/home/kde-devel/kde/src/qt-copy/mkspecs/linux-g++ -I/home/kde-devel/kde/src/qt-copy/src/plugins/codecs/tw -I../../../../include/QtCore -I../../../../include/QtCore -I../../../../include -I../../../../include -I.moc/debug-shared -I.uic/debug-shared -I. -o .obj/debug-shared/main.o /home/kde-devel/kde/src/qt-copy/src/plugins/codecs/tw/main.cpp
rm -f libqjpcodecs.so
g++ -Wl,--no-undefined -Wl,-rpath,/home/kde-devel/qt-copy/lib -Wl,-rpath,/home/kde-devel/qt-copy/lib -shared -o libqjpcodecs.so .obj/debug-shared/qeucjpcodec.o .obj/debug-shared/qjiscodec.o .obj/debug-shared/qsjiscodec.o .obj/debug-shared/qjpunicode.o .obj/debug-shared/main.o .obj/debug-shared/qfontjpcodec.o -L/home/kde-devel/kde/build/qt-copy/lib -lQtCore -L/home/kde-devel/kde/build/qt-copy/lib -lz -lm -pthread -lgthread-2.0 -lrt -lglib-2.0 -lpthread -ldl
mv -f libqjpcodecs.so ../../../../plugins/codecs/
(test -z "../../../../plugins/codecs/" || cd "../../../../plugins/codecs/" ; targ=`basename libqjpcodecs.so`; objcopy --only-keep-debug "$targ" "$targ.debug" && objcopy --strip-debug "$targ" && objcopy --add-gnu-debuglink="$targ.debug" "$targ" && chmod -x "$targ.debug" ) ;
make[3]: Leaving directory `/home/kde-devel/kde/build/qt-copy/src/plugins/codecs/jp'
cd kr/ && /usr/bin/make -f Makefile
make[3]: Entering directory `/home/kde-devel/kde/build/qt-copy/src/plugins/codecs/kr'
"/home/kde-devel/kde/build/qt-copy/bin/qmake" -spec /home/kde-devel/kde/src/qt-copy/mkspecs/linux-g++ -o "/home/kde-devel/kde/build/qt-copy/./src/plugins/codecs/kr" "/home/kde-devel/kde/src/qt-copy/src/plugins/codecs/kr/kr.pro"
rm -f libqtwcodecs.so
g++ -Wl,--no-undefined -Wl,-rpath,/home/kde-devel/qt-copy/lib -Wl,-rpath,/home/kde-devel/qt-copy/lib -shared -o libqtwcodecs.so .obj/debug-shared/qbig5codec.o .obj/debug-shared/main.o -L/home/kde-devel/kde/build/qt-copy/lib -lQtCore -L/home/kde-devel/kde/build/qt-copy/lib -lz -lm -pthread -lgthread-2.0 -lrt -lglib-2.0 -lpthread -ldl
cd "/home/kde-devel/kde/build/qt-copy/./src/plugins/codecs/kr"
/usr/bin/make Makefile
mv -f libqtwcodecs.so ../../../../plugins/codecs/
(test -z "../../../../plugins/codecs/" || cd "../../../../plugins/codecs/" ; targ=`basename libqtwcodecs.so`; objcopy --only-keep-debug "$targ" "$targ.debug" && objcopy --strip-debug "$targ" && objcopy --add-gnu-debuglink="$targ.debug" "$targ" && chmod -x "$targ.debug" ) ;
make[3]: Leaving directory `/home/kde-devel/kde/build/qt-copy/src/plugins/codecs/tw'
make[4]: Entering directory `/home/kde-devel/kde/build/qt-copy/src/plugins/codecs/kr'
make[4]: `Makefile' is up to date.
make[4]: Leaving directory `/home/kde-devel/kde/build/qt-copy/src/plugins/codecs/kr'
make[3]: Leaving directory `/home/kde-devel/kde/build/qt-copy/src/plugins/codecs/kr'
make[3]: Entering directory `/home/kde-devel/kde/build/qt-copy/src/plugins/codecs/kr'
g++ -c -pipe -g -g -Wall -W -fvisibility=hidden -fvisibility-inlines-hidden -D_REENTRANT -fPIC -DQT_PLUGIN -DQT_CORE_LIB -D_LARGEFILE64_SOURCE -D_LARGEFILE_SOURCE -DQT_SHARED -I/home/kde-devel/kde/src/qt-copy/mkspecs/linux-g++ -I/home/kde-devel/kde/src/qt-copy/src/plugins/codecs/kr -I../../../../include/QtCore -I../../../../include/QtCore -I../../../../include -I../../../../include -I.moc/debug-shared -I.uic/debug-shared -I. -o .obj/debug-shared/qeuckrcodec.o /home/kde-devel/kde/src/qt-copy/src/plugins/codecs/kr/qeuckrcodec.cpp
g++ -c -pipe -g -g -Wall -W -fvisibility=hidden -fvisibility-inlines-hidden -D_REENTRANT -fPIC -DQT_PLUGIN -DQT_CORE_LIB -D_LARGEFILE64_SOURCE -D_LARGEFILE_SOURCE -DQT_SHARED -I/home/kde-devel/kde/src/qt-copy/mkspecs/linux-g++ -I/home/kde-devel/kde/src/qt-copy/src/plugins/codecs/kr -I../../../../include/QtCore -I../../../../include/QtCore -I../../../../include -I../../../../include -I.moc/debug-shared -I.uic/debug-shared -I. -o .obj/debug-shared/main.o /home/kde-devel/kde/src/qt-copy/src/plugins/codecs/kr/main.cpp
rm -f libqkrcodecs.so
g++ -Wl,--no-undefined -Wl,-rpath,/home/kde-devel/qt-copy/lib -Wl,-rpath,/home/kde-devel/qt-copy/lib -shared -o libqkrcodecs.so .obj/debug-shared/qeuckrcodec.o .obj/debug-shared/main.o -L/home/kde-devel/kde/build/qt-copy/lib -lQtCore -L/home/kde-devel/kde/build/qt-copy/lib -lz -lm -pthread -lgthread-2.0 -lrt -lglib-2.0 -lpthread -ldl
mv -f libqkrcodecs.so ../../../../plugins/codecs/
(test -z "../../../../plugins/codecs/" || cd "../../../../plugins/codecs/" ; targ=`basename libqkrcodecs.so`; objcopy --only-keep-debug "$targ" "$targ.debug" && objcopy --strip-debug "$targ" && objcopy --add-gnu-debuglink="$targ.debug" "$targ" && chmod -x "$targ.debug" ) ;
make[3]: Leaving directory `/home/kde-devel/kde/build/qt-copy/src/plugins/codecs/kr'
make[2]: Leaving directory `/home/kde-devel/kde/build/qt-copy/src/plugins/codecs'
make[1]: Leaving directory `/home/kde-devel/kde/build/qt-copy/src/plugins'
make: *** [sub-plugins-make_default-ordered] Error 2
makeobj[0]: Leaving directory `/home/kde-devel/kde/build/qt-copy'
kde-devel@emil-laptop:~/kde/build/qt-copy$