rendered paste bodykde-devel@emil-laptop:~/kde/src/kdelibs$ make VERBOSE=1 -j1
makeobj[0]: Entering directory `/home/kde-devel/kde/build/kdelibs'
/usr/bin/cmake -H/home/kde-devel/kde/src/kdelibs -B/home/kde-devel/kde/build/kdelibs --check-build-system CMakeFiles/Makefile.cmake 0
/usr/bin/cmake -E cmake_progress_start /home/kde-devel/kde/build/kdelibs/CMakeFiles 68
/usr/bin/make -f CMakeFiles/Makefile2 all
make[1]: Entering directory `/home/kde-devel/kde/build/kdelibs'
/usr/bin/make -f cmake/automoc/CMakeFiles/kde4automoc.dir/build.make cmake/automoc/CMakeFiles/kde4automoc.dir/depend
make[2]: Entering directory `/home/kde-devel/kde/build/kdelibs'
make[2]: Nothing to be done for `cmake/automoc/CMakeFiles/kde4automoc.dir/depend'.
make[2]: Leaving directory `/home/kde-devel/kde/build/kdelibs'
/usr/bin/make -f cmake/automoc/CMakeFiles/kde4automoc.dir/build.make cmake/automoc/CMakeFiles/kde4automoc.dir/build
make[2]: Entering directory `/home/kde-devel/kde/build/kdelibs'
make[2]: Nothing to be done for `cmake/automoc/CMakeFiles/kde4automoc.dir/build'.
make[2]: Leaving directory `/home/kde-devel/kde/build/kdelibs'
/usr/bin/cmake -E cmake_progress_report /home/kde-devel/kde/build/kdelibs/CMakeFiles
[ 0%] Built target kde4automoc
/usr/bin/make -f kdecore/CMakeFiles/kdecore.dir/build.make kdecore/CMakeFiles/kdecore.dir/depend
make[2]: Entering directory `/home/kde-devel/kde/build/kdelibs'
make[2]: Nothing to be done for `kdecore/CMakeFiles/kdecore.dir/depend'.
make[2]: Leaving directory `/home/kde-devel/kde/build/kdelibs'
/usr/bin/make -f kdecore/CMakeFiles/kdecore.dir/build.make kdecore/CMakeFiles/kdecore.dir/build
make[2]: Entering directory `/home/kde-devel/kde/build/kdelibs'
make[2]: Nothing to be done for `kdecore/CMakeFiles/kdecore.dir/build'.
make[2]: Leaving directory `/home/kde-devel/kde/build/kdelibs'
/usr/bin/cmake -E cmake_progress_report /home/kde-devel/kde/build/kdelibs/CMakeFiles 1 2 3 4 5
[ 7%] Built target kdecore
/usr/bin/make -f kdecore/CMakeFiles/kde4-config.dir/build.make kdecore/CMakeFiles/kde4-config.dir/depend
make[2]: Entering directory `/home/kde-devel/kde/build/kdelibs'
make[2]: Nothing to be done for `kdecore/CMakeFiles/kde4-config.dir/depend'.
make[2]: Leaving directory `/home/kde-devel/kde/build/kdelibs'
/usr/bin/make -f kdecore/CMakeFiles/kde4-config.dir/build.make kdecore/CMakeFiles/kde4-config.dir/build
make[2]: Entering directory `/home/kde-devel/kde/build/kdelibs'
make[2]: Nothing to be done for `kdecore/CMakeFiles/kde4-config.dir/build'.
make[2]: Leaving directory `/home/kde-devel/kde/build/kdelibs'
/usr/bin/cmake -E cmake_progress_report /home/kde-devel/kde/build/kdelibs/CMakeFiles
[ 7%] Built target kde4-config
/usr/bin/make -f kdecore/CMakeFiles/kdefakes.dir/build.make kdecore/CMakeFiles/kdefakes.dir/depend
make[2]: Entering directory `/home/kde-devel/kde/build/kdelibs'
make[2]: Nothing to be done for `kdecore/CMakeFiles/kdefakes.dir/depend'.
make[2]: Leaving directory `/home/kde-devel/kde/build/kdelibs'
/usr/bin/make -f kdecore/CMakeFiles/kdefakes.dir/build.make kdecore/CMakeFiles/kdefakes.dir/build
make[2]: Entering directory `/home/kde-devel/kde/build/kdelibs'
make[2]: Nothing to be done for `kdecore/CMakeFiles/kdefakes.dir/build'.
make[2]: Leaving directory `/home/kde-devel/kde/build/kdelibs'
/usr/bin/cmake -E cmake_progress_report /home/kde-devel/kde/build/kdelibs/CMakeFiles
[ 7%] Built target kdefakes
/usr/bin/make -f kjs/CMakeFiles/kjs.dir/build.make kjs/CMakeFiles/kjs.dir/depend
make[2]: Entering directory `/home/kde-devel/kde/build/kdelibs'
make[2]: Nothing to be done for `kjs/CMakeFiles/kjs.dir/depend'.
make[2]: Leaving directory `/home/kde-devel/kde/build/kdelibs'
/usr/bin/make -f kjs/CMakeFiles/kjs.dir/build.make kjs/CMakeFiles/kjs.dir/build
make[2]: Entering directory `/home/kde-devel/kde/build/kdelibs'
make[2]: Nothing to be done for `kjs/CMakeFiles/kjs.dir/build'.
make[2]: Leaving directory `/home/kde-devel/kde/build/kdelibs'
/usr/bin/cmake -E cmake_progress_report /home/kde-devel/kde/build/kdelibs/CMakeFiles 33 34
[ 10%] Built target kjs
/usr/bin/make -f kdecore/CMakeFiles/ktranscript.dir/build.make kdecore/CMakeFiles/ktranscript.dir/depend
make[2]: Entering directory `/home/kde-devel/kde/build/kdelibs'
make[2]: Nothing to be done for `kdecore/CMakeFiles/ktranscript.dir/depend'.
make[2]: Leaving directory `/home/kde-devel/kde/build/kdelibs'
/usr/bin/make -f kdecore/CMakeFiles/ktranscript.dir/build.make kdecore/CMakeFiles/ktranscript.dir/build
make[2]: Entering directory `/home/kde-devel/kde/build/kdelibs'
make[2]: Nothing to be done for `kdecore/CMakeFiles/ktranscript.dir/build'.
make[2]: Leaving directory `/home/kde-devel/kde/build/kdelibs'
/usr/bin/cmake -E cmake_progress_report /home/kde-devel/kde/build/kdelibs/CMakeFiles
[ 10%] Built target ktranscript
/usr/bin/make -f kdecore/kconfig_compiler/CMakeFiles/kconfig_compiler.dir/build.make kdecore/kconfig_compiler/CMakeFiles/kconfig_compiler.dir/depend
make[2]: Entering directory `/home/kde-devel/kde/build/kdelibs'
make[2]: Nothing to be done for `kdecore/kconfig_compiler/CMakeFiles/kconfig_compiler.dir/depend'.
make[2]: Leaving directory `/home/kde-devel/kde/build/kdelibs'
/usr/bin/make -f kdecore/kconfig_compiler/CMakeFiles/kconfig_compiler.dir/build.make kdecore/kconfig_compiler/CMakeFiles/kconfig_compiler.dir/build
make[2]: Entering directory `/home/kde-devel/kde/build/kdelibs'
make[2]: Nothing to be done for `kdecore/kconfig_compiler/CMakeFiles/kconfig_compiler.dir/build'.
make[2]: Leaving directory `/home/kde-devel/kde/build/kdelibs'
/usr/bin/cmake -E cmake_progress_report /home/kde-devel/kde/build/kdelibs/CMakeFiles
[ 10%] Built target kconfig_compiler
/usr/bin/make -f kdecore/tests/CMakeFiles/klibloadertestmodule.dir/build.make kdecore/tests/CMakeFiles/klibloadertestmodule.dir/depend
make[2]: Entering directory `/home/kde-devel/kde/build/kdelibs'
make[2]: Nothing to be done for `kdecore/tests/CMakeFiles/klibloadertestmodule.dir/depend'.
make[2]: Leaving directory `/home/kde-devel/kde/build/kdelibs'
/usr/bin/make -f kdecore/tests/CMakeFiles/klibloadertestmodule.dir/build.make kdecore/tests/CMakeFiles/klibloadertestmodule.dir/build
make[2]: Entering directory `/home/kde-devel/kde/build/kdelibs'
make[2]: Nothing to be done for `kdecore/tests/CMakeFiles/klibloadertestmodule.dir/build'.
make[2]: Leaving directory `/home/kde-devel/kde/build/kdelibs'
/usr/bin/cmake -E cmake_progress_report /home/kde-devel/kde/build/kdelibs/CMakeFiles
[ 10%] Built target klibloadertestmodule
/usr/bin/make -f kdecore/tests/CMakeFiles/klibloadertestmodule4.dir/build.make kdecore/tests/CMakeFiles/klibloadertestmodule4.dir/depend
make[2]: Entering directory `/home/kde-devel/kde/build/kdelibs'
make[2]: Nothing to be done for `kdecore/tests/CMakeFiles/klibloadertestmodule4.dir/depend'.
make[2]: Leaving directory `/home/kde-devel/kde/build/kdelibs'
/usr/bin/make -f kdecore/tests/CMakeFiles/klibloadertestmodule4.dir/build.make kdecore/tests/CMakeFiles/klibloadertestmodule4.dir/build
make[2]: Entering directory `/home/kde-devel/kde/build/kdelibs'
make[2]: Nothing to be done for `kdecore/tests/CMakeFiles/klibloadertestmodule4.dir/build'.
make[2]: Leaving directory `/home/kde-devel/kde/build/kdelibs'
/usr/bin/cmake -E cmake_progress_report /home/kde-devel/kde/build/kdelibs/CMakeFiles 8
[ 11%] Built target klibloadertestmodule4
/usr/bin/make -f kdeui/CMakeFiles/kdeui.dir/build.make kdeui/CMakeFiles/kdeui.dir/depend
make[2]: Entering directory `/home/kde-devel/kde/build/kdelibs'
/usr/bin/cmake -E cmake_progress_report /home/kde-devel/kde/build/kdelibs/CMakeFiles
[ 11%] Generating kwallet_interface.cpp, kwallet_interface.h
cd /home/kde-devel/kde/build/kdelibs/kdeui && /usr/bin/qdbusxml2cpp -m -p kwallet_interface /home/kde-devel/kde/build/kdelibs/kdeui/org.kde.KWallet.xml
Cannot process input: '/home/kde-devel/kde/build/kdelibs/kdeui/org.kde.KWallet.xml'. Stop.
make[2]: *** [kdeui/kwallet_interface.cpp] Error 1
make[2]: Leaving directory `/home/kde-devel/kde/build/kdelibs'
make[1]: *** [kdeui/CMakeFiles/kdeui.dir/all] Error 2
make[1]: Leaving directory `/home/kde-devel/kde/build/kdelibs'
make: *** [all] Error 2
makeobj[0]: Leaving directory `/home/kde-devel/kde/build/kdelibs'
kde-devel@emil-laptop:~/kde/src/kdelibs$ strace -f -o /tmp/trace cd /home/kde-devel/kde/build/kdelibs/kdeui && /usr/bin/qdbusxml2cpp -m -p kwallet_interface /home/kde-devel/kde/build/kdelibs/kdeui/org.kde.KWallet.xml
strace: cd: command not found
kde-devel@emil-laptop:~/kde/src/kdelibs$