playdv.c:408: error: 'dv_player_t' has no member named 'no_mmap'
playdv.c:409: error: 'dv_player_t' has no member named 'no_mmap'
playdv.c:418: error: 'dv_mmap_region_t' has no member named 'data_start'
playdv.c:427: error: 'dv_player_t' has no member named 'arg_disable_audio'
playdv.c:428: error: 'dv_mmap_region_t' has no member named 'data_start'
playdv.c:433: error: 'dv_player_t' has no member named 'arg_disable_video'
playdv.c:445: error: 'dv_mmap_region_t' has no member named 'data_start'
playdv.c:448: error: 'dv_mmap_region_t' has no member named 'data_start'
playdv.c:450: error: 'dv_display_t' has no member named 'pixels'
playdv.c:451: error: 'dv_display_t' has no member named 'pitches'
playdv.c:460: error: 'dv_player_t' has no member named 'arg_dump_frames'
playdv.c:464: error: 'dv_player_t' has no member named 'arg_dump_frames'
playdv.c:464: error: 'dv_player_t' has no member named 'arg_dump_frames'
playdv.c:464: error: 'dv_player_t' has no member named 'arg_dump_frames'
playdv.c:464: error: 'dv_player_t' has no member named 'arg_dump_frames'
playdv.c:464: error: 'dv_player_t' has no member named 'arg_dump_frames'
playdv.c:464: error: 'dv_player_t' has no member named 'arg_dump_frames'
playdv.c:464: error: 'dv_player_t' has no member named 'arg_dump_frames'
playdv.c:464: error: 'dv_player_t' has no member named 'arg_dump_frames'
playdv.c:464: error: 'dv_player_t' has no member named 'arg_dump_frames'
playdv.c:464: error: 'dv_player_t' has no member named 'arg_dump_frames'
playdv.c:464: error: 'dv_player_t' has no member named 'arg_dump_frames'
playdv.c:464: error: 'dv_player_t' has no member named 'arg_dump_frames'
playdv.c:464: error: 'dv_player_t' has no member named 'arg_dump_frames'
playdv.c:464: error: 'dv_player_t' has no member named 'arg_dump_frames'
playdv.c:464: error: 'dv_player_t' has no member named 'arg_dump_frames'
playdv.c:464: error: 'dv_player_t' has no member named 'arg_dump_frames'
playdv.c:464: error: 'dv_player_t' has no member named 'arg_dump_frames'
playdv.c:464: error: 'dv_player_t' has no member named 'arg_dump_frames'
playdv.c:464: error: 'dv_player_t' has no member named 'arg_dump_frames'
playdv.c:464: error: 'dv_player_t' has no member named 'arg_dump_frames'
playdv.c:467: error: 'dv_player_t' has no member named 'arg_dump_frames'
playdv.c:468: error: 'frame_count' undeclared (first use in this function)
playdv.c:472: error: 'dv_display_t' has no member named 'width'
playdv.c:472: error: 'dv_display_t' has no member named 'height'
playdv.c:473: error: 'dv_display_t' has no member named 'pixels'
playdv.c:474: error: 'dv_display_t' has no member named 'width'
playdv.c:475: error: 'dv_display_t' has no member named 'height'
playdv.c:485: error: 'dv_player_t' has no member named 'arg_num_frames'
playdv.c:485: error: 'dv_player_t' has no member named 'arg_num_frames'
playdv.c:493: error: 'dv_player_t' has no member named 'no_mmap'
playdv.c:500: error: 'dv_player_t' has no member named 'arg_loop_count'
playdv.c:507: error: 'seconds' undeclared (first use in this function)
playdv.c:511: error: 'dv_player_t' has no member named 'arg_disable_video'
playdv.c:514: error: 'dv_player_t' has no member named 'arg_disable_audio'
make[2]: *** [playdv.o] Error 1
make[2]: Leaving directory `/var/tmp/portage/libdv-0.104-r1/work/libdv-0.104/playdv'
make[1]: *** [all-recursive] Error 1
make[1]: Leaving directory `/var/tmp/portage/libdv-0.104-r1/work/libdv-0.104'
make: *** [all] Error 2
!!! ERROR: media-libs/libdv-0.104-r1 failed.
Call stack:
ebuild.sh, line 1545: Called dyn_compile
ebuild.sh, line 940: Called src_compile
libdv-0.104-r1.ebuild, line 51: Called die
!!! compile problem
!!! If you need support, post the topmost build error, and the call stack if relevant