rendered paste body>>> Preparing to unpack ...
>>> Unpacking source...
>>> Unpacking linux-2.6.24.tar.bz2 to /var/tmp/portage/sys-kernel/linux-sabayon-2.6.24/work
* Applying fbcondecor-0.9.4-2.6.24-rc7.patch (-p0+) ... [ ok ]
* Applying linux-sabayon-2.6.24-squashfs-3.3.patch (-p0+) ... [ ok ]
* Applying tuxonice-3.0-rc5-for-2.6.24.patch.patch (-p0+) ... [ ok ]
* Applying linux-sabayon-2.6.24-ipw3945-1.2.0-2.6.22.patch (-p0+) ... [ ok ]
* Applying linux-sabayon-2.6.24-from-ext4dev-to-ext4.patch (-p0+) ... [ ok ]
* Applying unionfs-2.2.3_for_2.6.24.diff.patch (-p0+) ... [ ok ]
* Applying linux-sabayon-2.6.24-aufs-cvs-20080121.patch (-p0+) ... [ ok ]
>>> Source unpacked.
>>> Compiling source in /var/tmp/portage/sys-kernel/linux-sabayon-2.6.24/work/linux-2.6.24-sabayon ...
* Starting to compile kernel...
/usr/share/genkernel/gen_funcs.sh: line 96: [: : integer expression expected
/usr/share/genkernel/gen_funcs.sh: line 96: [: : integer expression expected
/usr/share/genkernel/gen_funcs.sh: line 96: [: : integer expression expected
/usr/share/genkernel/gen_funcs.sh: line 96: [: : integer expression expected
/usr/share/genkernel/gen_funcs.sh: line 96: [: : integer expression expected
/usr/share/genkernel/gen_funcs.sh: line 96: [: : integer expression expected
/usr/share/genkernel/gen_funcs.sh: line 96: [: : integer expression expected
/usr/share/genkernel/gen_funcs.sh: line 96: [: : integer expression expected
/usr/share/genkernel/gen_funcs.sh: line 96: [: : integer expression expected
/usr/share/genkernel/gen_funcs.sh: line 96: [: : integer expression expected
/usr/share/genkernel/gen_funcs.sh: line 96: [: : integer expression expected
/usr/share/genkernel/gen_funcs.sh: line 96: [: : integer expression expected
/usr/share/genkernel/gen_funcs.sh: line 96: [: : integer expression expected
/usr/share/genkernel/gen_funcs.sh: line 96: [: : integer expression expected
/usr/share/genkernel/gen_funcs.sh: line 96: [: : integer expression expected
/usr/share/genkernel/gen_funcs.sh: line 96: [: : integer expression expected
/usr/share/genkernel/gen_funcs.sh: line 96: [: : integer expression expected
/usr/share/genkernel/gen_funcs.sh: line 96: [: : integer expression expected
/usr/share/genkernel/gen_funcs.sh: line 96: [: : integer expression expected
/usr/share/genkernel/gen_funcs.sh: line 96: [: : integer expression expected
/usr/share/genkernel/gen_funcs.sh: line 96: [: : integer expression expected
/usr/share/genkernel/gen_funcs.sh: line 96: [: : integer expression expected
/usr/share/genkernel/gen_funcs.sh: line 96: [: : integer expression expected
/usr/share/genkernel/gen_funcs.sh: line 96: [: : integer expression expected
/usr/share/genkernel/gen_funcs.sh: line 96: [: : integer expression expected
/usr/share/genkernel/gen_funcs.sh: line 96: [: : integer expression expected
/usr/share/genkernel/gen_funcs.sh: line 96: [: : integer expression expected
/usr/share/genkernel/gen_funcs.sh: line 96: [: : integer expression expected
/usr/share/genkernel/gen_funcs.sh: line 96: [: : integer expression expected
/usr/share/genkernel/gen_funcs.sh: line 96: [: : integer expression expected
/usr/share/genkernel/gen_funcs.sh: line 96: [: : integer expression expected
/usr/share/genkernel/gen_funcs.sh: line 96: [: : integer expression expected
/usr/share/genkernel/gen_funcs.sh: line 96: [: : integer expression expected
/usr/share/genkernel/gen_funcs.sh: line 96: [: : integer expression expected
/usr/share/genkernel/gen_funcs.sh: line 96: [: : integer expression expected
/usr/share/genkernel/gen_funcs.sh: line 96: [: : integer expression expected
/usr/share/genkernel/gen_funcs.sh: line 96: [: : integer expression expected
/usr/share/genkernel/gen_funcs.sh: line 96: [: : integer expression expected
/usr/share/genkernel/gen_funcs.sh: line 96: [: : integer expression expected
/usr/share/genkernel/gen_funcs.sh: line 96: [: : integer expression expected
/usr/share/genkernel/gen_funcs.sh: line 96: [: : integer expression expected
/usr/share/genkernel/gen_funcs.sh: line 96: [: : integer expression expected
/usr/share/genkernel/gen_funcs.sh: line 96: [: : integer expression expected
/usr/share/genkernel/gen_funcs.sh: line 96: [: : integer expression expected
/usr/share/genkernel/gen_funcs.sh: line 96: [: : integer expression expected
/usr/share/genkernel/gen_funcs.sh: line 96: [: : integer expression expected
/usr/share/genkernel/gen_funcs.sh: line 96: [: : integer expression expected
/usr/share/genkernel/gen_funcs.sh: line 96: [: : integer expression expected
/usr/share/genkernel/gen_funcs.sh: line 96: [: : integer expression expected
/usr/share/genkernel/gen_funcs.sh: line 96: [: : integer expression expected
/usr/share/genkernel/gen_funcs.sh: line 96: [: : integer expression expected
/usr/share/genkernel/gen_funcs.sh: line 96: [: : integer expression expected
/usr/share/genkernel/gen_funcs.sh: line 96: [: : integer expression expected
/usr/share/genkernel/gen_funcs.sh: line 96: [: : integer expression expected
/usr/share/genkernel/gen_funcs.sh: line 96: [: : integer expression expected
/usr/share/genkernel/gen_funcs.sh: line 96: [: : integer expression expected
/usr/share/genkernel/gen_funcs.sh: line 96: [: : integer expression expected
/usr/share/genkernel/gen_funcs.sh: line 96: [: : integer expression expected
/usr/share/genkernel/gen_funcs.sh: line 96: [: : integer expression expected
/usr/share/genkernel/gen_funcs.sh: line 96: [: : integer expression expected
/usr/share/genkernel/gen_funcs.sh: line 96: [: : integer expression expected
/usr/share/genkernel/gen_funcs.sh: line 96: [: : integer expression expected
/usr/share/genkernel/gen_compile.sh: line 217: [: : integer expression expected
/usr/share/genkernel/gen_funcs.sh: line 96: [: : integer expression expected
/usr/share/genkernel/gen_funcs.sh: line 96: [: : integer expression expected
/usr/share/genkernel/gen_funcs.sh: line 96: [: : integer expression expected
/usr/share/genkernel/gen_funcs.sh: line 96: [: : integer expression expected
/usr/share/genkernel/gen_compile.sh: line 217: [: : integer expression expected
/usr/share/genkernel/gen_funcs.sh: line 96: [: : integer expression expected
/usr/share/genkernel/gen_funcs.sh: line 96: [: : integer expression expected
/usr/share/genkernel/gen_compile.sh: line 217: [: : integer expression expected
/usr/share/genkernel/gen_funcs.sh: line 96: [: : integer expression expected
/usr/share/genkernel/gen_compile.sh: line 217: [: : integer expression expected
/usr/share/genkernel/gen_funcs.sh: line 96: [: : integer expression expected
/usr/share/genkernel/gen_funcs.sh: line 96: [: : integer expression expected
/usr/share/genkernel/gen_compile.sh: line 217: [: : integer expression expected
/usr/share/genkernel/gen_funcs.sh: line 96: [: : integer expression expected
/usr/share/genkernel/gen_funcs.sh: line 96: [: : integer expression expected
/usr/share/genkernel/gen_funcs.sh: line 96: [: : integer expression expected
SHIPPED scripts/kconfig/lex.zconf.c
SHIPPED scripts/kconfig/zconf.hash.c
HOSTCC scripts/kconfig/zconf.tab.o
HOSTLD scripts/kconfig/conf
scripts/kconfig/conf -s arch/x86/Kconfig
*** Warning: make dep is unnecessary now.
--
LD kernel/irq/built-in.o
CC kernel/power/main.o
CC fs/stat.o
CC kernel/power/pm.o
CC mm/mempolicy.o
kernel/power/pm.c:203: warning: ‘pm_register’ is deprecated (declared at kernel/power/pm.c:62)
kernel/power/pm.c:203: warning: ‘pm_register’ is deprecated (declared at kernel/power/pm.c:62)
kernel/power/pm.c:204: warning: ‘pm_send_all’ is deprecated (declared at kernel/power/pm.c:178)
kernel/power/pm.c:204: warning: ‘pm_send_all’ is deprecated (declared at kernel/power/pm.c:178)
--
CC fs/cifs/dir.o
LD drivers/acpi/executer/built-in.o
CC drivers/acpi/hardware/hwacpi.o
CC drivers/acpi/hardware/hwgpe.o
fs/cifs/dir.c: In function ‘cifs_ci_compare’:
fs/cifs/dir.c:596: warning: passing argument 1 of ‘__memcpy’ discards qualifiers from pointer target type
fs/cifs/dir.c:596: warning: passing argument 1 of ‘__builtin_memcpy’ discards qualifiers from pointer target type
--
CC fs/cifs/cifsacl.o
CC arch/x86/pci/init.o
CC drivers/acpi/tables/tbutils.o
CC drivers/acpi/tables/tbfind.o
CC arch/x86/pci/acpi.o
fs/cifs/cifsacl.c:200: warning: ‘mode_to_access_flags’ defined but not used
--
LD fs/ocfs2/cluster/built-in.o
LD fs/ocfs2/dlm/built-in.o
CC fs/partitions/check.o
CC drivers/md/raid6tables.o
fs/partitions/check.c: In function ‘add_partition’:
fs/partitions/check.c:393: warning: ignoring return value of ‘kobject_add’, declared with attribute warn_unused_result
fs/partitions/check.c:396: warning: ignoring return value of ‘sysfs_create_link’, declared with attribute warn_unused_result
fs/partitions/check.c:403: warning: ignoring return value of ‘sysfs_create_file’, declared with attribute warn_unused_result
--
CC drivers/message/i2o/bus-osm.o
CC drivers/message/i2o/config-osm.o
CC fs/proc/inode.o
In file included from drivers/message/i2o/config-osm.c:39:
drivers/message/i2o/i2o_config.c: In function ‘i2o_cfg_passthru’:
drivers/message/i2o/i2o_config.c:889: warning: cast to pointer from integer of different size
drivers/message/i2o/i2o_config.c:945: warning: cast to pointer from integer of different size
--
CC drivers/message/fusion/mptfc.o
CC drivers/message/i2o/driver.o
CC drivers/message/fusion/mptsas.o
CC drivers/message/i2o/device.o
drivers/message/i2o/device.c: In function ‘i2o_device_add’:
drivers/message/i2o/device.c:247: warning: ignoring return value of ‘sysfs_create_link’, declared with attribute warn_unused_result
drivers/message/i2o/device.c:254: warning: ignoring return value of ‘sysfs_create_link’, declared with attribute warn_unused_result
drivers/message/i2o/device.c:260: warning: ignoring return value of ‘sysfs_create_link’, declared with attribute warn_unused_result
drivers/message/i2o/device.c:267: warning: ignoring return value of ‘sysfs_create_link’, declared with attribute warn_unused_result
--
CC lib/semaphore-sleepers.o
CC lib/sha1.o
CC drivers/pci/search.o
CC lib/string.o
drivers/pci/search.c: In function ‘pci_find_slot’:
drivers/pci/search.c:135: warning: ‘pci_find_device’ is deprecated (declared at include/linux/pci.h:492)
drivers/pci/search.c: At top level:
drivers/pci/search.c:478: warning: ‘pci_find_device’ is deprecated (declared at drivers/pci/search.c:283)
drivers/pci/search.c:478: warning: ‘pci_find_device’ is deprecated (declared at drivers/pci/search.c:283)
drivers/pci/search.c:479: warning: ‘pci_find_slot’ is deprecated (declared at drivers/pci/search.c:132)
drivers/pci/search.c:479: warning: ‘pci_find_slot’ is deprecated (declared at drivers/pci/search.c:132)
--
LD drivers/scsi/aacraid/aacraid.o
LD drivers/scsi/aacraid/built-in.o
CC drivers/usb/mon/mon_stat.o
make -C drivers/scsi/aic7xxx/aicasm
bison -d -b aicasm_gram aicasm_gram.y
aicasm_gram.y: warning: 1 useless nonterminal and 6 useless rules
aicasm_gram.y:217.46-54: warning: useless nonterminal: f4_opcode
aicasm_gram.y:1315.9-37: warning: useless rule: f4_opcode: T_OR16
aicasm_gram.y:1316.9-38: warning: useless rule: f4_opcode: T_AND16
aicasm_gram.y:1317.9-38: warning: useless rule: f4_opcode: T_XOR16
aicasm_gram.y:1318.9-38: warning: useless rule: f4_opcode: T_ADD16
aicasm_gram.y:1319.9-38: warning: useless rule: f4_opcode: T_ADC16
aicasm_gram.y:1320.9-38: warning: useless rule: f4_opcode: T_MVI16
--
CC fs/unionfs/subr.o
CC drivers/usb/mon/mon_bin.o
CC fs/unionfs/dentry.o
/usr/lib/gcc/x86_64-pc-linux-gnu/4.1.2/../../../../x86_64-pc-linux-gnu/bin/ld: cannot find -ldb
collect2: ld returned 1 exit status
make[4]: *** [aicasm] Error 1
make[3]: *** [drivers/scsi/aic7xxx/aicasm/aicasm] Error 2
make[2]: *** [drivers/scsi/aic7xxx] Error 2
make[1]: *** [drivers/scsi] Error 2
--
CC fs/xfs/xfs_alloc_btree.o
CC drivers/usb/storage/libusual.o
LD drivers/usb/storage/usb-storage.o
LD drivers/usb/storage/built-in.o
LD drivers/usb/built-in.o
make: *** [drivers] Error 2
/usr/share/genkernel/gen_funcs.sh: line 96: [: : integer expression expected
/usr/share/genkernel/gen_funcs.sh: line 96: [: : integer expression expected
/usr/share/genkernel/gen_funcs.sh: line 96: [: : integer expression expected
/usr/share/genkernel/gen_funcs.sh: line 96: [: : integer expression expected
/usr/share/genkernel/gen_funcs.sh: line 96: [: : integer expression expected
/usr/share/genkernel/gen_funcs.sh: line 96: [: : integer expression expected
/usr/share/genkernel/gen_funcs.sh: line 96: [: : integer expression expected
/usr/share/genkernel/gen_funcs.sh: line 96: [: : integer expression expected
/usr/share/genkernel/gen_funcs.sh: line 96: [: : integer expression expected
/usr/share/genkernel/gen_funcs.sh: line 96: [: : integer expression expected
*
* ERROR: sys-kernel/linux-sabayon-2.6.24 failed.
* Call stack:
* ebuild.sh, line 1648: Called dyn_compile
* ebuild.sh, line 988: Called qa_call 'src_compile'
* ebuild.sh, line 44: Called src_compile
* linux-sabayon-2.6.24.ebuild, line 112: Called die
*
* genkernel failed
* If you need support, post the topmost build error, and the call stack if relevant.
* A complete build log is located at '/var/tmp/portage/sys-kernel/linux-sabayon-2.6.24/temp/build.log'.
*
sakura@hinata-hyuga ~ $