i686-pc-linux-gnu-gcc -O2 -march=pentium-m -pipe -DNO_TFTP -DHAVE_DBUS -c dbus.c
dbus.c:22:23: error: dbus/dbus.h: No such file or directory
dbus.c:25: error: expected specifier-qualifier-list before 'DBusWatch'
dbus.c:30: error: expected '=', ',', ';', 'asm' or '__attribute__' before 'add_watch'
dbus.c:49: error: expected ')' before '*' token
dbus.c:65: error: expected ')' before '*' token
dbus.c:224: error: expected '=', ',', ';', 'asm' or '__attribute__' before 'message_handler'
dbus.c: In function 'dbus_init':
dbus.c:260: error: 'DBusConnection' undeclared (first use in this function)
dbus.c:260: error: (Each undeclared identifier is reported only once
dbus.c:260: error: for each function it appears in.)
dbus.c:260: error: 'connection' undeclared (first use in this function)
dbus.c:261: error: 'DBusObjectPathVTable' undeclared (first use in this function)
dbus.c:261: error: expected ';' before 'dnsmasq_vtable'
dbus.c:262: error: 'DBusError' undeclared (first use in this function)
dbus.c:262: error: expected ';' before 'dbus_error'
dbus.c:263: error: 'DBusMessage' undeclared (first use in this function)
dbus.c:263: error: 'message' undeclared (first use in this function)
dbus.c:265: error: 'dbus_error' undeclared (first use in this function)
dbus.c:266: error: 'DBUS_BUS_SYSTEM' undeclared (first use in this function)
dbus.c:269: error: 'FALSE' undeclared (first use in this function)
dbus.c:270: error: 'add_watch' undeclared (first use in this function)
dbus.c:270: error: 'remove_watch' undeclared (first use in this function)
dbus.c:278: error: 'dnsmasq_vtable' undeclared (first use in this function)
dbus.c: In function 'set_dbus_listeners':
dbus.c:295: error: 'struct watch' has no member named 'next'
dbus.c:296: error: 'struct watch' has no member named 'watch'
dbus.c:298: error: 'struct watch' has no member named 'watch'
dbus.c:302: error: 'struct watch' has no member named 'watch'
dbus.c:307: error: 'DBUS_WATCH_READABLE' undeclared (first use in this function)
dbus.c:310: error: 'DBUS_WATCH_WRITABLE' undeclared (first use in this function)
dbus.c: In function 'check_dbus_listeners':
dbus.c:319: error: 'DBusConnection' undeclared (first use in this function)
dbus.c:319: error: 'connection' undeclared (first use in this function)
dbus.c:319: error: expected expression before ')' token
dbus.c:322: error: 'struct watch' has no member named 'next'
dbus.c:323: error: 'struct watch' has no member named 'watch'
dbus.c:329: error: 'struct watch' has no member named 'watch'
dbus.c:333: error: 'DBUS_WATCH_READABLE' undeclared (first use in this function)
dbus.c:336: error: 'DBUS_WATCH_WRITABLE' undeclared (first use in this function)
dbus.c:339: error: 'DBUS_WATCH_ERROR' undeclared (first use in this function)
dbus.c:342: error: 'struct watch' has no member named 'watch'
dbus.c:348: error: 'DBUS_DISPATCH_DATA_REMAINS' undeclared (first use in this function)
make[1]: *** [dbus.o] Error 1
make[1]: Leaving directory `/var/tmp/portage/net-dns/dnsmasq-2.41/work/dnsmasq-2.41/src'
make: *** [dnsmasq] Error 2
*
* ERROR: net-dns/dnsmasq-2.41 failed.
* Call stack:
* ebuild.sh, line 49: Called src_compile
* environment, line 2299: Called die
* The specific snippet of code:
* emake CC="$(tc-getCC)" CFLAGS="${CFLAGS}" || die
* The die message:
* (no error message)
*
* If you need support, post the topmost build error, and the call stack if relevant.
* A complete build log is located at '/var/tmp/portage/net-dns/dnsmasq-2.41/temp/build.log'.
* The ebuild environment file is located at '/var/tmp/portage/net-dns/dnsmasq-2.41/temp/environment'.
*
* Messages for package net-dns/dnsmasq-2.41:
*
* ERROR: net-dns/dnsmasq-2.41 failed.
* Call stack:
* ebuild.sh, line 49: Called src_compile
* environment, line 2299: Called die
* The specific snippet of code:
* emake CC="$(tc-getCC)" CFLAGS="${CFLAGS}" || die
* The die message:
* (no error message)
*
* If you need support, post the topmost build error, and the call stack if relevant.
* A complete build log is located at '/var/tmp/portage/net-dns/dnsmasq-2.41/temp/build.log'.
* The ebuild environment file is located at '/var/tmp/portage/net-dns/dnsmasq-2.41/temp/environment'.
*