All pastes #904941 Raw Edit

Anonymous

public text v1 · immutable
·published 2008-02-15 12:21 UTC
rendered paste body

makeobj[0]: Entering directory `/home/kde-devel/kde/src/KDE/avogadro/build'
[  0%] Generating avogadro_en_GB.qm
[  0%] Generating tool.moc
[  1%] Generating toolgroup.moc
[  1%] Generating engine.moc
[  2%] Generating glwidget.moc
[  3%] Generating primitiveitemmodel.moc
[  3%] Generating primitive.moc
[  4%] Generating elementtranslate.moc
[  4%] Generating periodictableview.moc
[  5%] Generating colorbutton.moc
[  5%] Generating avogadro_de.qm
[  6%] Generating avogadro_fr.qm
Scanning dependencies of target avogadro-lib
[  6%] Building CXX object libavogadro/src/CMakeFiles/avogadro-lib.dir/global.o
[  7%] Building CXX object libavogadro/src/CMakeFiles/avogadro-lib.dir/primitivelist.o
In file included from /home/kde-devel/kde/src/KDE/avogadro/libavogadro/include/avogadro/primitive.h:1,
                 from /home/kde-devel/kde/src/KDE/avogadro/libavogadro/src/primitivelist.cpp:26:
/home/kde-devel/kde/src/KDE/avogadro/libavogadro/include/avogadro/../../src/primitive.h:30:27: error: openbabel/mol.h: No such file or directory
/home/kde-devel/kde/src/KDE/avogadro/libavogadro/include/avogadro/../../src/primitive.h:156: error: ‘OpenBabel’ has not been declared
/home/kde-devel/kde/src/KDE/avogadro/libavogadro/include/avogadro/../../src/primitive.h:156: error: expected `{' before ‘OBAtom’
/home/kde-devel/kde/src/KDE/avogadro/libavogadro/include/avogadro/../../src/primitive.h:156: error: invalid function declaration
/home/kde-devel/kde/src/KDE/avogadro/libavogadro/include/avogadro/../../src/primitive.h:207: error: ‘OpenBabel’ has not been declared
/home/kde-devel/kde/src/KDE/avogadro/libavogadro/include/avogadro/../../src/primitive.h:207: error: expected `{' before ‘OBBond’
/home/kde-devel/kde/src/KDE/avogadro/libavogadro/include/avogadro/../../src/primitive.h:207: error: invalid function declaration
/home/kde-devel/kde/src/KDE/avogadro/libavogadro/include/avogadro/../../src/primitive.h:230: error: ‘OpenBabel’ has not been declared
/home/kde-devel/kde/src/KDE/avogadro/libavogadro/include/avogadro/../../src/primitive.h:230: error: expected `{' before ‘OBResidue’
/home/kde-devel/kde/src/KDE/avogadro/libavogadro/include/avogadro/../../src/primitive.h:230: error: invalid function declaration
/home/kde-devel/kde/src/KDE/avogadro/libavogadro/include/avogadro/../../src/primitive.h:255: error: ‘OpenBabel’ has not been declared
/home/kde-devel/kde/src/KDE/avogadro/libavogadro/include/avogadro/../../src/primitive.h:255: error: expected `{' before ‘OBMol’
/home/kde-devel/kde/src/KDE/avogadro/libavogadro/include/avogadro/../../src/primitive.h:255: error: invalid function declaration
make[2]: *** [libavogadro/src/CMakeFiles/avogadro-lib.dir/primitivelist.o] Error 1
make[1]: *** [libavogadro/src/CMakeFiles/avogadro-lib.dir/all] Error 2
make: *** [all] Error 2
makeobj[0]: Leaving directory `/home/kde-devel/kde/src/KDE/avogadro/build'