rendered paste body/bin/sh ../../../../libtool --silent --mode=compile --tag=CXX i686-pc-linux-gnu-g
++ -DHAVE_CONFIG_H -I. -I. -I../../../.. -I../../../../amarok/src -I../../../../a
marok/src -I../../../../amarok/src/amarokcore -I../../../../amarok/src/amarokcore
-I../../../../amarok/src/engine -I../../../../amarok/src/engine -I../../../../am
arok/src/mediadevice -I/usr/local/include/gpod-1.0 -I/usr/include/glib-2.0 -I/usr
/lib/glib-2.0/include -I/usr/include/taglib -I/usr/kde/3.5/include -I/usr/qt/3/
include -I. -I/usr/kde/3.5/include -DQT_THREAD_SUPPORT -D_REENTRANT -Wno-long
-long -Wundef -ansi -D_XOPEN_SOURCE=500 -D_BSD_SOURCE -Wcast-align -Wconversion -
Wchar-subscripts -Wall -W -Wpointer-arith -DNDEBUG -DNO_DEBUG -O2 -O2 -march=i686
-pipe -fno-inline -Wformat-security -Wmissing-format-attribute -Wno-non-virtual-
dtor -fno-exceptions -fno-check-new -fno-common -DQT_CLEAN_NAMESPACE -DQT_NO_ASCI
I_CAST -DQT_NO_STL -DQT_NO_COMPAT -DQT_NO_TRANSLATION -c -o ipodmediadevice.lo `
test -f 'ipodmediadevice.cpp' || echo './'`ipodmediadevice.cpp
ipodmediadevice.cpp: In member function `virtual MediaItem* IpodMediaDevice::upda
teTrackInDB(IpodMediaItem*, const QString&, const MetaBundle&, const PodcastInfo*
)':
ipodmediadevice.cpp:245: error: 'struct _Itdb_Track' has no member named 'flag3'
ipodmediadevice.cpp:255: error: 'struct _Itdb_Track' has no member named 'flag3'
ipodmediadevice.cpp:287: error: 'struct _Itdb_Track' has no member named 'flag2'
ipodmediadevice.cpp:288: error: 'struct _Itdb_Track' has no member named 'flag3'
make[5]: *** [ipodmediadevice.lo] Error 1
make[5]: Leaving directory `/var/tmp/portage/amarok-1.4.1-r2/work/amarok-1.4.1/am
arok/src/mediadevice/ipod'
make[4]: *** [all-recursive] Error 1
make[4]: Leaving directory `/var/tmp/portage/amarok-1.4.1-r2/work/amarok-1.4.1/am
arok/src/mediadevice'
make[3]: *** [all-recursive] Error 1
make[3]: Leaving directory `/var/tmp/portage/amarok-1.4.1-r2/work/amarok-1.4.1/amarok/src'
make[2]: *** [all-recursive] Error 1
make[2]: Leaving directory `/var/tmp/portage/amarok-1.4.1-r2/work/amarok-1.4.1/amarok'
make[1]: *** [all-recursive] Error 1
make[1]: Leaving directory `/var/tmp/portage/amarok-1.4.1-r2/work/amarok-1.4.1'
make: *** [all] Error 2
!!! ERROR: media-sound/amarok-1.4.1-r2 failed.
Call stack:
ebuild.sh, line 1545: Called dyn_compile
ebuild.sh, line 940: Called src_compile
amarok-1.4.1-r2.ebuild, line 77: Called kde_src_compile
kde.eclass, line 164: Called kde_src_compile 'all'
kde.eclass, line 306: Called kde_src_compile 'myconf' 'configure' 'make'
kde.eclass, line 302: Called die
!!! died running emake, kde_src_compile:make
!!! If you need support, post the topmost build error, and the call stack if relevant.