All pastes #90444 Raw Edit

redondos

public text v1 · immutable
#90444 ·published 2006-07-17 17:55 UTC
rendered paste body
test -f 'ipodmediadevice.cpp' || echo './'`ipodmediadevice.cpp
/etc/distcc/distcc-ssh: line 2: unexpected EOF while looking for matching `"'
/etc/distcc/distcc-ssh: line 3: syntax error: unexpected end of file
distcc[5122] (dcc_writex) ERROR: failed to write: Broken pipe
distcc[5122] Warning: failed to distribute kiomediadevice.cpp to distcc@injector/
2, running locally instead                                                       ipodmediadevice.cpp: In member function `virtual MediaItem* IpodMediaDevice::upda
teTrackInDB(IpodMediaItem*, const QString&, const MetaBundle&, const PodcastInfo*)':                                                                              ipodmediadevice.cpp:245: error: 'struct _Itdb_Track' has no member named 'flag3'
ipodmediadevice.cpp:255: error: 'struct _Itdb_Track' has no member named 'flag3'
ipodmediadevice.cpp:287: error: 'struct _Itdb_Track' has no member named 'flag2'
ipodmediadevice.cpp:288: error: 'struct _Itdb_Track' has no member named 'flag3'
distcc[5087] ERROR: compile ipodmediadevice.cpp on localhost failed
make[5]: *** [ipodmediadevice.lo] Error 1
make[5]: *** Waiting for unfinished jobs....
make[5]: Leaving directory `/var/tmp/portage/amarok-1.4.1-r2/work/amarok-1.4.1/am
arok/src/mediadevice/ipod'                                                       make[4]: *** [all-recursive] Error 1
make[4]: Leaving directory `/var/tmp/portage/amarok-1.4.1-r2/work/amarok-1.4.1/am
arok/src/mediadevice'                                                            make[3]: *** [all-recursive] Error 1
make[3]: Leaving directory `/var/tmp/portage/amarok-1.4.1-r2/work/amarok-1.4.1/am
arok/src'                                                                        make[2]: *** [all-recursive] Error 1
make[2]: Leaving directory `/var/tmp/portage/amarok-1.4.1-r2/work/amarok-1.4.1/am
arok'                                                                            make[1]: *** [all-recursive] Error 1
make[1]: Leaving directory `/var/tmp/portage/amarok-1.4.1-r2/work/amarok-1.4.1'
make: *** [all] Error 2

!!! ERROR: media-sound/amarok-1.4.1-r2 failed.
Call stack:
  ebuild.sh, line 1545:   Called dyn_compile
  ebuild.sh, line 940:   Called src_compile
  amarok-1.4.1-r2.ebuild, line 77:   Called kde_src_compile
  kde.eclass, line 164:   Called kde_src_compile 'all'
  kde.eclass, line 306:   Called kde_src_compile 'myconf' 'configure' 'make'
  kde.eclass, line 302:   Called die

!!! died running emake, kde_src_compile:make
!!! If you need support, post the topmost build error, and the call stack if rele
vant.