All pastes #90328 Raw Edit

Miscellany

public text v1 · immutable
#90328 ·published 2006-07-17 16:00 UTC
rendered paste body
This file contains any messages produced by compilers while
running configure, to aid debugging if configure makes a mistake.

It was created by configure, which was
generated by GNU Autoconf 2.59.  Invocation command line was

  $ ./configure --prefix=/usr --host=i386-pc-linux-gnu --mandir=/usr/share/man --infodir=/usr/share/info --datadir=/usr/share --sysconfdir=/etc --localstatedir=/var/lib --with-sdl --with-xmms --with-berkeley-db --with-db-lib=db_cxx-4.2 --with-extra-includes=/usr/include/db4.2 --with-x --enable-mitshm --without-xinerama --with-qt-dir=/usr/qt/3 --enable-mt --with-qt-libraries=/usr/qt/3/lib --disable-dependency-tracking --disable-debug --without-debug --disable-final --with-arts --prefix=/usr/kde/3.5 --mandir=/usr/kde/3.5/share/man --infodir=/usr/kde/3.5/share/info --datadir=/usr/kde/3.5/share --sysconfdir=/usr/kde/3.5/etc --build=i386-pc-linux-gnu

## --------- ##
## Platform. ##
## --------- ##

hostname = trek
uname -m = i686
uname -r = 2.6.13-gentoo-r1
uname -s = Linux
uname -v = #1 SMP Thu Jun 1 17:20:27 EDT 2006

/usr/bin/uname -p = Pentium Pro
/bin/uname -X     = unknown

/bin/arch              = i686
/usr/bin/arch -k       = unknown
/usr/convex/getsysinfo = unknown
hostinfo               = unknown
/bin/machine           = unknown
/usr/bin/oslevel       = unknown
/bin/universe          = unknown

PATH: /usr/kde/3.5/bin
PATH: /usr/qt/3/bin
PATH: /usr/local/sbin
PATH: /sbin
PATH: /usr/sbin
PATH: /usr/lib/portage/bin
PATH: /usr/local/bin
PATH: /bin
PATH: /usr/bin
PATH: /opt/bin
PATH: /usr/i386-pc-linux-gnu/gcc-bin/3.3.6
PATH: /usr/kde/3.5/sbin
PATH: /usr/kde/3.5/bin
PATH: /usr/qt/3/bin
PATH: /usr/kde/3.4/sbin
PATH: /usr/kde/3.4/bin


## ----------- ##
## Core tests. ##
## ----------- ##

configure:1576: checking build system type
configure:1594: result: i386-pc-linux-gnu
configure:1602: checking host system type
configure:1616: result: i386-pc-linux-gnu
configure:1624: checking target system type
configure:1638: result: i386-pc-linux-gnu
configure:1685: checking for a BSD-compatible install
configure:1740: result: /bin/install -c
configure:1755: checking for -p flag to install
configure:1768: result: yes
configure:1779: checking whether build environment is sane
configure:1822: result: yes
configure:1874: checking for gawk
configure:1890: found /bin/gawk
configure:1900: result: gawk
configure:1910: checking whether make sets $(MAKE)
configure:1930: result: yes
configure:2188: checking for kde-config
configure:2250: result: /usr/kde/3.5/bin/kde-config
configure:2274: checking where to install
configure:2282: result: /usr/kde/3.5 (as requested)
configure:2333: checking for style of include used by make
configure:2361: result: GNU
configure:2471: checking for i386-pc-linux-gnu-gcc
configure:2487: found /usr/bin/i386-pc-linux-gnu-gcc
configure:2497: result: i386-pc-linux-gnu-gcc
configure:2779: checking for C compiler version
configure:2782: i386-pc-linux-gnu-gcc --version </dev/null >&5
i386-pc-linux-gnu-gcc (GCC) 3.3.6 (Gentoo 3.3.6, ssp-3.3.6-1.0, pie-8.7.8)
Copyright (C) 2003 Free Software Foundation, Inc.
This is free software; see the source for copying conditions.  There is NO
warranty; not even for MERCHANTABILITY or FITNESS FOR A PARTICULAR PURPOSE.

configure:2785: $? = 0
configure:2787: i386-pc-linux-gnu-gcc -v </dev/null >&5
Reading specs from /usr/lib/gcc-lib/i386-pc-linux-gnu/3.3.6/specs
Configured with: /var/tmp/portage/gcc-3.3.6/work/gcc-3.3.6/configure --prefix=/usr --bindir=/usr/i386-pc-linux-gnu/gcc-bin/3.3.6 --includedir=/usr/lib/gcc-lib/i386-pc-linux-gnu/3.3.6/include --datadir=/usr/share/gcc-data/i386-pc-linux-gnu/3.3.6 --mandir=/usr/share/gcc-data/i386-pc-linux-gnu/3.3.6/man --infodir=/usr/share/gcc-data/i386-pc-linux-gnu/3.3.6/info --with-gxx-include-dir=/usr/lib/gcc-lib/i386-pc-linux-gnu/3.3.6/include/g++-v3 --host=i386-pc-linux-gnu --build=i386-pc-linux-gnu --disable-altivec --enable-nls --without-included-gettext --with-system-zlib --disable-checking --disable-werror --disable-libunwind-exceptions --disable-multilib --disable-libgcj --enable-languages=c,c++,f77 --enable-shared --enable-threads=posix --enable-__cxa_atexit --enable-clocale=gnu
Thread model: posix
gcc version 3.3.6 (Gentoo 3.3.6, ssp-3.3.6-1.0, pie-8.7.8)
configure:2790: $? = 0
configure:2792: i386-pc-linux-gnu-gcc -V </dev/null >&5
i386-pc-linux-gnu-gcc: `-V' option must have argument
configure:2795: $? = 1
configure:2818: checking for C compiler default output file name
configure:2821: i386-pc-linux-gnu-gcc  -O2 -mcpu=i686   conftest.c  >&5
configure:2824: $? = 0
configure:2870: result: a.out
configure:2875: checking whether the C compiler works
configure:2881: ./a.out
configure:2884: $? = 0
configure:2901: result: yes
configure:2908: checking whether we are cross compiling
configure:2910: result: no
configure:2913: checking for suffix of executables
configure:2915: i386-pc-linux-gnu-gcc -o conftest  -O2 -mcpu=i686   conftest.c  >&5
configure:2918: $? = 0
configure:2943: result: 
configure:2949: checking for suffix of object files
configure:2970: i386-pc-linux-gnu-gcc -c  -O2 -mcpu=i686  conftest.c >&5
configure:2973: $? = 0
configure:2995: result: o
configure:2999: checking whether we are using the GNU C compiler
configure:3023: i386-pc-linux-gnu-gcc -c  -O2 -mcpu=i686  conftest.c >&5
configure:3029: $? = 0
configure:3033: test -z 
			 || test ! -s conftest.err
configure:3036: $? = 0
configure:3039: test -s conftest.o
configure:3042: $? = 0
configure:3055: result: yes
configure:3061: checking whether i386-pc-linux-gnu-gcc accepts -g
configure:3082: i386-pc-linux-gnu-gcc -c -g  conftest.c >&5
configure:3088: $? = 0
configure:3092: test -z 
			 || test ! -s conftest.err
configure:3095: $? = 0
configure:3098: test -s conftest.o
configure:3101: $? = 0
configure:3112: result: yes
configure:3129: checking for i386-pc-linux-gnu-gcc option to accept ANSI C
configure:3199: i386-pc-linux-gnu-gcc  -c  -O2 -mcpu=i686  conftest.c >&5
configure:3205: $? = 0
configure:3209: test -z 
			 || test ! -s conftest.err
configure:3212: $? = 0
configure:3215: test -s conftest.o
configure:3218: $? = 0
configure:3236: result: none needed
configure:3254: i386-pc-linux-gnu-gcc -c  -O2 -mcpu=i686  conftest.c >&5
conftest.c:2: error: syntax error before "me"
configure:3260: $? = 1
configure: failed program was:
| #ifndef __cplusplus
|   choke me
| #endif
configure:3395: checking dependency style of i386-pc-linux-gnu-gcc
configure:3485: result: none
configure:3508: checking how to run the C preprocessor
configure:3543: i386-pc-linux-gnu-gcc -E  conftest.c
configure:3549: $? = 0
configure:3581: i386-pc-linux-gnu-gcc -E  conftest.c
conftest.c:11:28: ac_nonexistent.h: No such file or directory
configure:3587: $? = 1
configure: failed program was:
| /* confdefs.h.  */
| 
| #define PACKAGE_NAME ""
| #define PACKAGE_TARNAME ""
| #define PACKAGE_VERSION ""
| #define PACKAGE_STRING ""
| #define PACKAGE_BUGREPORT ""
| #define PACKAGE "kdeaddons"
| #define VERSION "3.5.2"
| /* end confdefs.h.  */
| #include <ac_nonexistent.h>
configure:3626: result: i386-pc-linux-gnu-gcc -E
configure:3650: i386-pc-linux-gnu-gcc -E  conftest.c
configure:3656: $? = 0
configure:3688: i386-pc-linux-gnu-gcc -E  conftest.c
conftest.c:11:28: ac_nonexistent.h: No such file or directory
configure:3694: $? = 1
configure: failed program was:
| /* confdefs.h.  */
| 
| #define PACKAGE_NAME ""
| #define PACKAGE_TARNAME ""
| #define PACKAGE_VERSION ""
| #define PACKAGE_STRING ""
| #define PACKAGE_BUGREPORT ""
| #define PACKAGE "kdeaddons"
| #define VERSION "3.5.2"
| /* end confdefs.h.  */
| #include <ac_nonexistent.h>
configure:3776: checking for i386-pc-linux-gnu-g++
configure:3792: found /usr/bin/i386-pc-linux-gnu-g++
configure:3802: result: i386-pc-linux-gnu-g++
configure:3860: checking for C++ compiler version
configure:3863: i386-pc-linux-gnu-g++ --version </dev/null >&5
i386-pc-linux-gnu-g++ (GCC) 3.3.6 (Gentoo 3.3.6, ssp-3.3.6-1.0, pie-8.7.8)
Copyright (C) 2003 Free Software Foundation, Inc.
This is free software; see the source for copying conditions.  There is NO
warranty; not even for MERCHANTABILITY or FITNESS FOR A PARTICULAR PURPOSE.

configure:3866: $? = 0
configure:3868: i386-pc-linux-gnu-g++ -v </dev/null >&5
Reading specs from /usr/lib/gcc-lib/i386-pc-linux-gnu/3.3.6/specs
Configured with: /var/tmp/portage/gcc-3.3.6/work/gcc-3.3.6/configure --prefix=/usr --bindir=/usr/i386-pc-linux-gnu/gcc-bin/3.3.6 --includedir=/usr/lib/gcc-lib/i386-pc-linux-gnu/3.3.6/include --datadir=/usr/share/gcc-data/i386-pc-linux-gnu/3.3.6 --mandir=/usr/share/gcc-data/i386-pc-linux-gnu/3.3.6/man --infodir=/usr/share/gcc-data/i386-pc-linux-gnu/3.3.6/info --with-gxx-include-dir=/usr/lib/gcc-lib/i386-pc-linux-gnu/3.3.6/include/g++-v3 --host=i386-pc-linux-gnu --build=i386-pc-linux-gnu --disable-altivec --enable-nls --without-included-gettext --with-system-zlib --disable-checking --disable-werror --disable-libunwind-exceptions --disable-multilib --disable-libgcj --enable-languages=c,c++,f77 --enable-shared --enable-threads=posix --enable-__cxa_atexit --enable-clocale=gnu
Thread model: posix
gcc version 3.3.6 (Gentoo 3.3.6, ssp-3.3.6-1.0, pie-8.7.8)
configure:3871: $? = 0
configure:3873: i386-pc-linux-gnu-g++ -V </dev/null >&5
i386-pc-linux-gnu-g++: `-V' option must have argument
configure:3876: $? = 1
configure:3879: checking whether we are using the GNU C++ compiler
configure:3903: i386-pc-linux-gnu-g++ -c  -O2 -mcpu=i686  conftest.cc >&5
configure:3909: $? = 0
configure:3913: test -z 
			 || test ! -s conftest.err
configure:3916: $? = 0
configure:3919: test -s conftest.o
configure:3922: $? = 0
configure:3935: result: yes
configure:3941: checking whether i386-pc-linux-gnu-g++ accepts -g
configure:3962: i386-pc-linux-gnu-g++ -c -g  conftest.cc >&5
configure:3968: $? = 0
configure:3972: test -z 
			 || test ! -s conftest.err
configure:3975: $? = 0
configure:3978: test -s conftest.o
configure:3981: $? = 0
configure:3992: result: yes
configure:4034: i386-pc-linux-gnu-g++ -c  -O2 -mcpu=i686  conftest.cc >&5
configure:4040: $? = 0
configure:4044: test -z 
			 || test ! -s conftest.err
configure:4047: $? = 0
configure:4050: test -s conftest.o
configure:4053: $? = 0
configure:4079: i386-pc-linux-gnu-g++ -c  -O2 -mcpu=i686  conftest.cc >&5
conftest.cc: In function `int main()':
conftest.cc:15: error: `exit' undeclared (first use this function)
conftest.cc:15: error: (Each undeclared identifier is reported only once for 
   each function it appears in.)
configure:4085: $? = 1
configure: failed program was:
| /* confdefs.h.  */
| 
| #define PACKAGE_NAME ""
| #define PACKAGE_TARNAME ""
| #define PACKAGE_VERSION ""
| #define PACKAGE_STRING ""
| #define PACKAGE_BUGREPORT ""
| #define PACKAGE "kdeaddons"
| #define VERSION "3.5.2"
| /* end confdefs.h.  */
| 
| int
| main ()
| {
| exit (42);
|   ;
|   return 0;
| }
configure:4034: i386-pc-linux-gnu-g++ -c  -O2 -mcpu=i686  conftest.cc >&5
configure:4040: $? = 0
configure:4044: test -z 
			 || test ! -s conftest.err
configure:4047: $? = 0
configure:4050: test -s conftest.o
configure:4053: $? = 0
configure:4079: i386-pc-linux-gnu-g++ -c  -O2 -mcpu=i686  conftest.cc >&5
configure:4085: $? = 0
configure:4089: test -z 
			 || test ! -s conftest.err
configure:4092: $? = 0
configure:4095: test -s conftest.o
configure:4098: $? = 0
configure:4123: checking dependency style of i386-pc-linux-gnu-g++
configure:4213: result: none
configure:4232: checking whether i386-pc-linux-gnu-gcc is blacklisted
configure:4258: i386-pc-linux-gnu-gcc -c -DNDEBUG -O2  -O2 -mcpu=i686  conftest.c >&5
configure:4264: $? = 0
configure:4268: test -z 
			 || test ! -s conftest.err
configure:4271: $? = 0
configure:4274: test -s conftest.o
configure:4277: $? = 0
configure:4289: result: no
configure:4626: checking whether i386-pc-linux-gnu-g++ supports -Wmissing-format-attribute
configure:4662: rm -rf SunWS_cache; i386-pc-linux-gnu-g++ -o conftest -ansi -D_XOPEN_SOURCE=500 -D_BSD_SOURCE -Wcast-align -Wconversion -Wchar-subscripts -Wall -W -Wpointer-arith -DNDEBUG -DNO_DEBUG -O2  -O2 -mcpu=i686 -Wmissing-format-attribute   conftest.cc  1>&5
configure:4668: $? = 0
configure:4672: test -z 
			 || test ! -s conftest.err
configure:4675: $? = 0
configure:4678: test -s conftest
configure:4681: $? = 0
configure:4702: result: yes
configure:4714: checking whether i386-pc-linux-gnu-gcc supports -Wmissing-format-attribute
configure:4747: i386-pc-linux-gnu-gcc -o conftest -std=iso9899:1990 -W -Wall -Wchar-subscripts -Wshadow -Wpointer-arith -Wmissing-prototypes -Wwrite-strings -D_XOPEN_SOURCE=500 -D_BSD_SOURCE -DNDEBUG -O2  -O2 -mcpu=i686 -Wmissing-format-attribute   conftest.c  >&5
configure:4753: $? = 0
configure:4757: test -z 
			 || test ! -s conftest.err
configure:4760: $? = 0
configure:4763: test -s conftest
configure:4766: $? = 0
configure:4787: result: yes
configure:4801: checking whether i386-pc-linux-gnu-g++ supports -Wundef
configure:4837: rm -rf SunWS_cache; i386-pc-linux-gnu-g++ -o conftest -ansi -D_XOPEN_SOURCE=500 -D_BSD_SOURCE -Wcast-align -Wconversion -Wchar-subscripts -Wall -W -Wpointer-arith -DNDEBUG -DNO_DEBUG -O2  -O2 -mcpu=i686 -Wformat-security -Wmissing-format-attribute -Wundef   conftest.cc  1>&5
configure:4843: $? = 0
configure:4847: test -z 
			 || test ! -s conftest.err
configure:4850: $? = 0
configure:4853: test -s conftest
configure:4856: $? = 0
configure:4877: result: yes
configure:4889: checking whether i386-pc-linux-gnu-g++ supports -Wno-long-long
configure:4925: rm -rf SunWS_cache; i386-pc-linux-gnu-g++ -o conftest -Wundef -ansi -D_XOPEN_SOURCE=500 -D_BSD_SOURCE -Wcast-align -Wconversion -Wchar-subscripts -Wall -W -Wpointer-arith -DNDEBUG -DNO_DEBUG -O2  -O2 -mcpu=i686 -Wformat-security -Wmissing-format-attribute -Wno-long-long   conftest.cc  1>&5
configure:4931: $? = 0
configure:4935: test -z 
			 || test ! -s conftest.err
configure:4938: $? = 0
configure:4941: test -s conftest
configure:4944: $? = 0
configure:4965: result: yes
configure:4977: checking whether i386-pc-linux-gnu-g++ supports -Wno-non-virtual-dtor
configure:5013: rm -rf SunWS_cache; i386-pc-linux-gnu-g++ -o conftest -Wno-long-long -Wundef -ansi -D_XOPEN_SOURCE=500 -D_BSD_SOURCE -Wcast-align -Wconversion -Wchar-subscripts -Wall -W -Wpointer-arith -DNDEBUG -DNO_DEBUG -O2  -O2 -mcpu=i686 -Wformat-security -Wmissing-format-attribute -Wno-non-virtual-dtor   conftest.cc  1>&5
configure:5019: $? = 0
configure:5023: test -z 
			 || test ! -s conftest.err
configure:5026: $? = 0
configure:5029: test -s conftest
configure:5032: $? = 0
configure:5053: result: yes
configure:5085: checking whether i386-pc-linux-gnu-g++ supports -fno-reorder-blocks
configure:5121: rm -rf SunWS_cache; i386-pc-linux-gnu-g++ -o conftest -Wno-long-long -Wundef -ansi -D_XOPEN_SOURCE=500 -D_BSD_SOURCE -Wcast-align -Wconversion -Wchar-subscripts -Wall -W -Wpointer-arith -DNDEBUG -DNO_DEBUG -O2  -O2 -mcpu=i686 -Wformat-security -Wmissing-format-attribute -Wno-non-virtual-dtor -fno-reorder-blocks   conftest.cc  1>&5
configure:5127: $? = 0
configure:5131: test -z 
			 || test ! -s conftest.err
configure:5134: $? = 0
configure:5137: test -s conftest
configure:5140: $? = 0
configure:5161: result: yes
configure:5179: checking whether i386-pc-linux-gnu-g++ supports -fno-exceptions
configure:5215: rm -rf SunWS_cache; i386-pc-linux-gnu-g++ -o conftest -Wno-long-long -Wundef -ansi -D_XOPEN_SOURCE=500 -D_BSD_SOURCE -Wcast-align -Wconversion -Wchar-subscripts -Wall -W -Wpointer-arith -DNDEBUG -DNO_DEBUG -O2  -O2 -mcpu=i686 -Wformat-security -Wmissing-format-attribute -Wno-non-virtual-dtor -fno-exceptions   conftest.cc  1>&5
configure:5221: $? = 0
configure:5225: test -z 
			 || test ! -s conftest.err
configure:5228: $? = 0
configure:5231: test -s conftest
configure:5234: $? = 0
configure:5255: result: yes
configure:5267: checking whether i386-pc-linux-gnu-g++ supports -fno-check-new
configure:5303: rm -rf SunWS_cache; i386-pc-linux-gnu-g++ -o conftest -Wno-long-long -Wundef -ansi -D_XOPEN_SOURCE=500 -D_BSD_SOURCE -Wcast-align -Wconversion -Wchar-subscripts -Wall -W -Wpointer-arith -DNDEBUG -DNO_DEBUG -O2  -O2 -mcpu=i686 -Wformat-security -Wmissing-format-attribute -Wno-non-virtual-dtor -fno-exceptions -fno-check-new   conftest.cc  1>&5
configure:5309: $? = 0
configure:5313: test -z 
			 || test ! -s conftest.err
configure:5316: $? = 0
configure:5319: test -s conftest
configure:5322: $? = 0
configure:5343: result: yes
configure:5355: checking whether i386-pc-linux-gnu-g++ supports -fno-common
configure:5391: rm -rf SunWS_cache; i386-pc-linux-gnu-g++ -o conftest -Wno-long-long -Wundef -ansi -D_XOPEN_SOURCE=500 -D_BSD_SOURCE -Wcast-align -Wconversion -Wchar-subscripts -Wall -W -Wpointer-arith -DNDEBUG -DNO_DEBUG -O2  -O2 -mcpu=i686 -Wformat-security -Wmissing-format-attribute -Wno-non-virtual-dtor -fno-exceptions -fno-check-new -fno-common   conftest.cc  1>&5
configure:5397: $? = 0
configure:5401: test -z 
			 || test ! -s conftest.err
configure:5404: $? = 0
configure:5407: test -s conftest
configure:5410: $? = 0
configure:5431: result: yes
configure:5443: checking whether i386-pc-linux-gnu-g++ supports -fexceptions
configure:5479: rm -rf SunWS_cache; i386-pc-linux-gnu-g++ -o conftest -Wno-long-long -Wundef -ansi -D_XOPEN_SOURCE=500 -D_BSD_SOURCE -Wcast-align -Wconversion -Wchar-subscripts -Wall -W -Wpointer-arith -DNDEBUG -DNO_DEBUG -O2  -O2 -mcpu=i686 -Wformat-security -Wmissing-format-attribute -Wno-non-virtual-dtor -fno-exceptions -fno-check-new -fno-common -fexceptions   conftest.cc  1>&5
configure:5485: $? = 0
configure:5489: test -z 
			 || test ! -s conftest.err
configure:5492: $? = 0
configure:5495: test -s conftest
configure:5498: $? = 0
configure:5519: result: yes
configure:5562: checking whether system headers can cope with -O2 -fno-inline
configure:5631: result: irrelevant
configure:6287: checking how to run the C++ preprocessor
configure:6318: i386-pc-linux-gnu-g++ -E  conftest.cc
configure:6324: $? = 0
configure:6356: i386-pc-linux-gnu-g++ -E  conftest.cc
conftest.cc:14:28: ac_nonexistent.h: No such file or directory
configure:6362: $? = 1
configure: failed program was:
| /* confdefs.h.  */
| 
| #define PACKAGE_NAME ""
| #define PACKAGE_TARNAME ""
| #define PACKAGE_VERSION ""
| #define PACKAGE_STRING ""
| #define PACKAGE_BUGREPORT ""
| #define PACKAGE "kdeaddons"
| #define VERSION "3.5.2"
| #ifdef __cplusplus
| extern "C" void std::exit (int) throw (); using std::exit;
| #endif
| /* end confdefs.h.  */
| #include <ac_nonexistent.h>
configure:6401: result: i386-pc-linux-gnu-g++ -E
configure:6425: i386-pc-linux-gnu-g++ -E  conftest.cc
configure:6431: $? = 0
configure:6463: i386-pc-linux-gnu-g++ -E  conftest.cc
conftest.cc:14:28: ac_nonexistent.h: No such file or directory
configure:6469: $? = 1
configure: failed program was:
| /* confdefs.h.  */
| 
| #define PACKAGE_NAME ""
| #define PACKAGE_TARNAME ""
| #define PACKAGE_VERSION ""
| #define PACKAGE_STRING ""
| #define PACKAGE_BUGREPORT ""
| #define PACKAGE "kdeaddons"
| #define VERSION "3.5.2"
| #ifdef __cplusplus
| extern "C" void std::exit (int) throw (); using std::exit;
| #endif
| /* end confdefs.h.  */
| #include <ac_nonexistent.h>
configure:6517: checking whether i386-pc-linux-gnu-g++ supports -O0
configure:6553: rm -rf SunWS_cache; i386-pc-linux-gnu-g++ -o conftest -Wno-long-long -Wundef -ansi -D_XOPEN_SOURCE=500 -D_BSD_SOURCE -Wcast-align -Wconversion -Wchar-subscripts -Wall -W -Wpointer-arith -DNDEBUG -DNO_DEBUG -O2 -O2 -mcpu=i686 -Wformat-security -Wmissing-format-attribute -Wno-non-virtual-dtor -fno-exceptions -fno-check-new -fno-common -O0   conftest.cc  1>&5
configure:6559: $? = 0
configure:6563: test -z 
			 || test ! -s conftest.err
configure:6566: $? = 0
configure:6569: test -s conftest
configure:6572: $? = 0
configure:6593: result: yes
configure:6864: checking whether i386-pc-linux-gnu-g++ supports -Wl,--no-undefined
configure:6900: rm -rf SunWS_cache; i386-pc-linux-gnu-g++ -o conftest -Wno-long-long -Wundef -ansi -D_XOPEN_SOURCE=500 -D_BSD_SOURCE -Wcast-align -Wconversion -Wchar-subscripts -Wall -W -Wpointer-arith -DNDEBUG -DNO_DEBUG -O2 -O2 -mcpu=i686 -Wformat-security -Wmissing-format-attribute -Wno-non-virtual-dtor -fno-exceptions -fno-check-new -fno-common -Wl,--no-undefined   conftest.cc  1>&5
configure:6906: $? = 0
configure:6910: test -z 
			 || test ! -s conftest.err
configure:6913: $? = 0
configure:6916: test -s conftest
configure:6919: $? = 0
configure:6940: result: yes
configure:6944: checking whether i386-pc-linux-gnu-g++ supports -Wl,--allow-shlib-undefined
configure:6980: rm -rf SunWS_cache; i386-pc-linux-gnu-g++ -o conftest -Wno-long-long -Wundef -ansi -D_XOPEN_SOURCE=500 -D_BSD_SOURCE -Wcast-align -Wconversion -Wchar-subscripts -Wall -W -Wpointer-arith -DNDEBUG -DNO_DEBUG -O2 -O2 -mcpu=i686 -Wformat-security -Wmissing-format-attribute -Wno-non-virtual-dtor -fno-exceptions -fno-check-new -fno-common -Wl,--allow-shlib-undefined   conftest.cc  1>&5
configure:6986: $? = 0
configure:6990: test -z 
			 || test ! -s conftest.err
configure:6993: $? = 0
configure:6996: test -s conftest
configure:6999: $? = 0
configure:7020: result: yes
configure:7144: result: not using lib directory suffix
configure:7189: checking for a sed that does not truncate output
configure:7243: result: /bin/sed
configure:7246: checking for egrep
configure:7256: result: grep -E
configure:7272: checking for ld used by i386-pc-linux-gnu-gcc
configure:7339: result: /usr/i386-pc-linux-gnu/bin/ld
configure:7348: checking if the linker (/usr/i386-pc-linux-gnu/bin/ld) is GNU ld
configure:7363: result: yes
configure:7368: checking for /usr/i386-pc-linux-gnu/bin/ld option to reload object files
configure:7375: result: -r
configure:7384: checking for BSD-compatible nm
configure:7426: result: /usr/bin/i386-pc-linux-gnu-nm -B
configure:7430: checking whether ln -s works
configure:7434: result: yes
configure:7441: checking how to recognise dependent libraries
configure:7648: result: pass_all
configure:7857: checking for ANSI C header files
configure:7882: i386-pc-linux-gnu-gcc -c -std=iso9899:1990 -W -Wall -Wchar-subscripts -Wshadow -Wpointer-arith -Wmissing-prototypes -Wwrite-strings -D_XOPEN_SOURCE=500 -D_BSD_SOURCE -DNDEBUG -O2  -O2 -mcpu=i686 -Wformat-security -Wmissing-format-attribute  conftest.c >&5
configure:7888: $? = 0
configure:7892: test -z 
			 || test ! -s conftest.err
configure:7895: $? = 0
configure:7898: test -s conftest.o
configure:7901: $? = 0
configure:7990: i386-pc-linux-gnu-gcc -o conftest -std=iso9899:1990 -W -Wall -Wchar-subscripts -Wshadow -Wpointer-arith -Wmissing-prototypes -Wwrite-strings -D_XOPEN_SOURCE=500 -D_BSD_SOURCE -DNDEBUG -O2  -O2 -mcpu=i686 -Wformat-security -Wmissing-format-attribute   conftest.c  >&5
conftest.c: In function `main':
conftest.c:32: warning: implicit declaration of function `exit'
configure:7993: $? = 0
configure:7995: ./conftest
configure:7998: $? = 0
configure:8013: result: yes
configure:8037: checking for sys/types.h
configure:8053: i386-pc-linux-gnu-gcc -c -std=iso9899:1990 -W -Wall -Wchar-subscripts -Wshadow -Wpointer-arith -Wmissing-prototypes -Wwrite-strings -D_XOPEN_SOURCE=500 -D_BSD_SOURCE -DNDEBUG -O2  -O2 -mcpu=i686 -Wformat-security -Wmissing-format-attribute  conftest.c >&5
configure:8059: $? = 0
configure:8063: test -z 
			 || test ! -s conftest.err
configure:8066: $? = 0
configure:8069: test -s conftest.o
configure:8072: $? = 0
configure:8083: result: yes
configure:8037: checking for sys/stat.h
configure:8053: i386-pc-linux-gnu-gcc -c -std=iso9899:1990 -W -Wall -Wchar-subscripts -Wshadow -Wpointer-arith -Wmissing-prototypes -Wwrite-strings -D_XOPEN_SOURCE=500 -D_BSD_SOURCE -DNDEBUG -O2  -O2 -mcpu=i686 -Wformat-security -Wmissing-format-attribute  conftest.c >&5
configure:8059: $? = 0
configure:8063: test -z 
			 || test ! -s conftest.err
configure:8066: $? = 0
configure:8069: test -s conftest.o
configure:8072: $? = 0
configure:8083: result: yes
configure:8037: checking for stdlib.h
configure:8053: i386-pc-linux-gnu-gcc -c -std=iso9899:1990 -W -Wall -Wchar-subscripts -Wshadow -Wpointer-arith -Wmissing-prototypes -Wwrite-strings -D_XOPEN_SOURCE=500 -D_BSD_SOURCE -DNDEBUG -O2  -O2 -mcpu=i686 -Wformat-security -Wmissing-format-attribute  conftest.c >&5
configure:8059: $? = 0
configure:8063: test -z 
			 || test ! -s conftest.err
configure:8066: $? = 0
configure:8069: test -s conftest.o
configure:8072: $? = 0
configure:8083: result: yes
configure:8037: checking for string.h
configure:8053: i386-pc-linux-gnu-gcc -c -std=iso9899:1990 -W -Wall -Wchar-subscripts -Wshadow -Wpointer-arith -Wmissing-prototypes -Wwrite-strings -D_XOPEN_SOURCE=500 -D_BSD_SOURCE -DNDEBUG -O2  -O2 -mcpu=i686 -Wformat-security -Wmissing-format-attribute  conftest.c >&5
configure:8059: $? = 0
configure:8063: test -z 
			 || test ! -s conftest.err
configure:8066: $? = 0
configure:8069: test -s conftest.o
configure:8072: $? = 0
configure:8083: result: yes
configure:8037: checking for memory.h
configure:8053: i386-pc-linux-gnu-gcc -c -std=iso9899:1990 -W -Wall -Wchar-subscripts -Wshadow -Wpointer-arith -Wmissing-prototypes -Wwrite-strings -D_XOPEN_SOURCE=500 -D_BSD_SOURCE -DNDEBUG -O2  -O2 -mcpu=i686 -Wformat-security -Wmissing-format-attribute  conftest.c >&5
configure:8059: $? = 0
configure:8063: test -z 
			 || test ! -s conftest.err
configure:8066: $? = 0
configure:8069: test -s conftest.o
configure:8072: $? = 0
configure:8083: result: yes
configure:8037: checking for strings.h
configure:8053: i386-pc-linux-gnu-gcc -c -std=iso9899:1990 -W -Wall -Wchar-subscripts -Wshadow -Wpointer-arith -Wmissing-prototypes -Wwrite-strings -D_XOPEN_SOURCE=500 -D_BSD_SOURCE -DNDEBUG -O2  -O2 -mcpu=i686 -Wformat-security -Wmissing-format-attribute  conftest.c >&5
configure:8059: $? = 0
configure:8063: test -z 
			 || test ! -s conftest.err
configure:8066: $? = 0
configure:8069: test -s conftest.o
configure:8072: $? = 0
configure:8083: result: yes
configure:8037: checking for inttypes.h
configure:8053: i386-pc-linux-gnu-gcc -c -std=iso9899:1990 -W -Wall -Wchar-subscripts -Wshadow -Wpointer-arith -Wmissing-prototypes -Wwrite-strings -D_XOPEN_SOURCE=500 -D_BSD_SOURCE -DNDEBUG -O2  -O2 -mcpu=i686 -Wformat-security -Wmissing-format-attribute  conftest.c >&5
configure:8059: $? = 0
configure:8063: test -z 
			 || test ! -s conftest.err
configure:8066: $? = 0
configure:8069: test -s conftest.o
configure:8072: $? = 0
configure:8083: result: yes
configure:8037: checking for stdint.h
configure:8053: i386-pc-linux-gnu-gcc -c -std=iso9899:1990 -W -Wall -Wchar-subscripts -Wshadow -Wpointer-arith -Wmissing-prototypes -Wwrite-strings -D_XOPEN_SOURCE=500 -D_BSD_SOURCE -DNDEBUG -O2  -O2 -mcpu=i686 -Wformat-security -Wmissing-format-attribute  conftest.c >&5
configure:8059: $? = 0
configure:8063: test -z 
			 || test ! -s conftest.err
configure:8066: $? = 0
configure:8069: test -s conftest.o
configure:8072: $? = 0
configure:8083: result: yes
configure:8037: checking for unistd.h
configure:8053: i386-pc-linux-gnu-gcc -c -std=iso9899:1990 -W -Wall -Wchar-subscripts -Wshadow -Wpointer-arith -Wmissing-prototypes -Wwrite-strings -D_XOPEN_SOURCE=500 -D_BSD_SOURCE -DNDEBUG -O2  -O2 -mcpu=i686 -Wformat-security -Wmissing-format-attribute  conftest.c >&5
configure:8059: $? = 0
configure:8063: test -z 
			 || test ! -s conftest.err
configure:8066: $? = 0
configure:8069: test -s conftest.o
configure:8072: $? = 0
configure:8083: result: yes
configure:8109: checking dlfcn.h usability
configure:8121: i386-pc-linux-gnu-gcc -c -std=iso9899:1990 -W -Wall -Wchar-subscripts -Wshadow -Wpointer-arith -Wmissing-prototypes -Wwrite-strings -D_XOPEN_SOURCE=500 -D_BSD_SOURCE -DNDEBUG -O2  -O2 -mcpu=i686 -Wformat-security -Wmissing-format-attribute  conftest.c >&5
configure:8127: $? = 0
configure:8131: test -z 
			 || test ! -s conftest.err
configure:8134: $? = 0
configure:8137: test -s conftest.o
configure:8140: $? = 0
configure:8150: result: yes
configure:8154: checking dlfcn.h presence
configure:8164: i386-pc-linux-gnu-gcc -E  conftest.c
configure:8170: $? = 0
configure:8190: result: yes
configure:8225: checking for dlfcn.h
configure:8232: result: yes
configure:8254: checking for i386-pc-linux-gnu-g77
configure:8270: found /usr/bin/i386-pc-linux-gnu-g77
configure:8280: result: i386-pc-linux-gnu-g77
configure:8337: checking for Fortran 77 compiler version
configure:8340: i386-pc-linux-gnu-g77 --version </dev/null >&5
GNU Fortran (GCC) 3.3.6 (Gentoo 3.3.6, ssp-3.3.6-1.0, pie-8.7.8)
Copyright (C) 2002 Free Software Foundation, Inc.

GNU Fortran comes with NO WARRANTY, to the extent permitted by law.
You may redistribute copies of GNU Fortran
under the terms of the GNU General Public License.
For more information about these matters, see the file named COPYING
or type the command `info -f g77 Copying'.
configure:8343: $? = 0
configure:8345: i386-pc-linux-gnu-g77 -v </dev/null >&5
Reading specs from /usr/lib/gcc-lib/i386-pc-linux-gnu/3.3.6/specs
Configured with: /var/tmp/portage/gcc-3.3.6/work/gcc-3.3.6/configure --prefix=/usr --bindir=/usr/i386-pc-linux-gnu/gcc-bin/3.3.6 --includedir=/usr/lib/gcc-lib/i386-pc-linux-gnu/3.3.6/include --datadir=/usr/share/gcc-data/i386-pc-linux-gnu/3.3.6 --mandir=/usr/share/gcc-data/i386-pc-linux-gnu/3.3.6/man --infodir=/usr/share/gcc-data/i386-pc-linux-gnu/3.3.6/info --with-gxx-include-dir=/usr/lib/gcc-lib/i386-pc-linux-gnu/3.3.6/include/g++-v3 --host=i386-pc-linux-gnu --build=i386-pc-linux-gnu --disable-altivec --enable-nls --without-included-gettext --with-system-zlib --disable-checking --disable-werror --disable-libunwind-exceptions --disable-multilib --disable-libgcj --enable-languages=c,c++,f77 --enable-shared --enable-threads=posix --enable-__cxa_atexit --enable-clocale=gnu
Thread model: posix
gcc version 3.3.6 (Gentoo 3.3.6, ssp-3.3.6-1.0, pie-8.7.8)
configure:8348: $? = 0
configure:8350: i386-pc-linux-gnu-g77 -V </dev/null >&5
i386-pc-linux-gnu-g77: `-V' option must have argument
configure:8353: $? = 1
configure:8361: checking whether we are using the GNU Fortran 77 compiler
configure:8375: i386-pc-linux-gnu-g77 -c  conftest.F >&5
configure:8381: $? = 0
configure:8385: test -z 
			 || test ! -s conftest.err
configure:8388: $? = 0
configure:8391: test -s conftest.o
configure:8394: $? = 0
configure:8407: result: yes
configure:8413: checking whether i386-pc-linux-gnu-g77 accepts -g
configure:8425: i386-pc-linux-gnu-g77 -c -g conftest.f >&5
configure:8431: $? = 0
configure:8435: test -z 
			 || test ! -s conftest.err
configure:8438: $? = 0
configure:8441: test -s conftest.o
configure:8444: $? = 0
configure:8456: result: yes
configure:8486: checking the maximum length of command line arguments
configure:8545: result: 32768
configure:8556: checking command to parse /usr/bin/i386-pc-linux-gnu-nm -B output from i386-pc-linux-gnu-gcc object
configure:8645: i386-pc-linux-gnu-gcc -c -std=iso9899:1990 -W -Wall -Wchar-subscripts -Wshadow -Wpointer-arith -Wmissing-prototypes -Wwrite-strings -D_XOPEN_SOURCE=500 -D_BSD_SOURCE -DNDEBUG -O2  -O2 -mcpu=i686 -Wformat-security -Wmissing-format-attribute  conftest.c >&5
conftest.c:5: warning: no previous prototype for `nm_test_func'
configure:8648: $? = 0
configure:8652: /usr/bin/i386-pc-linux-gnu-nm -B conftest.o \| sed -n -e 's/^.*[ 	]\([ABCDGISTW][ABCDGISTW]*\)[ 	][ 	]*\(\)\([_A-Za-z][_A-Za-z0-9]*\)$/\1 \2\3 \3/p' \> conftest.nm
configure:8655: $? = 0
configure:8707: i386-pc-linux-gnu-gcc -o conftest -std=iso9899:1990 -W -Wall -Wchar-subscripts -Wshadow -Wpointer-arith -Wmissing-prototypes -Wwrite-strings -D_XOPEN_SOURCE=500 -D_BSD_SOURCE -DNDEBUG -O2  -O2 -mcpu=i686 -Wformat-security -Wmissing-format-attribute   conftest.c conftstm.o >&5
configure:8710: $? = 0
configure:8748: result: ok
configure:8752: checking for objdir
configure:8767: result: .libs
configure:8819: checking for i386-pc-linux-gnu-ar
configure:8835: found /usr/bin/i386-pc-linux-gnu-ar
configure:8845: result: i386-pc-linux-gnu-ar
configure:8899: checking for i386-pc-linux-gnu-ranlib
configure:8915: found /usr/bin/i386-pc-linux-gnu-ranlib
configure:8925: result: i386-pc-linux-gnu-ranlib
configure:8979: checking for i386-pc-linux-gnu-strip
configure:8995: found /usr/bin/i386-pc-linux-gnu-strip
configure:9005: result: i386-pc-linux-gnu-strip
configure:9306: checking if i386-pc-linux-gnu-gcc static flag  works
configure:9329: result: yes
configure:9351: checking if i386-pc-linux-gnu-gcc supports -fno-rtti -fno-exceptions
configure:9369: i386-pc-linux-gnu-gcc -c -std=iso9899:1990 -W -Wall -Wchar-subscripts -Wshadow -Wpointer-arith -Wmissing-prototypes -Wwrite-strings -D_XOPEN_SOURCE=500 -D_BSD_SOURCE -DNDEBUG -O2  -O2 -mcpu=i686 -Wformat-security -Wmissing-format-attribute  -fno-rtti -fno-exceptions conftest.c >&5
cc1: warning: "-fno-rtti" is valid for C++ but not for C/ObjC
configure:9373: $? = 0
configure:9384: result: no
configure:9399: checking for i386-pc-linux-gnu-gcc option to produce PIC
configure:9576: result: -fPIC
configure:9584: checking if i386-pc-linux-gnu-gcc PIC flag -fPIC works
configure:9602: i386-pc-linux-gnu-gcc -c -std=iso9899:1990 -W -Wall -Wchar-subscripts -Wshadow -Wpointer-arith -Wmissing-prototypes -Wwrite-strings -D_XOPEN_SOURCE=500 -D_BSD_SOURCE -DNDEBUG -O2  -O2 -mcpu=i686 -Wformat-security -Wmissing-format-attribute  -fPIC -DPIC conftest.c >&5
configure:9606: $? = 0
configure:9617: result: yes
configure:9641: checking if i386-pc-linux-gnu-gcc supports -c -o file.o
configure:9669: i386-pc-linux-gnu-gcc -c -std=iso9899:1990 -W -Wall -Wchar-subscripts -Wshadow -Wpointer-arith -Wmissing-prototypes -Wwrite-strings -D_XOPEN_SOURCE=500 -D_BSD_SOURCE -DNDEBUG -O2  -O2 -mcpu=i686 -Wformat-security -Wmissing-format-attribute  -o out/conftest2.o conftest.c >&5
configure:9673: $? = 0
configure:9690: result: yes
configure:9716: checking whether the i386-pc-linux-gnu-gcc linker (/usr/i386-pc-linux-gnu/bin/ld) supports shared libraries
configure:10528: result: yes
configure:10554: checking whether -lc should be explicitly linked in
configure:10559: i386-pc-linux-gnu-gcc -c -std=iso9899:1990 -W -Wall -Wchar-subscripts -Wshadow -Wpointer-arith -Wmissing-prototypes -Wwrite-strings -D_XOPEN_SOURCE=500 -D_BSD_SOURCE -DNDEBUG -O2  -O2 -mcpu=i686 -Wformat-security -Wmissing-format-attribute  conftest.c >&5
configure:10562: $? = 0
configure:10576: i386-pc-linux-gnu-gcc -shared -v conftest.o  -Wl,-soname -Wl,conftest -o conftest 2\>\&1 \| grep  -lc  \>/dev/null 2\>\&1
configure:10579: $? = 0
configure:10591: result: no
configure:10599: checking dynamic linker characteristics
configure:11117: result: GNU/Linux ld.so
configure:11121: checking how to hardcode library paths into programs
configure:11146: result: immediate
configure:11160: checking whether stripping libraries is possible
configure:11165: result: yes
configure:11291: checking for shl_load
configure:11348: i386-pc-linux-gnu-gcc -o conftest -std=iso9899:1990 -W -Wall -Wchar-subscripts -Wshadow -Wpointer-arith -Wmissing-prototypes -Wwrite-strings -D_XOPEN_SOURCE=500 -D_BSD_SOURCE -DNDEBUG -O2  -O2 -mcpu=i686 -Wformat-security -Wmissing-format-attribute   conftest.c  >&5
/var/tmp/portage/kdeaddons-3.5.2-r1/temp/ccs1vNZV.o: In function `main':
conftest.c:(.text+0x11): undefined reference to `shl_load'
/var/tmp/portage/kdeaddons-3.5.2-r1/temp/ccs1vNZV.o:(.data+0x0): undefined reference to `shl_load'
collect2: ld returned 1 exit status
configure:11354: $? = 1
configure: failed program was:
| /* confdefs.h.  */
| 
| #define PACKAGE_NAME ""
| #define PACKAGE_TARNAME ""
| #define PACKAGE_VERSION ""
| #define PACKAGE_STRING ""
| #define PACKAGE_BUGREPORT ""
| #define PACKAGE "kdeaddons"
| #define VERSION "3.5.2"
| #ifdef __cplusplus
| extern "C" void std::exit (int) throw (); using std::exit;
| #endif
| #define KDELIBSUFF ""
| #define STDC_HEADERS 1
| #define HAVE_SYS_TYPES_H 1
| #define HAVE_SYS_STAT_H 1
| #define HAVE_STDLIB_H 1
| #define HAVE_STRING_H 1
| #define HAVE_MEMORY_H 1
| #define HAVE_STRINGS_H 1
| #define HAVE_INTTYPES_H 1
| #define HAVE_STDINT_H 1
| #define HAVE_UNISTD_H 1
| #define HAVE_DLFCN_H 1
| /* end confdefs.h.  */
| /* Define shl_load to an innocuous variant, in case <limits.h> declares shl_load.
|    For example, HP-UX 11i <limits.h> declares gettimeofday.  */
| #define shl_load innocuous_shl_load
| 
| /* System header to define __stub macros and hopefully few prototypes,
|     which can conflict with char shl_load (); below.
|     Prefer <limits.h> to <assert.h> if __STDC__ is defined, since
|     <limits.h> exists even on freestanding compilers.  */
| 
| #ifdef __STDC__
| # include <limits.h>
| #else
| # include <assert.h>
| #endif
| 
| #undef shl_load
| 
| /* Override any gcc2 internal prototype to avoid an error.  */
| #ifdef __cplusplus
| extern "C"
| {
| #endif
| /* We use char because int might match the return type of a gcc2
|    builtin and then its argument prototype would still apply.  */
| char shl_load ();
| /* The GNU C library defines this for functions which it implements
|     to always fail with ENOSYS.  Some functions are actually named
|     something starting with __ and the normal name is an alias.  */
| #if defined (__stub_shl_load) || defined (__stub___shl_load)
| choke me
| #else
| char (*f) () = shl_load;
| #endif
| #ifdef __cplusplus
| }
| #endif
| 
| int
| main ()
| {
| return f != shl_load;
|   ;
|   return 0;
| }
configure:11379: result: no
configure:11384: checking for shl_load in -ldld
configure:11414: i386-pc-linux-gnu-gcc -o conftest -std=iso9899:1990 -W -Wall -Wchar-subscripts -Wshadow -Wpointer-arith -Wmissing-prototypes -Wwrite-strings -D_XOPEN_SOURCE=500 -D_BSD_SOURCE -DNDEBUG -O2  -O2 -mcpu=i686 -Wformat-security -Wmissing-format-attribute   conftest.c -ldld   >&5
/usr/lib/gcc-lib/i386-pc-linux-gnu/3.3.6/../../../../i386-pc-linux-gnu/bin/ld: cannot find -ldld
collect2: ld returned 1 exit status
configure:11420: $? = 1
configure: failed program was:
| /* confdefs.h.  */
| 
| #define PACKAGE_NAME ""
| #define PACKAGE_TARNAME ""
| #define PACKAGE_VERSION ""
| #define PACKAGE_STRING ""
| #define PACKAGE_BUGREPORT ""
| #define PACKAGE "kdeaddons"
| #define VERSION "3.5.2"
| #ifdef __cplusplus
| extern "C" void std::exit (int) throw (); using std::exit;
| #endif
| #define KDELIBSUFF ""
| #define STDC_HEADERS 1
| #define HAVE_SYS_TYPES_H 1
| #define HAVE_SYS_STAT_H 1
| #define HAVE_STDLIB_H 1
| #define HAVE_STRING_H 1
| #define HAVE_MEMORY_H 1
| #define HAVE_STRINGS_H 1
| #define HAVE_INTTYPES_H 1
| #define HAVE_STDINT_H 1
| #define HAVE_UNISTD_H 1
| #define HAVE_DLFCN_H 1
| /* end confdefs.h.  */
| 
| /* Override any gcc2 internal prototype to avoid an error.  */
| #ifdef __cplusplus
| extern "C"
| #endif
| /* We use char because int might match the return type of a gcc2
|    builtin and then its argument prototype would still apply.  */
| char shl_load ();
| int
| main ()
| {
| shl_load ();
|   ;
|   return 0;
| }
configure:11446: result: no
configure:11451: checking for dlopen
configure:11508: i386-pc-linux-gnu-gcc -o conftest -std=iso9899:1990 -W -Wall -Wchar-subscripts -Wshadow -Wpointer-arith -Wmissing-prototypes -Wwrite-strings -D_XOPEN_SOURCE=500 -D_BSD_SOURCE -DNDEBUG -O2  -O2 -mcpu=i686 -Wformat-security -Wmissing-format-attribute   conftest.c  >&5
/var/tmp/portage/kdeaddons-3.5.2-r1/temp/ccevNbMB.o: In function `main':
conftest.c:(.text+0x11): undefined reference to `dlopen'
/var/tmp/portage/kdeaddons-3.5.2-r1/temp/ccevNbMB.o:(.data+0x0): undefined reference to `dlopen'
collect2: ld returned 1 exit status
configure:11514: $? = 1
configure: failed program was:
| /* confdefs.h.  */
| 
| #define PACKAGE_NAME ""
| #define PACKAGE_TARNAME ""
| #define PACKAGE_VERSION ""
| #define PACKAGE_STRING ""
| #define PACKAGE_BUGREPORT ""
| #define PACKAGE "kdeaddons"
| #define VERSION "3.5.2"
| #ifdef __cplusplus
| extern "C" void std::exit (int) throw (); using std::exit;
| #endif
| #define KDELIBSUFF ""
| #define STDC_HEADERS 1
| #define HAVE_SYS_TYPES_H 1
| #define HAVE_SYS_STAT_H 1
| #define HAVE_STDLIB_H 1
| #define HAVE_STRING_H 1
| #define HAVE_MEMORY_H 1
| #define HAVE_STRINGS_H 1
| #define HAVE_INTTYPES_H 1
| #define HAVE_STDINT_H 1
| #define HAVE_UNISTD_H 1
| #define HAVE_DLFCN_H 1
| /* end confdefs.h.  */
| /* Define dlopen to an innocuous variant, in case <limits.h> declares dlopen.
|    For example, HP-UX 11i <limits.h> declares gettimeofday.  */
| #define dlopen innocuous_dlopen
| 
| /* System header to define __stub macros and hopefully few prototypes,
|     which can conflict with char dlopen (); below.
|     Prefer <limits.h> to <assert.h> if __STDC__ is defined, since
|     <limits.h> exists even on freestanding compilers.  */
| 
| #ifdef __STDC__
| # include <limits.h>
| #else
| # include <assert.h>
| #endif
| 
| #undef dlopen
| 
| /* Override any gcc2 internal prototype to avoid an error.  */
| #ifdef __cplusplus
| extern "C"
| {
| #endif
| /* We use char because int might match the return type of a gcc2
|    builtin and then its argument prototype would still apply.  */
| char dlopen ();
| /* The GNU C library defines this for functions which it implements
|     to always fail with ENOSYS.  Some functions are actually named
|     something starting with __ and the normal name is an alias.  */
| #if defined (__stub_dlopen) || defined (__stub___dlopen)
| choke me
| #else
| char (*f) () = dlopen;
| #endif
| #ifdef __cplusplus
| }
| #endif
| 
| int
| main ()
| {
| return f != dlopen;
|   ;
|   return 0;
| }
configure:11539: result: no
configure:11544: checking for dlopen in -ldl
configure:11574: i386-pc-linux-gnu-gcc -o conftest -std=iso9899:1990 -W -Wall -Wchar-subscripts -Wshadow -Wpointer-arith -Wmissing-prototypes -Wwrite-strings -D_XOPEN_SOURCE=500 -D_BSD_SOURCE -DNDEBUG -O2  -O2 -mcpu=i686 -Wformat-security -Wmissing-format-attribute   conftest.c -ldl   >&5
configure:11580: $? = 0
configure:11584: test -z 
			 || test ! -s conftest.err
configure:11587: $? = 0
configure:11590: test -s conftest
configure:11593: $? = 0
configure:11606: result: yes
configure:11781: checking whether a program can dlopen itself
configure:11853: i386-pc-linux-gnu-gcc -o conftest -std=iso9899:1990 -W -Wall -Wchar-subscripts -Wshadow -Wpointer-arith -Wmissing-prototypes -Wwrite-strings -D_XOPEN_SOURCE=500 -D_BSD_SOURCE -DNDEBUG -O2  -O2 -mcpu=i686 -Wformat-security -Wmissing-format-attribute  -DHAVE_DLFCN_H  -Wl,--export-dynamic conftest.c -ldl  >&5
configure:11836: warning: no previous prototype for `fnord'
configure: In function `fnord':
configure:11836: warning: unused variable `i'
configure: In function `main':
configure:11849: warning: implicit declaration of function `exit'
configure:11856: $? = 0
configure:11874: result: yes
configure:11879: checking whether a statically linked program can dlopen itself
configure:11951: i386-pc-linux-gnu-gcc -o conftest -std=iso9899:1990 -W -Wall -Wchar-subscripts -Wshadow -Wpointer-arith -Wmissing-prototypes -Wwrite-strings -D_XOPEN_SOURCE=500 -D_BSD_SOURCE -DNDEBUG -O2  -O2 -mcpu=i686 -Wformat-security -Wmissing-format-attribute  -DHAVE_DLFCN_H  -Wl,--export-dynamic  conftest.c -ldl  >&5
configure:11934: warning: no previous prototype for `fnord'
configure: In function `fnord':
configure:11934: warning: unused variable `i'
configure: In function `main':
configure:11947: warning: implicit declaration of function `exit'
configure:11954: $? = 0
configure:11972: result: yes
configure:11995: checking if libtool supports shared libraries
configure:11997: result: yes
configure:12000: checking whether to build shared libraries
configure:12058: result: yes
configure:12061: checking whether to build static libraries
configure:12065: result: no
configure:12156: creating libtool
configure:12700: checking for ld used by i386-pc-linux-gnu-g++
configure:12767: result: /usr/i386-pc-linux-gnu/bin/ld
configure:12776: checking if the linker (/usr/i386-pc-linux-gnu/bin/ld) is GNU ld
configure:12791: result: yes
configure:12842: checking whether the i386-pc-linux-gnu-g++ linker (/usr/i386-pc-linux-gnu/bin/ld) supports shared libraries
configure:13656: result: yes
configure:13678: i386-pc-linux-gnu-g++ -c -Wno-long-long -Wundef -ansi -D_XOPEN_SOURCE=500 -D_BSD_SOURCE -Wcast-align -Wconversion -Wchar-subscripts -Wall -W -Wpointer-arith -DNDEBUG -DNO_DEBUG -O2 -O2 -mcpu=i686 -Wformat-security -Wmissing-format-attribute -Wno-non-virtual-dtor -fno-exceptions -fno-check-new -fno-common  conftest.cc >&5
configure:13681: $? = 0
configure:13777: checking for i386-pc-linux-gnu-g++ option to produce PIC
configure:14029: result: -fPIC
configure:14037: checking if i386-pc-linux-gnu-g++ PIC flag -fPIC works
configure:14055: i386-pc-linux-gnu-g++ -c -Wno-long-long -Wundef -ansi -D_XOPEN_SOURCE=500 -D_BSD_SOURCE -Wcast-align -Wconversion -Wchar-subscripts -Wall -W -Wpointer-arith -DNDEBUG -DNO_DEBUG -O2 -O2 -mcpu=i686 -Wformat-security -Wmissing-format-attribute -Wno-non-virtual-dtor -fno-exceptions -fno-check-new -fno-common  -fPIC -DPIC conftest.cc >&5
configure:14059: $? = 0
configure:14070: result: yes
configure:14094: checking if i386-pc-linux-gnu-g++ supports -c -o file.o
configure:14122: i386-pc-linux-gnu-g++ -c -Wno-long-long -Wundef -ansi -D_XOPEN_SOURCE=500 -D_BSD_SOURCE -Wcast-align -Wconversion -Wchar-subscripts -Wall -W -Wpointer-arith -DNDEBUG -DNO_DEBUG -O2 -O2 -mcpu=i686 -Wformat-security -Wmissing-format-attribute -Wno-non-virtual-dtor -fno-exceptions -fno-check-new -fno-common  -o out/conftest2.o conftest.cc >&5
configure:14126: $? = 0
configure:14143: result: yes
configure:14169: checking whether the i386-pc-linux-gnu-g++ linker (/usr/i386-pc-linux-gnu/bin/ld) supports shared libraries
configure:14194: result: yes
configure:14265: checking dynamic linker characteristics
configure:14783: result: GNU/Linux ld.so
configure:14787: checking how to hardcode library paths into programs
configure:14812: result: immediate
configure:14826: checking whether stripping libraries is possible
configure:14831: result: yes
configure:14957: checking for shl_load
configure:15045: result: no
configure:15050: checking for shl_load in -ldld
configure:15112: result: no
configure:15117: checking for dlopen
configure:15205: result: no
configure:15210: checking for dlopen in -ldl
configure:15272: result: yes
configure:15447: checking whether a program can dlopen itself
configure:15540: result: yes
configure:15545: checking whether a statically linked program can dlopen itself
configure:15638: result: yes
configure:16134: checking if libtool supports shared libraries
configure:16136: result: yes
configure:16139: checking whether to build shared libraries
configure:16157: result: yes
configure:16160: checking whether to build static libraries
configure:16164: result: no
configure:16176: checking for i386-pc-linux-gnu-g77 option to produce PIC
configure:16353: result: -fPIC
configure:16361: checking if i386-pc-linux-gnu-g77 PIC flag -fPIC works
configure:16379: i386-pc-linux-gnu-g77 -c -g -O2 -fPIC conftest.f >&5
configure:16383: $? = 0
configure:16394: result: yes
configure:16418: checking if i386-pc-linux-gnu-g77 supports -c -o file.o
configure:16446: i386-pc-linux-gnu-g77 -c -g -O2 -o out/conftest2.o conftest.f >&5
configure:16450: $? = 0
configure:16467: result: yes
configure:16493: checking whether the i386-pc-linux-gnu-g77 linker (/usr/i386-pc-linux-gnu/bin/ld) supports shared libraries
configure:17285: result: yes
configure:17356: checking dynamic linker characteristics
configure:17874: result: GNU/Linux ld.so
configure:17878: checking how to hardcode library paths into programs
configure:17903: result: immediate
configure:17917: checking whether stripping libraries is possible
configure:17922: result: yes
configure:21978: checking for msgfmt
configure:22005: result: /usr/bin/msgfmt
configure:22014: checking for gmsgfmt
configure:22032: found /usr/bin/gmsgfmt
configure:22045: result: /usr/bin/gmsgfmt
configure:22064: checking for xgettext
configure:22091: result: /usr/bin/xgettext
configure:22127: checking if C++ programs can be compiled
configure:22156: i386-pc-linux-gnu-g++ -c -Wno-long-long -Wundef -ansi -D_XOPEN_SOURCE=500 -D_BSD_SOURCE -Wcast-align -Wconversion -Wchar-subscripts -Wall -W -Wpointer-arith -DNDEBUG -DNO_DEBUG -O2 -O2 -mcpu=i686 -Wformat-security -Wmissing-format-attribute -Wno-non-virtual-dtor  -fno-check-new -fno-common  conftest.cc >&5
configure:22162: $? = 0
configure:22166: test -z 
			 || test ! -s conftest.err
configure:22169: $? = 0
configure:22172: test -s conftest.o
configure:22175: $? = 0
configure:22189: result: yes
configure:22219: checking for strlcat
configure:22267: i386-pc-linux-gnu-g++ -c -Wno-long-long -Wundef -ansi -D_XOPEN_SOURCE=500 -D_BSD_SOURCE -Wcast-align -Wconversion -Wchar-subscripts -Wall -W -Wpointer-arith -DNDEBUG -DNO_DEBUG -O2 -O2 -mcpu=i686 -Wformat-security -Wmissing-format-attribute -Wno-non-virtual-dtor -fno-exceptions -fno-check-new -fno-common -pedantic-errors  conftest.cc >&5
conftest.cc: In function `int main()':
conftest.cc:38: error: `strlcat' undeclared (first use this function)
conftest.cc:38: error: (Each undeclared identifier is reported only once for 
   each function it appears in.)
configure:22273: $? = 1
configure: failed program was:
| /* confdefs.h.  */
| 
| #define PACKAGE_NAME ""
| #define PACKAGE_TARNAME ""
| #define PACKAGE_VERSION ""
| #define PACKAGE_STRING ""
| #define PACKAGE_BUGREPORT ""
| #define PACKAGE "kdeaddons"
| #define VERSION "3.5.2"
| #ifdef __cplusplus
| extern "C" void std::exit (int) throw (); using std::exit;
| #endif
| #define KDELIBSUFF ""
| #define STDC_HEADERS 1
| #define HAVE_SYS_TYPES_H 1
| #define HAVE_SYS_STAT_H 1
| #define HAVE_STDLIB_H 1
| #define HAVE_STRING_H 1
| #define HAVE_MEMORY_H 1
| #define HAVE_STRINGS_H 1
| #define HAVE_INTTYPES_H 1
| #define HAVE_STDINT_H 1
| #define HAVE_UNISTD_H 1
| #define HAVE_DLFCN_H 1
| #define HAVE_SGI_STL 1
| /* end confdefs.h.  */
| 
| 
| #include <string.h>
| 
| 
| int
| main ()
| {
| 
|  char buf[20];
|   buf[0]='\0';
|   strlcat(buf, "KDE function test", sizeof(buf));
| 
| 
|   ;
|   return 0;
| }
configure:22308: result: no
configure:22311: checking if strlcat needs custom prototype
configure:22415: result: yes - in libkdefakes
configure:22440: checking for strlcpy
configure:22487: i386-pc-linux-gnu-g++ -c -Wno-long-long -Wundef -ansi -D_XOPEN_SOURCE=500 -D_BSD_SOURCE -Wcast-align -Wconversion -Wchar-subscripts -Wall -W -Wpointer-arith -DNDEBUG -DNO_DEBUG -O2 -O2 -mcpu=i686 -Wformat-security -Wmissing-format-attribute -Wno-non-virtual-dtor -fno-exceptions -fno-check-new -fno-common -pedantic-errors  conftest.cc >&5
conftest.cc: In function `int main()':
conftest.cc:37: error: `strlcpy' undeclared (first use this function)
conftest.cc:37: error: (Each undeclared identifier is reported only once for 
   each function it appears in.)
configure:22493: $? = 1
configure: failed program was:
| /* confdefs.h.  */
| 
| #define PACKAGE_NAME ""
| #define PACKAGE_TARNAME ""
| #define PACKAGE_VERSION ""
| #define PACKAGE_STRING ""
| #define PACKAGE_BUGREPORT ""
| #define PACKAGE "kdeaddons"
| #define VERSION "3.5.2"
| #ifdef __cplusplus
| extern "C" void std::exit (int) throw (); using std::exit;
| #endif
| #define KDELIBSUFF ""
| #define STDC_HEADERS 1
| #define HAVE_SYS_TYPES_H 1
| #define HAVE_SYS_STAT_H 1
| #define HAVE_STDLIB_H 1
| #define HAVE_STRING_H 1
| #define HAVE_MEMORY_H 1
| #define HAVE_STRINGS_H 1
| #define HAVE_INTTYPES_H 1
| #define HAVE_STDINT_H 1
| #define HAVE_UNISTD_H 1
| #define HAVE_DLFCN_H 1
| #define HAVE_SGI_STL 1
| /* end confdefs.h.  */
| 
| 
| #include <string.h>
| 
| 
| int
| main ()
| {
| 
|  char buf[20];
|   strlcpy(buf, "KDE function test", sizeof(buf));
| 
| 
|   ;
|   return 0;
| }
configure:22528: result: no
configure:22531: checking if strlcpy needs custom prototype
configure:22634: result: yes - in libkdefakes
configure:22658: checking for main in -lutil
configure:22682: i386-pc-linux-gnu-gcc -o conftest -std=iso9899:1990 -W -Wall -Wchar-subscripts -Wshadow -Wpointer-arith -Wmissing-prototypes -Wwrite-strings -D_XOPEN_SOURCE=500 -D_BSD_SOURCE -DNDEBUG -O2  -O2 -mcpu=i686 -Wformat-security -Wmissing-format-attribute   conftest.c -lutil   >&5
configure:22688: $? = 0
configure:22692: test -z 
			 || test ! -s conftest.err
configure:22695: $? = 0
configure:22698: test -s conftest
configure:22701: $? = 0
configure:22714: result: yes
configure:22720: checking for main in -lcompat
configure:22744: i386-pc-linux-gnu-gcc -o conftest -std=iso9899:1990 -W -Wall -Wchar-subscripts -Wshadow -Wpointer-arith -Wmissing-prototypes -Wwrite-strings -D_XOPEN_SOURCE=500 -D_BSD_SOURCE -DNDEBUG -O2  -O2 -mcpu=i686 -Wformat-security -Wmissing-format-attribute   conftest.c -lcompat   >&5
/usr/lib/gcc-lib/i386-pc-linux-gnu/3.3.6/../../../../i386-pc-linux-gnu/bin/ld: cannot find -lcompat
collect2: ld returned 1 exit status
configure:22750: $? = 1
configure: failed program was:
| /* confdefs.h.  */
| 
| #define PACKAGE_NAME ""
| #define PACKAGE_TARNAME ""
| #define PACKAGE_VERSION ""
| #define PACKAGE_STRING ""
| #define PACKAGE_BUGREPORT ""
| #define PACKAGE "kdeaddons"
| #define VERSION "3.5.2"
| #ifdef __cplusplus
| extern "C" void std::exit (int) throw (); using std::exit;
| #endif
| #define KDELIBSUFF ""
| #define STDC_HEADERS 1
| #define HAVE_SYS_TYPES_H 1
| #define HAVE_SYS_STAT_H 1
| #define HAVE_STDLIB_H 1
| #define HAVE_STRING_H 1
| #define HAVE_MEMORY_H 1
| #define HAVE_STRINGS_H 1
| #define HAVE_INTTYPES_H 1
| #define HAVE_STDINT_H 1
| #define HAVE_UNISTD_H 1
| #define HAVE_DLFCN_H 1
| #define HAVE_SGI_STL 1
| /* end confdefs.h.  */
| 
| 
| int
| main ()
| {
| main ();
|   ;
|   return 0;
| }
configure:22776: result: no
configure:22783: checking for crypt in -lcrypt
configure:22813: i386-pc-linux-gnu-gcc -o conftest -std=iso9899:1990 -W -Wall -Wchar-subscripts -Wshadow -Wpointer-arith -Wmissing-prototypes -Wwrite-strings -D_XOPEN_SOURCE=500 -D_BSD_SOURCE -DNDEBUG -O2  -O2 -mcpu=i686 -Wformat-security -Wmissing-format-attribute   conftest.c -lcrypt   >&5
configure:22819: $? = 0
configure:22823: test -z 
			 || test ! -s conftest.err
configure:22826: $? = 0
configure:22829: test -s conftest
configure:22832: $? = 0
configure:22845: result: yes
configure:22939: checking for socklen_t
configure:22974: i386-pc-linux-gnu-g++ -c -Wno-long-long -Wundef -ansi -D_XOPEN_SOURCE=500 -D_BSD_SOURCE -Wcast-align -Wconversion -Wchar-subscripts -Wall -W -Wpointer-arith -DNDEBUG -DNO_DEBUG -O2 -O2 -mcpu=i686 -Wformat-security -Wmissing-format-attribute -Wno-non-virtual-dtor -fno-exceptions -fno-check-new -fno-common  conftest.cc >&5
configure:22980: $? = 0
configure:22984: test -z 
			 || test ! -s conftest.err
configure:22987: $? = 0
configure:22990: test -s conftest.o
configure:22993: $? = 0
configure:23014: result: yes
configure:23108: checking for dnet_ntoa in -ldnet
configure:23138: i386-pc-linux-gnu-gcc -o conftest -std=iso9899:1990 -W -Wall -Wchar-subscripts -Wshadow -Wpointer-arith -Wmissing-prototypes -Wwrite-strings -D_XOPEN_SOURCE=500 -D_BSD_SOURCE -DNDEBUG -O2  -O2 -mcpu=i686 -Wformat-security -Wmissing-format-attribute   conftest.c -ldnet   >&5
/usr/lib/gcc-lib/i386-pc-linux-gnu/3.3.6/../../../../i386-pc-linux-gnu/bin/ld: cannot find -ldnet
collect2: ld returned 1 exit status
configure:23144: $? = 1
configure: failed program was:
| /* confdefs.h.  */
| 
| #define PACKAGE_NAME ""
| #define PACKAGE_TARNAME ""
| #define PACKAGE_VERSION ""
| #define PACKAGE_STRING ""
| #define PACKAGE_BUGREPORT ""
| #define PACKAGE "kdeaddons"
| #define VERSION "3.5.2"
| #ifdef __cplusplus
| extern "C" void std::exit (int) throw (); using std::exit;
| #endif
| #define KDELIBSUFF ""
| #define STDC_HEADERS 1
| #define HAVE_SYS_TYPES_H 1
| #define HAVE_SYS_STAT_H 1
| #define HAVE_STDLIB_H 1
| #define HAVE_STRING_H 1
| #define HAVE_MEMORY_H 1
| #define HAVE_STRINGS_H 1
| #define HAVE_INTTYPES_H 1
| #define HAVE_STDINT_H 1
| #define HAVE_UNISTD_H 1
| #define HAVE_DLFCN_H 1
| #define HAVE_SGI_STL 1
| #define HAVE_CRYPT 1
| #define kde_socklen_t socklen_t
| #define ksize_t socklen_t
| /* end confdefs.h.  */
| 
| /* Override any gcc2 internal prototype to avoid an error.  */
| #ifdef __cplusplus
| extern "C"
| #endif
| /* We use char because int might match the return type of a gcc2
|    builtin and then its argument prototype would still apply.  */
| char dnet_ntoa ();
| int
| main ()
| {
| dnet_ntoa ();
|   ;
|   return 0;
| }
configure:23170: result: no
configure:23177: checking for dnet_ntoa in -ldnet_stub
configure:23207: i386-pc-linux-gnu-gcc -o conftest -std=iso9899:1990 -W -Wall -Wchar-subscripts -Wshadow -Wpointer-arith -Wmissing-prototypes -Wwrite-strings -D_XOPEN_SOURCE=500 -D_BSD_SOURCE -DNDEBUG -O2  -O2 -mcpu=i686 -Wformat-security -Wmissing-format-attribute   conftest.c -ldnet_stub   >&5
/usr/lib/gcc-lib/i386-pc-linux-gnu/3.3.6/../../../../i386-pc-linux-gnu/bin/ld: cannot find -ldnet_stub
collect2: ld returned 1 exit status
configure:23213: $? = 1
configure: failed program was:
| /* confdefs.h.  */
| 
| #define PACKAGE_NAME ""
| #define PACKAGE_TARNAME ""
| #define PACKAGE_VERSION ""
| #define PACKAGE_STRING ""
| #define PACKAGE_BUGREPORT ""
| #define PACKAGE "kdeaddons"
| #define VERSION "3.5.2"
| #ifdef __cplusplus
| extern "C" void std::exit (int) throw (); using std::exit;
| #endif
| #define KDELIBSUFF ""
| #define STDC_HEADERS 1
| #define HAVE_SYS_TYPES_H 1
| #define HAVE_SYS_STAT_H 1
| #define HAVE_STDLIB_H 1
| #define HAVE_STRING_H 1
| #define HAVE_MEMORY_H 1
| #define HAVE_STRINGS_H 1
| #define HAVE_INTTYPES_H 1
| #define HAVE_STDINT_H 1
| #define HAVE_UNISTD_H 1
| #define HAVE_DLFCN_H 1
| #define HAVE_SGI_STL 1
| #define HAVE_CRYPT 1
| #define kde_socklen_t socklen_t
| #define ksize_t socklen_t
| /* end confdefs.h.  */
| 
| /* Override any gcc2 internal prototype to avoid an error.  */
| #ifdef __cplusplus
| extern "C"
| #endif
| /* We use char because int might match the return type of a gcc2
|    builtin and then its argument prototype would still apply.  */
| char dnet_ntoa ();
| int
| main ()
| {
| dnet_ntoa ();
|   ;
|   return 0;
| }
configure:23239: result: no
configure:23246: checking for inet_ntoa
configure:23303: i386-pc-linux-gnu-gcc -o conftest -std=iso9899:1990 -W -Wall -Wchar-subscripts -Wshadow -Wpointer-arith -Wmissing-prototypes -Wwrite-strings -D_XOPEN_SOURCE=500 -D_BSD_SOURCE -DNDEBUG -O2  -O2 -mcpu=i686 -Wformat-security -Wmissing-format-attribute   conftest.c  >&5
configure:23309: $? = 0
configure:23313: test -z 
			 || test ! -s conftest.err
configure:23316: $? = 0
configure:23319: test -s conftest
configure:23322: $? = 0
configure:23334: result: yes
configure:23407: checking for connect
configure:23464: i386-pc-linux-gnu-gcc -o conftest -std=iso9899:1990 -W -Wall -Wchar-subscripts -Wshadow -Wpointer-arith -Wmissing-prototypes -Wwrite-strings -D_XOPEN_SOURCE=500 -D_BSD_SOURCE -DNDEBUG -O2  -O2 -mcpu=i686 -Wformat-security -Wmissing-format-attribute   conftest.c  >&5
configure:23470: $? = 0
configure:23474: test -z 
			 || test ! -s conftest.err
configure:23477: $? = 0
configure:23480: test -s conftest
configure:23483: $? = 0
configure:23495: result: yes
configure:23569: checking for remove
configure:23626: i386-pc-linux-gnu-gcc -o conftest -std=iso9899:1990 -W -Wall -Wchar-subscripts -Wshadow -Wpointer-arith -Wmissing-prototypes -Wwrite-strings -D_XOPEN_SOURCE=500 -D_BSD_SOURCE -DNDEBUG -O2  -O2 -mcpu=i686 -Wformat-security -Wmissing-format-attribute   conftest.c  >&5
configure:23632: $? = 0
configure:23636: test -z 
			 || test ! -s conftest.err
configure:23639: $? = 0
configure:23642: test -s conftest
configure:23645: $? = 0
configure:23657: result: yes
configure:23732: checking for shmat
configure:23789: i386-pc-linux-gnu-gcc -o conftest -std=iso9899:1990 -W -Wall -Wchar-subscripts -Wshadow -Wpointer-arith -Wmissing-prototypes -Wwrite-strings -D_XOPEN_SOURCE=500 -D_BSD_SOURCE -DNDEBUG -O2  -O2 -mcpu=i686 -Wformat-security -Wmissing-format-attribute   conftest.c  >&5
configure:23795: $? = 0
configure:23799: test -z 
			 || test ! -s conftest.err
configure:23802: $? = 0
configure:23805: test -s conftest
configure:23808: $? = 0
configure:23820: result: yes
configure:23903: checking for sys/types.h
configure:23908: result: yes
configure:23903: checking for stdint.h
configure:23908: result: yes
configure:24064: checking sys/bitypes.h usability
configure:24076: i386-pc-linux-gnu-gcc -c -std=iso9899:1990 -W -Wall -Wchar-subscripts -Wshadow -Wpointer-arith -Wmissing-prototypes -Wwrite-strings -D_XOPEN_SOURCE=500 -D_BSD_SOURCE -DNDEBUG -O2  -O2 -mcpu=i686 -Wformat-security -Wmissing-format-attribute  conftest.c >&5
configure:24082: $? = 0
configure:24086: test -z 
			 || test ! -s conftest.err
configure:24089: $? = 0
configure:24092: test -s conftest.o
configure:24095: $? = 0
configure:24105: result: yes
configure:24109: checking sys/bitypes.h presence
configure:24119: i386-pc-linux-gnu-gcc -E  conftest.c
configure:24125: $? = 0
configure:24145: result: yes
configure:24180: checking for sys/bitypes.h
configure:24187: result: yes
configure:24202: checking for poll in -lpoll
configure:24232: i386-pc-linux-gnu-gcc -o conftest -std=iso9899:1990 -W -Wall -Wchar-subscripts -Wshadow -Wpointer-arith -Wmissing-prototypes -Wwrite-strings -D_XOPEN_SOURCE=500 -D_BSD_SOURCE -DNDEBUG -O2  -O2 -mcpu=i686 -Wformat-security -Wmissing-format-attribute   conftest.c -lpoll   >&5
/usr/lib/gcc-lib/i386-pc-linux-gnu/3.3.6/../../../../i386-pc-linux-gnu/bin/ld: cannot find -lpoll
collect2: ld returned 1 exit status
configure:24238: $? = 1
configure: failed program was:
| /* confdefs.h.  */
| 
| #define PACKAGE_NAME ""
| #define PACKAGE_TARNAME ""
| #define PACKAGE_VERSION ""
| #define PACKAGE_STRING ""
| #define PACKAGE_BUGREPORT ""
| #define PACKAGE "kdeaddons"
| #define VERSION "3.5.2"
| #ifdef __cplusplus
| extern "C" void std::exit (int) throw (); using std::exit;
| #endif
| #define KDELIBSUFF ""
| #define STDC_HEADERS 1
| #define HAVE_SYS_TYPES_H 1
| #define HAVE_SYS_STAT_H 1
| #define HAVE_STDLIB_H 1
| #define HAVE_STRING_H 1
| #define HAVE_MEMORY_H 1
| #define HAVE_STRINGS_H 1
| #define HAVE_INTTYPES_H 1
| #define HAVE_STDINT_H 1
| #define HAVE_UNISTD_H 1
| #define HAVE_DLFCN_H 1
| #define HAVE_SGI_STL 1
| #define HAVE_CRYPT 1
| #define kde_socklen_t socklen_t
| #define ksize_t socklen_t
| #define HAVE_SYS_TYPES_H 1
| #define HAVE_STDINT_H 1
| #define HAVE_SYS_BITYPES_H 1
| /* end confdefs.h.  */
| 
| /* Override any gcc2 internal prototype to avoid an error.  */
| #ifdef __cplusplus
| extern "C"
| #endif
| /* We use char because int might match the return type of a gcc2
|    builtin and then its argument prototype would still apply.  */
| char poll ();
| int
| main ()
| {
| poll ();
|   ;
|   return 0;
| }
configure:24264: result: no
configure:24286: checking Carbon/Carbon.h usability
configure:24298: i386-pc-linux-gnu-gcc -c -std=iso9899:1990 -W -Wall -Wchar-subscripts -Wshadow -Wpointer-arith -Wmissing-prototypes -Wwrite-strings -D_XOPEN_SOURCE=500 -D_BSD_SOURCE -DNDEBUG -O2  -O2 -mcpu=i686 -Wformat-security -Wmissing-format-attribute  conftest.c >&5
conftest.c:67:27: Carbon/Carbon.h: No such file or directory
configure:24304: $? = 1
configure: failed program was:
| /* confdefs.h.  */
| 
| #define PACKAGE_NAME ""
| #define PACKAGE_TARNAME ""
| #define PACKAGE_VERSION ""
| #define PACKAGE_STRING ""
| #define PACKAGE_BUGREPORT ""
| #define PACKAGE "kdeaddons"
| #define VERSION "3.5.2"
| #ifdef __cplusplus
| extern "C" void std::exit (int) throw (); using std::exit;
| #endif
| #define KDELIBSUFF ""
| #define STDC_HEADERS 1
| #define HAVE_SYS_TYPES_H 1
| #define HAVE_SYS_STAT_H 1
| #define HAVE_STDLIB_H 1
| #define HAVE_STRING_H 1
| #define HAVE_MEMORY_H 1
| #define HAVE_STRINGS_H 1
| #define HAVE_INTTYPES_H 1
| #define HAVE_STDINT_H 1
| #define HAVE_UNISTD_H 1
| #define HAVE_DLFCN_H 1
| #define HAVE_SGI_STL 1
| #define HAVE_CRYPT 1
| #define kde_socklen_t socklen_t
| #define ksize_t socklen_t
| #define HAVE_SYS_TYPES_H 1
| #define HAVE_STDINT_H 1
| #define HAVE_SYS_BITYPES_H 1
| /* end confdefs.h.  */
| #include <stdio.h>
| #if HAVE_SYS_TYPES_H
| # include <sys/types.h>
| #endif
| #if HAVE_SYS_STAT_H
| # include <sys/stat.h>
| #endif
| #if STDC_HEADERS
| # include <stdlib.h>
| # include <stddef.h>
| #else
| # if HAVE_STDLIB_H
| #  include <stdlib.h>
| # endif
| #endif
| #if HAVE_STRING_H
| # if !STDC_HEADERS && HAVE_MEMORY_H
| #  include <memory.h>
| # endif
| # include <string.h>
| #endif
| #if HAVE_STRINGS_H
| # include <strings.h>
| #endif
| #if HAVE_INTTYPES_H
| # include <inttypes.h>
| #else
| # if HAVE_STDINT_H
| #  include <stdint.h>
| # endif
| #endif
| #if HAVE_UNISTD_H
| # include <unistd.h>
| #endif
| #include <Carbon/Carbon.h>
configure:24327: result: no
configure:24331: checking Carbon/Carbon.h presence
configure:24341: i386-pc-linux-gnu-gcc -E  conftest.c
conftest.c:33:27: Carbon/Carbon.h: No such file or directory
configure:24347: $? = 1
configure: failed program was:
| /* confdefs.h.  */
| 
| #define PACKAGE_NAME ""
| #define PACKAGE_TARNAME ""
| #define PACKAGE_VERSION ""
| #define PACKAGE_STRING ""
| #define PACKAGE_BUGREPORT ""
| #define PACKAGE "kdeaddons"
| #define VERSION "3.5.2"
| #ifdef __cplusplus
| extern "C" void std::exit (int) throw (); using std::exit;
| #endif
| #define KDELIBSUFF ""
| #define STDC_HEADERS 1
| #define HAVE_SYS_TYPES_H 1
| #define HAVE_SYS_STAT_H 1
| #define HAVE_STDLIB_H 1
| #define HAVE_STRING_H 1
| #define HAVE_MEMORY_H 1
| #define HAVE_STRINGS_H 1
| #define HAVE_INTTYPES_H 1
| #define HAVE_STDINT_H 1
| #define HAVE_UNISTD_H 1
| #define HAVE_DLFCN_H 1
| #define HAVE_SGI_STL 1
| #define HAVE_CRYPT 1
| #define kde_socklen_t socklen_t
| #define ksize_t socklen_t
| #define HAVE_SYS_TYPES_H 1
| #define HAVE_STDINT_H 1
| #define HAVE_SYS_BITYPES_H 1
| /* end confdefs.h.  */
| #include <Carbon/Carbon.h>
configure:24367: result: no
configure:24402: checking for Carbon/Carbon.h
configure:24409: result: no
configure:24434: checking CoreAudio/CoreAudio.h usability
configure:24446: i386-pc-linux-gnu-gcc -c -std=iso9899:1990 -W -Wall -Wchar-subscripts -Wshadow -Wpointer-arith -Wmissing-prototypes -Wwrite-strings -D_XOPEN_SOURCE=500 -D_BSD_SOURCE -DNDEBUG -O2  -O2 -mcpu=i686 -Wformat-security -Wmissing-format-attribute  conftest.c >&5
conftest.c:67:33: CoreAudio/CoreAudio.h: No such file or directory
configure:24452: $? = 1
configure: failed program was:
| /* confdefs.h.  */
| 
| #define PACKAGE_NAME ""
| #define PACKAGE_TARNAME ""
| #define PACKAGE_VERSION ""
| #define PACKAGE_STRING ""
| #define PACKAGE_BUGREPORT ""
| #define PACKAGE "kdeaddons"
| #define VERSION "3.5.2"
| #ifdef __cplusplus
| extern "C" void std::exit (int) throw (); using std::exit;
| #endif
| #define KDELIBSUFF ""
| #define STDC_HEADERS 1
| #define HAVE_SYS_TYPES_H 1
| #define HAVE_SYS_STAT_H 1
| #define HAVE_STDLIB_H 1
| #define HAVE_STRING_H 1
| #define HAVE_MEMORY_H 1
| #define HAVE_STRINGS_H 1
| #define HAVE_INTTYPES_H 1
| #define HAVE_STDINT_H 1
| #define HAVE_UNISTD_H 1
| #define HAVE_DLFCN_H 1
| #define HAVE_SGI_STL 1
| #define HAVE_CRYPT 1
| #define kde_socklen_t socklen_t
| #define ksize_t socklen_t
| #define HAVE_SYS_TYPES_H 1
| #define HAVE_STDINT_H 1
| #define HAVE_SYS_BITYPES_H 1
| /* end confdefs.h.  */
| #include <stdio.h>
| #if HAVE_SYS_TYPES_H
| # include <sys/types.h>
| #endif
| #if HAVE_SYS_STAT_H
| # include <sys/stat.h>
| #endif
| #if STDC_HEADERS
| # include <stdlib.h>
| # include <stddef.h>
| #else
| # if HAVE_STDLIB_H
| #  include <stdlib.h>
| # endif
| #endif
| #if HAVE_STRING_H
| # if !STDC_HEADERS && HAVE_MEMORY_H
| #  include <memory.h>
| # endif
| # include <string.h>
| #endif
| #if HAVE_STRINGS_H
| # include <strings.h>
| #endif
| #if HAVE_INTTYPES_H
| # include <inttypes.h>
| #else
| # if HAVE_STDINT_H
| #  include <stdint.h>
| # endif
| #endif
| #if HAVE_UNISTD_H
| # include <unistd.h>
| #endif
| #include <CoreAudio/CoreAudio.h>
configure:24475: result: no
configure:24479: checking CoreAudio/CoreAudio.h presence
configure:24489: i386-pc-linux-gnu-gcc -E  conftest.c
conftest.c:33:33: CoreAudio/CoreAudio.h: No such file or directory
configure:24495: $? = 1
configure: failed program was:
| /* confdefs.h.  */
| 
| #define PACKAGE_NAME ""
| #define PACKAGE_TARNAME ""
| #define PACKAGE_VERSION ""
| #define PACKAGE_STRING ""
| #define PACKAGE_BUGREPORT ""
| #define PACKAGE "kdeaddons"
| #define VERSION "3.5.2"
| #ifdef __cplusplus
| extern "C" void std::exit (int) throw (); using std::exit;
| #endif
| #define KDELIBSUFF ""
| #define STDC_HEADERS 1
| #define HAVE_SYS_TYPES_H 1
| #define HAVE_SYS_STAT_H 1
| #define HAVE_STDLIB_H 1
| #define HAVE_STRING_H 1
| #define HAVE_MEMORY_H 1
| #define HAVE_STRINGS_H 1
| #define HAVE_INTTYPES_H 1
| #define HAVE_STDINT_H 1
| #define HAVE_UNISTD_H 1
| #define HAVE_DLFCN_H 1
| #define HAVE_SGI_STL 1
| #define HAVE_CRYPT 1
| #define kde_socklen_t socklen_t
| #define ksize_t socklen_t
| #define HAVE_SYS_TYPES_H 1
| #define HAVE_STDINT_H 1
| #define HAVE_SYS_BITYPES_H 1
| /* end confdefs.h.  */
| #include <CoreAudio/CoreAudio.h>
configure:24515: result: no
configure:24550: checking for CoreAudio/CoreAudio.h
configure:24557: result: no
configure:24575: checking if res_init needs -lresolv
configure:24602: i386-pc-linux-gnu-gcc -o conftest -std=iso9899:1990 -W -Wall -Wchar-subscripts -Wshadow -Wpointer-arith -Wmissing-prototypes -Wwrite-strings -D_XOPEN_SOURCE=500 -D_BSD_SOURCE -DNDEBUG -O2  -O2 -mcpu=i686 -Wformat-security -Wmissing-format-attribute   conftest.c   -lresolv >&5
configure:24608: $? = 0
configure:24612: test -z 
			 || test ! -s conftest.err
configure:24615: $? = 0
configure:24618: test -s conftest
configure:24621: $? = 0
configure:24625: result: yes
configure:24647: checking for res_init
configure:24695: i386-pc-linux-gnu-g++ -c -Wno-long-long -Wundef -ansi -D_XOPEN_SOURCE=500 -D_BSD_SOURCE -Wcast-align -Wconversion -Wchar-subscripts -Wall -W -Wpointer-arith -DNDEBUG -DNO_DEBUG -O2 -O2 -mcpu=i686 -Wformat-security -Wmissing-format-attribute -Wno-non-virtual-dtor -fno-exceptions -fno-check-new -fno-common -pedantic-errors  conftest.cc >&5
configure:24701: $? = 0
configure:24705: test -z 
			 || test ! -s conftest.err
configure:24708: $? = 0
configure:24711: test -s conftest.o
configure:24714: $? = 0
configure:24736: result: yes
configure:24739: checking if res_init needs custom prototype
configure:24843: result: no
configure:24871: checking for killpg in -lucb
configure:24901: i386-pc-linux-gnu-gcc -o conftest -std=iso9899:1990 -W -Wall -Wchar-subscripts -Wshadow -Wpointer-arith -Wmissing-prototypes -Wwrite-strings -D_XOPEN_SOURCE=500 -D_BSD_SOURCE -DNDEBUG -O2  -O2 -mcpu=i686 -Wformat-security -Wmissing-format-attribute   conftest.c -lucb   >&5
/usr/lib/gcc-lib/i386-pc-linux-gnu/3.3.6/../../../../i386-pc-linux-gnu/bin/ld: cannot find -lucb
collect2: ld returned 1 exit status
configure:24907: $? = 1
configure: failed program was:
| /* confdefs.h.  */
| 
| #define PACKAGE_NAME ""
| #define PACKAGE_TARNAME ""
| #define PACKAGE_VERSION ""
| #define PACKAGE_STRING ""
| #define PACKAGE_BUGREPORT ""
| #define PACKAGE "kdeaddons"
| #define VERSION "3.5.2"
| #ifdef __cplusplus
| extern "C" void std::exit (int) throw (); using std::exit;
| #endif
| #define KDELIBSUFF ""
| #define STDC_HEADERS 1
| #define HAVE_SYS_TYPES_H 1
| #define HAVE_SYS_STAT_H 1
| #define HAVE_STDLIB_H 1
| #define HAVE_STRING_H 1
| #define HAVE_MEMORY_H 1
| #define HAVE_STRINGS_H 1
| #define HAVE_INTTYPES_H 1
| #define HAVE_STDINT_H 1
| #define HAVE_UNISTD_H 1
| #define HAVE_DLFCN_H 1
| #define HAVE_SGI_STL 1
| #define HAVE_CRYPT 1
| #define kde_socklen_t socklen_t
| #define ksize_t socklen_t
| #define HAVE_SYS_TYPES_H 1
| #define HAVE_STDINT_H 1
| #define HAVE_SYS_BITYPES_H 1
| #define HAVE_RES_INIT 1
| #define HAVE_RES_INIT 1
| #define HAVE_RES_INIT_PROTO 1
| /* end confdefs.h.  */
| 
| /* Override any gcc2 internal prototype to avoid an error.  */
| #ifdef __cplusplus
| extern "C"
| #endif
| /* We use char because int might match the return type of a gcc2
|    builtin and then its argument prototype would still apply.  */
| char killpg ();
| int
| main ()
| {
| killpg ();
|   ;
|   return 0;
| }
configure:24933: result: no
configure:25016: checking for int
configure:25040: i386-pc-linux-gnu-gcc -c -std=iso9899:1990 -W -Wall -Wchar-subscripts -Wshadow -Wpointer-arith -Wmissing-prototypes -Wwrite-strings -D_XOPEN_SOURCE=500 -D_BSD_SOURCE -DNDEBUG -O2  -O2 -mcpu=i686 -Wformat-security -Wmissing-format-attribute  conftest.c >&5
configure:25046: $? = 0
configure:25050: test -z 
			 || test ! -s conftest.err
configure:25053: $? = 0
configure:25056: test -s conftest.o
configure:25059: $? = 0
configure:25070: result: yes
configure:25073: checking size of int
configure:25392: i386-pc-linux-gnu-gcc -o conftest -std=iso9899:1990 -W -Wall -Wchar-subscripts -Wshadow -Wpointer-arith -Wmissing-prototypes -Wwrite-strings -D_XOPEN_SOURCE=500 -D_BSD_SOURCE -DNDEBUG -O2  -O2 -mcpu=i686 -Wformat-security -Wmissing-format-attribute   conftest.c  >&5
conftest.c:70: warning: no previous prototype for `longval'
conftest.c:71: warning: no previous prototype for `ulongval'
configure:25395: $? = 0
configure:25397: ./conftest
configure:25400: $? = 0
configure:25423: result: 4
configure:25429: checking for short
configure:25453: i386-pc-linux-gnu-gcc -c -std=iso9899:1990 -W -Wall -Wchar-subscripts -Wshadow -Wpointer-arith -Wmissing-prototypes -Wwrite-strings -D_XOPEN_SOURCE=500 -D_BSD_SOURCE -DNDEBUG -O2  -O2 -mcpu=i686 -Wformat-security -Wmissing-format-attribute  conftest.c >&5
configure:25459: $? = 0
configure:25463: test -z 
			 || test ! -s conftest.err
configure:25466: $? = 0
configure:25469: test -s conftest.o
configure:25472: $? = 0
configure:25483: result: yes
configure:25486: checking size of short
configure:25805: i386-pc-linux-gnu-gcc -o conftest -std=iso9899:1990 -W -Wall -Wchar-subscripts -Wshadow -Wpointer-arith -Wmissing-prototypes -Wwrite-strings -D_XOPEN_SOURCE=500 -D_BSD_SOURCE -DNDEBUG -O2  -O2 -mcpu=i686 -Wformat-security -Wmissing-format-attribute   conftest.c  >&5
conftest.c:71: warning: no previous prototype for `longval'
conftest.c:72: warning: no previous prototype for `ulongval'
configure:25808: $? = 0
configure:25810: ./conftest
configure:25813: $? = 0
configure:25836: result: 2
configure:25842: checking for long
configure:25866: i386-pc-linux-gnu-gcc -c -std=iso9899:1990 -W -Wall -Wchar-subscripts -Wshadow -Wpointer-arith -Wmissing-prototypes -Wwrite-strings -D_XOPEN_SOURCE=500 -D_BSD_SOURCE -DNDEBUG -O2  -O2 -mcpu=i686 -Wformat-security -Wmissing-format-attribute  conftest.c >&5
configure:25872: $? = 0
configure:25876: test -z 
			 || test ! -s conftest.err
configure:25879: $? = 0
configure:25882: test -s conftest.o
configure:25885: $? = 0
configure:25896: result: yes
configure:25899: checking size of long
configure:26218: i386-pc-linux-gnu-gcc -o conftest -std=iso9899:1990 -W -Wall -Wchar-subscripts -Wshadow -Wpointer-arith -Wmissing-prototypes -Wwrite-strings -D_XOPEN_SOURCE=500 -D_BSD_SOURCE -DNDEBUG -O2  -O2 -mcpu=i686 -Wformat-security -Wmissing-format-attribute   conftest.c  >&5
conftest.c:72: warning: no previous prototype for `longval'
conftest.c:73: warning: no previous prototype for `ulongval'
configure:26221: $? = 0
configure:26223: ./conftest
configure:26226: $? = 0
configure:26249: result: 4
configure:26255: checking for char *
configure:26279: i386-pc-linux-gnu-gcc -c -std=iso9899:1990 -W -Wall -Wchar-subscripts -Wshadow -Wpointer-arith -Wmissing-prototypes -Wwrite-strings -D_XOPEN_SOURCE=500 -D_BSD_SOURCE -DNDEBUG -O2  -O2 -mcpu=i686 -Wformat-security -Wmissing-format-attribute  conftest.c >&5
configure:26285: $? = 0
configure:26289: test -z 
			 || test ! -s conftest.err
configure:26292: $? = 0
configure:26295: test -s conftest.o
configure:26298: $? = 0
configure:26309: result: yes
configure:26312: checking size of char *
configure:26631: i386-pc-linux-gnu-gcc -o conftest -std=iso9899:1990 -W -Wall -Wchar-subscripts -Wshadow -Wpointer-arith -Wmissing-prototypes -Wwrite-strings -D_XOPEN_SOURCE=500 -D_BSD_SOURCE -DNDEBUG -O2  -O2 -mcpu=i686 -Wformat-security -Wmissing-format-attribute   conftest.c  >&5
conftest.c:73: warning: no previous prototype for `longval'
conftest.c:74: warning: no previous prototype for `ulongval'
configure:26634: $? = 0
configure:26636: ./conftest
configure:26639: $? = 0
configure:26662: result: 4
configure:26670: checking for dlopen in -ldl
configure:26732: result: yes
configure:26742: checking for shl_unload in -ldld
configure:26772: i386-pc-linux-gnu-gcc -o conftest -std=iso9899:1990 -W -Wall -Wchar-subscripts -Wshadow -Wpointer-arith -Wmissing-prototypes -Wwrite-strings -D_XOPEN_SOURCE=500 -D_BSD_SOURCE -DNDEBUG -O2  -O2 -mcpu=i686 -Wformat-security -Wmissing-format-attribute   conftest.c -ldld   >&5
/usr/lib/gcc-lib/i386-pc-linux-gnu/3.3.6/../../../../i386-pc-linux-gnu/bin/ld: cannot find -ldld
collect2: ld returned 1 exit status
configure:26778: $? = 1
configure: failed program was:
| /* confdefs.h.  */
| 
| #define PACKAGE_NAME ""
| #define PACKAGE_TARNAME ""
| #define PACKAGE_VERSION ""
| #define PACKAGE_STRING ""
| #define PACKAGE_BUGREPORT ""
| #define PACKAGE "kdeaddons"
| #define VERSION "3.5.2"
| #ifdef __cplusplus
| extern "C" void std::exit (int) throw (); using std::exit;
| #endif
| #define KDELIBSUFF ""
| #define STDC_HEADERS 1
| #define HAVE_SYS_TYPES_H 1
| #define HAVE_SYS_STAT_H 1
| #define HAVE_STDLIB_H 1
| #define HAVE_STRING_H 1
| #define HAVE_MEMORY_H 1
| #define HAVE_STRINGS_H 1
| #define HAVE_INTTYPES_H 1
| #define HAVE_STDINT_H 1
| #define HAVE_UNISTD_H 1
| #define HAVE_DLFCN_H 1
| #define HAVE_SGI_STL 1
| #define HAVE_CRYPT 1
| #define kde_socklen_t socklen_t
| #define ksize_t socklen_t
| #define HAVE_SYS_TYPES_H 1
| #define HAVE_STDINT_H 1
| #define HAVE_SYS_BITYPES_H 1
| #define HAVE_RES_INIT 1
| #define HAVE_RES_INIT 1
| #define HAVE_RES_INIT_PROTO 1
| #define SIZEOF_INT 4
| #define SIZEOF_SHORT 2
| #define SIZEOF_LONG 4
| #define SIZEOF_CHAR_P 4
| /* end confdefs.h.  */
| 
| /* Override any gcc2 internal prototype to avoid an error.  */
| #ifdef __cplusplus
| extern "C"
| #endif
| /* We use char because int might match the return type of a gcc2
|    builtin and then its argument prototype would still apply.  */
| char shl_unload ();
| int
| main ()
| {
| shl_unload ();
|   ;
|   return 0;
| }
configure:26804: result: no
configure:26819: checking for size_t
configure:26843: i386-pc-linux-gnu-gcc -c -std=iso9899:1990 -W -Wall -Wchar-subscripts -Wshadow -Wpointer-arith -Wmissing-prototypes -Wwrite-strings -D_XOPEN_SOURCE=500 -D_BSD_SOURCE -DNDEBUG -O2  -O2 -mcpu=i686 -Wformat-security -Wmissing-format-attribute  conftest.c >&5
configure:26849: $? = 0
configure:26853: test -z 
			 || test ! -s conftest.err
configure:26856: $? = 0
configure:26859: test -s conftest.o
configure:26862: $? = 0
configure:26873: result: yes
configure:26876: checking size of size_t
configure:27195: i386-pc-linux-gnu-gcc -o conftest -std=iso9899:1990 -W -Wall -Wchar-subscripts -Wshadow -Wpointer-arith -Wmissing-prototypes -Wwrite-strings -D_XOPEN_SOURCE=500 -D_BSD_SOURCE -DNDEBUG -O2  -O2 -mcpu=i686 -Wformat-security -Wmissing-format-attribute   conftest.c  >&5
conftest.c:74: warning: no previous prototype for `longval'
conftest.c:75: warning: no previous prototype for `ulongval'
configure:27198: $? = 0
configure:27200: ./conftest
configure:27203: $? = 0
configure:27226: result: 4
configure:27233: checking for unsigned long
configure:27257: i386-pc-linux-gnu-gcc -c -std=iso9899:1990 -W -Wall -Wchar-subscripts -Wshadow -Wpointer-arith -Wmissing-prototypes -Wwrite-strings -D_XOPEN_SOURCE=500 -D_BSD_SOURCE -DNDEBUG -O2  -O2 -mcpu=i686 -Wformat-security -Wmissing-format-attribute  conftest.c >&5
configure:27263: $? = 0
configure:27267: test -z 
			 || test ! -s conftest.err
configure:27270: $? = 0
configure:27273: test -s conftest.o
configure:27276: $? = 0
configure:27287: result: yes
configure:27290: checking size of unsigned long
configure:27609: i386-pc-linux-gnu-gcc -o conftest -std=iso9899:1990 -W -Wall -Wchar-subscripts -Wshadow -Wpointer-arith -Wmissing-prototypes -Wwrite-strings -D_XOPEN_SOURCE=500 -D_BSD_SOURCE -DNDEBUG -O2  -O2 -mcpu=i686 -Wformat-security -Wmissing-format-attribute   conftest.c  >&5
conftest.c:75: warning: no previous prototype for `longval'
conftest.c:76: warning: no previous prototype for `ulongval'
configure:27612: $? = 0
configure:27614: ./conftest
configure:27617: $? = 0
configure:27640: result: 4
configure:27648: checking sizeof size_t == sizeof unsigned long
configure:27670: i386-pc-linux-gnu-gcc -c -std=iso9899:1990 -W -Wall -Wchar-subscripts -Wshadow -Wpointer-arith -Wmissing-prototypes -Wwrite-strings -D_XOPEN_SOURCE=500 -D_BSD_SOURCE -DNDEBUG -O2  -O2 -mcpu=i686 -Wformat-security -Wmissing-format-attribute  conftest.c >&5
configure:27676: $? = 0
configure:27680: test -z 
			 || test ! -s conftest.err
configure:27683: $? = 0
configure:27686: test -s conftest.o
configure:27689: $? = 0
configure:27691: result: yes
configure:27714: checking for PIE support
configure:27752: rm -rf SunWS_cache; i386-pc-linux-gnu-g++ -o conftest -Wno-long-long -Wundef -ansi -D_XOPEN_SOURCE=500 -D_BSD_SOURCE -Wcast-align -Wconversion -Wchar-subscripts -Wall -W -Wpointer-arith -DNDEBUG -DNO_DEBUG -O2 -O2 -mcpu=i686 -Wformat-security -Wmissing-format-attribute -Wno-non-virtual-dtor -fno-exceptions -fno-check-new -fno-common -fPIE   -pie conftest.cc  1>&5
configure:27758: $? = 0
configure:27762: test -z 
			 || test ! -s conftest.err
configure:27765: $? = 0
configure:27768: test -s conftest
configure:27771: $? = 0
configure:27793: result: yes
configure:27796: checking if enabling -pie/fPIE support
configure:27811: result: yes
configure:27841: checking crt_externs.h usability
configure:27853: i386-pc-linux-gnu-gcc -c -std=iso9899:1990 -W -Wall -Wchar-subscripts -Wshadow -Wpointer-arith -Wmissing-prototypes -Wwrite-strings -D_XOPEN_SOURCE=500 -D_BSD_SOURCE -DNDEBUG -O2  -O2 -mcpu=i686 -Wformat-security -Wmissing-format-attribute  conftest.c >&5
conftest.c:76:25: crt_externs.h: No such file or directory
configure:27859: $? = 1
configure: failed program was:
| /* confdefs.h.  */
| 
| #define PACKAGE_NAME ""
| #define PACKAGE_TARNAME ""
| #define PACKAGE_VERSION ""
| #define PACKAGE_STRING ""
| #define PACKAGE_BUGREPORT ""
| #define PACKAGE "kdeaddons"
| #define VERSION "3.5.2"
| #ifdef __cplusplus
| extern "C" void std::exit (int) throw (); using std::exit;
| #endif
| #define KDELIBSUFF ""
| #define STDC_HEADERS 1
| #define HAVE_SYS_TYPES_H 1
| #define HAVE_SYS_STAT_H 1
| #define HAVE_STDLIB_H 1
| #define HAVE_STRING_H 1
| #define HAVE_MEMORY_H 1
| #define HAVE_STRINGS_H 1
| #define HAVE_INTTYPES_H 1
| #define HAVE_STDINT_H 1
| #define HAVE_UNISTD_H 1
| #define HAVE_DLFCN_H 1
| #define HAVE_SGI_STL 1
| #define HAVE_CRYPT 1
| #define kde_socklen_t socklen_t
| #define ksize_t socklen_t
| #define HAVE_SYS_TYPES_H 1
| #define HAVE_STDINT_H 1
| #define HAVE_SYS_BITYPES_H 1
| #define HAVE_RES_INIT 1
| #define HAVE_RES_INIT 1
| #define HAVE_RES_INIT_PROTO 1
| #define SIZEOF_INT 4
| #define SIZEOF_SHORT 2
| #define SIZEOF_LONG 4
| #define SIZEOF_CHAR_P 4
| #define SIZEOF_SIZE_T 4
| #define SIZEOF_UNSIGNED_LONG 4
| /* end confdefs.h.  */
| #include <stdio.h>
| #if HAVE_SYS_TYPES_H
| # include <sys/types.h>
| #endif
| #if HAVE_SYS_STAT_H
| # include <sys/stat.h>
| #endif
| #if STDC_HEADERS
| # include <stdlib.h>
| # include <stddef.h>
| #else
| # if HAVE_STDLIB_H
| #  include <stdlib.h>
| # endif
| #endif
| #if HAVE_STRING_H
| # if !STDC_HEADERS && HAVE_MEMORY_H
| #  include <memory.h>
| # endif
| # include <string.h>
| #endif
| #if HAVE_STRINGS_H
| # include <strings.h>
| #endif
| #if HAVE_INTTYPES_H
| # include <inttypes.h>
| #else
| # if HAVE_STDINT_H
| #  include <stdint.h>
| # endif
| #endif
| #if HAVE_UNISTD_H
| # include <unistd.h>
| #endif
| #include <crt_externs.h>
configure:27882: result: no
configure:27886: checking crt_externs.h presence
configure:27896: i386-pc-linux-gnu-gcc -E  conftest.c
conftest.c:42:25: crt_externs.h: No such file or directory
configure:27902: $? = 1
configure: failed program was:
| /* confdefs.h.  */
| 
| #define PACKAGE_NAME ""
| #define PACKAGE_TARNAME ""
| #define PACKAGE_VERSION ""
| #define PACKAGE_STRING ""
| #define PACKAGE_BUGREPORT ""
| #define PACKAGE "kdeaddons"
| #define VERSION "3.5.2"
| #ifdef __cplusplus
| extern "C" void std::exit (int) throw (); using std::exit;
| #endif
| #define KDELIBSUFF ""
| #define STDC_HEADERS 1
| #define HAVE_SYS_TYPES_H 1
| #define HAVE_SYS_STAT_H 1
| #define HAVE_STDLIB_H 1
| #define HAVE_STRING_H 1
| #define HAVE_MEMORY_H 1
| #define HAVE_STRINGS_H 1
| #define HAVE_INTTYPES_H 1
| #define HAVE_STDINT_H 1
| #define HAVE_UNISTD_H 1
| #define HAVE_DLFCN_H 1
| #define HAVE_SGI_STL 1
| #define HAVE_CRYPT 1
| #define kde_socklen_t socklen_t
| #define ksize_t socklen_t
| #define HAVE_SYS_TYPES_H 1
| #define HAVE_STDINT_H 1
| #define HAVE_SYS_BITYPES_H 1
| #define HAVE_RES_INIT 1
| #define HAVE_RES_INIT 1
| #define HAVE_RES_INIT_PROTO 1
| #define SIZEOF_INT 4
| #define SIZEOF_SHORT 2
| #define SIZEOF_LONG 4
| #define SIZEOF_CHAR_P 4
| #define SIZEOF_SIZE_T 4
| #define SIZEOF_UNSIGNED_LONG 4
| /* end confdefs.h.  */
| #include <crt_externs.h>
configure:27922: result: no
configure:27957: checking for crt_externs.h
configure:27964: result: no
configure:27977: checking for _NSGetEnviron
configure:28034: i386-pc-linux-gnu-gcc -o conftest -std=iso9899:1990 -W -Wall -Wchar-subscripts -Wshadow -Wpointer-arith -Wmissing-prototypes -Wwrite-strings -D_XOPEN_SOURCE=500 -D_BSD_SOURCE -DNDEBUG -O2  -O2 -mcpu=i686 -Wformat-security -Wmissing-format-attribute   conftest.c  >&5
/var/tmp/portage/kdeaddons-3.5.2-r1/temp/ccObp8yQ.o: In function `main':
conftest.c:(.text+0x11): undefined reference to `_NSGetEnviron'
/var/tmp/portage/kdeaddons-3.5.2-r1/temp/ccObp8yQ.o:(.data+0x0): undefined reference to `_NSGetEnviron'
collect2: ld returned 1 exit status
configure:28040: $? = 1
configure: failed program was:
| /* confdefs.h.  */
| 
| #define PACKAGE_NAME ""
| #define PACKAGE_TARNAME ""
| #define PACKAGE_VERSION ""
| #define PACKAGE_STRING ""
| #define PACKAGE_BUGREPORT ""
| #define PACKAGE "kdeaddons"
| #define VERSION "3.5.2"
| #ifdef __cplusplus
| extern "C" void std::exit (int) throw (); using std::exit;
| #endif
| #define KDELIBSUFF ""
| #define STDC_HEADERS 1
| #define HAVE_SYS_TYPES_H 1
| #define HAVE_SYS_STAT_H 1
| #define HAVE_STDLIB_H 1
| #define HAVE_STRING_H 1
| #define HAVE_MEMORY_H 1
| #define HAVE_STRINGS_H 1
| #define HAVE_INTTYPES_H 1
| #define HAVE_STDINT_H 1
| #define HAVE_UNISTD_H 1
| #define HAVE_DLFCN_H 1
| #define HAVE_SGI_STL 1
| #define HAVE_CRYPT 1
| #define kde_socklen_t socklen_t
| #define ksize_t socklen_t
| #define HAVE_SYS_TYPES_H 1
| #define HAVE_STDINT_H 1
| #define HAVE_SYS_BITYPES_H 1
| #define HAVE_RES_INIT 1
| #define HAVE_RES_INIT 1
| #define HAVE_RES_INIT_PROTO 1
| #define SIZEOF_INT 4
| #define SIZEOF_SHORT 2
| #define SIZEOF_LONG 4
| #define SIZEOF_CHAR_P 4
| #define SIZEOF_SIZE_T 4
| #define SIZEOF_UNSIGNED_LONG 4
| /* end confdefs.h.  */
| /* Define _NSGetEnviron to an innocuous variant, in case <limits.h> declares _NSGetEnviron.
|    For example, HP-UX 11i <limits.h> declares gettimeofday.  */
| #define _NSGetEnviron innocuous__NSGetEnviron
| 
| /* System header to define __stub macros and hopefully few prototypes,
|     which can conflict with char _NSGetEnviron (); below.
|     Prefer <limits.h> to <assert.h> if __STDC__ is defined, since
|     <limits.h> exists even on freestanding compilers.  */
| 
| #ifdef __STDC__
| # include <limits.h>
| #else
| # include <assert.h>
| #endif
| 
| #undef _NSGetEnviron
| 
| /* Override any gcc2 internal prototype to avoid an error.  */
| #ifdef __cplusplus
| extern "C"
| {
| #endif
| /* We use char because int might match the return type of a gcc2
|    builtin and then its argument prototype would still apply.  */
| char _NSGetEnviron ();
| /* The GNU C library defines this for functions which it implements
|     to always fail with ENOSYS.  Some functions are actually named
|     something starting with __ and the normal name is an alias.  */
| #if defined (__stub__NSGetEnviron) || defined (__stub____NSGetEnviron)
| choke me
| #else
| char (*f) () = _NSGetEnviron;
| #endif
| #ifdef __cplusplus
| }
| #endif
| 
| int
| main ()
| {
| return f != _NSGetEnviron;
|   ;
|   return 0;
| }
configure:28065: result: no
configure:28087: checking for vsnprintf
configure:28144: i386-pc-linux-gnu-gcc -o conftest -std=iso9899:1990 -W -Wall -Wchar-subscripts -Wshadow -Wpointer-arith -Wmissing-prototypes -Wwrite-strings -D_XOPEN_SOURCE=500 -D_BSD_SOURCE -DNDEBUG -O2  -O2 -mcpu=i686 -Wformat-security -Wmissing-format-attribute   conftest.c  >&5
configure:28150: $? = 0
configure:28154: test -z 
			 || test ! -s conftest.err
configure:28157: $? = 0
configure:28160: test -s conftest
configure:28163: $? = 0
configure:28175: result: yes
configure:28087: checking for snprintf
configure:28144: i386-pc-linux-gnu-gcc -o conftest -std=iso9899:1990 -W -Wall -Wchar-subscripts -Wshadow -Wpointer-arith -Wmissing-prototypes -Wwrite-strings -D_XOPEN_SOURCE=500 -D_BSD_SOURCE -DNDEBUG -O2  -O2 -mcpu=i686 -Wformat-security -Wmissing-format-attribute   conftest.c  >&5
configure:28150: $? = 0
configure:28154: test -z 
			 || test ! -s conftest.err
configure:28157: $? = 0
configure:28160: test -s conftest
configure:28163: $? = 0
configure:28175: result: yes
configure:28234: checking for X
configure:28272: i386-pc-linux-gnu-gcc -E  conftest.c
configure:28278: $? = 0
configure:28369: i386-pc-linux-gnu-gcc -o conftest -std=iso9899:1990 -W -Wall -Wchar-subscripts -Wshadow -Wpointer-arith -Wmissing-prototypes -Wwrite-strings -D_XOPEN_SOURCE=500 -D_BSD_SOURCE -DNDEBUG -O2  -O2 -mcpu=i686 -Wformat-security -Wmissing-format-attribute   conftest.c -lXt  >&5
configure:28375: $? = 0
configure:28379: test -z 
			 || test ! -s conftest.err
configure:28382: $? = 0
configure:28385: test -s conftest
configure:28388: $? = 0
configure:28534: result: libraries /usr/lib, headers .
configure:28563: checking for IceConnectionNumber in -lICE
configure:28593: i386-pc-linux-gnu-gcc -o conftest -std=iso9899:1990 -W -Wall -Wchar-subscripts -Wshadow -Wpointer-arith -Wmissing-prototypes -Wwrite-strings -D_XOPEN_SOURCE=500 -D_BSD_SOURCE -DNDEBUG -O2  -O2 -mcpu=i686 -Wformat-security -Wmissing-format-attribute   -L/usr/lib conftest.c -lICE   >&5
configure:28599: $? = 0
configure:28603: test -z 
			 || test ! -s conftest.err
configure:28606: $? = 0
configure:28609: test -s conftest
configure:28612: $? = 0
configure:28625: result: yes
configure:28635: checking for libXext
configure:28670: i386-pc-linux-gnu-gcc -o conftest -std=iso9899:1990 -W -Wall -Wchar-subscripts -Wshadow -Wpointer-arith -Wmissing-prototypes -Wwrite-strings -D_XOPEN_SOURCE=500 -D_BSD_SOURCE -DNDEBUG -O2  -O2 -mcpu=i686 -Wformat-security -Wmissing-format-attribute   -L/usr/lib  conftest.c -lXext -lX11  >&5
configure:28676: $? = 0
configure:28680: test -z 
			 || test ! -s conftest.err
configure:28683: $? = 0
configure:28686: test -s conftest
configure:28689: $? = 0
configure:28708: result: yes
configure:28943: checking for pthread_create in -lpthread
configure:28973: i386-pc-linux-gnu-gcc -o conftest -std=iso9899:1990 -W -Wall -Wchar-subscripts -Wshadow -Wpointer-arith -Wmissing-prototypes -Wwrite-strings -D_XOPEN_SOURCE=500 -D_BSD_SOURCE -DNDEBUG -O2  -O2 -mcpu=i686 -Wformat-security -Wmissing-format-attribute   conftest.c -lpthread   >&5
configure:28979: $? = 0
configure:28983: test -z 
			 || test ! -s conftest.err
configure:28986: $? = 0
configure:28989: test -s conftest
configure:28992: $? = 0
configure:29005: result: yes
configure:29285: checking for extra includes
configure:29313: result: added
configure:29317: checking for extra libs
configure:29346: result: no
configure:29352: checking for libz
configure:29387: i386-pc-linux-gnu-gcc -o conftest -std=iso9899:1990 -W -Wall -Wchar-subscripts -Wshadow -Wpointer-arith -Wmissing-prototypes -Wwrite-strings -D_XOPEN_SOURCE=500 -D_BSD_SOURCE -DNDEBUG -O2  -O2 -mcpu=i686 -Wformat-security -Wmissing-format-attribute -I.  -I/usr/include/db4.2  -D_REENTRANT  conftest.c -L/usr/lib    -lz  >&5
configure:29393: $? = 0
configure:29397: test -z 
			 || test ! -s conftest.err
configure:29400: $? = 0
configure:29403: test -s conftest
configure:29406: $? = 0
configure:29428: result: -lz
configure:29449: checking for libpng
configure:29486: i386-pc-linux-gnu-gcc -o conftest -std=iso9899:1990 -W -Wall -Wchar-subscripts -Wshadow -Wpointer-arith -Wmissing-prototypes -Wwrite-strings -D_XOPEN_SOURCE=500 -D_BSD_SOURCE -DNDEBUG -O2  -O2 -mcpu=i686 -Wformat-security -Wmissing-format-attribute -I.  -I/usr/include/db4.2  -D_REENTRANT  conftest.c  -L/usr/lib    -lpng -lz -lm -lX11  >&5
configure:29492: $? = 0
configure:29496: test -z 
			 || test ! -s conftest.err
configure:29499: $? = 0
configure:29502: test -s conftest
configure:29505: $? = 0
configure:29529: result: -lpng -lz -lm
configure:29540: checking for libjpeg6b
configure:29574: i386-pc-linux-gnu-gcc -o conftest -std=iso9899:1990 -W -Wall -Wchar-subscripts -Wshadow -Wpointer-arith -Wmissing-prototypes -Wwrite-strings -D_XOPEN_SOURCE=500 -D_BSD_SOURCE -DNDEBUG -O2  -O2 -mcpu=i686 -Wformat-security -Wmissing-format-attribute -I.  -I/usr/include/db4.2  -D_REENTRANT  conftest.c -L/usr/lib    -ljpeg6b -lm >&5
/usr/lib/gcc-lib/i386-pc-linux-gnu/3.3.6/../../../../i386-pc-linux-gnu/bin/ld: cannot find -ljpeg6b
collect2: ld returned 1 exit status
configure:29580: $? = 1
configure: failed program was:
| /* confdefs.h.  */
| 
| #define PACKAGE_NAME ""
| #define PACKAGE_TARNAME ""
| #define PACKAGE_VERSION ""
| #define PACKAGE_STRING ""
| #define PACKAGE_BUGREPORT ""
| #define PACKAGE "kdeaddons"
| #define VERSION "3.5.2"
| #ifdef __cplusplus
| extern "C" void std::exit (int) throw (); using std::exit;
| #endif
| #define KDELIBSUFF ""
| #define STDC_HEADERS 1
| #define HAVE_SYS_TYPES_H 1
| #define HAVE_SYS_STAT_H 1
| #define HAVE_STDLIB_H 1
| #define HAVE_STRING_H 1
| #define HAVE_MEMORY_H 1
| #define HAVE_STRINGS_H 1
| #define HAVE_INTTYPES_H 1
| #define HAVE_STDINT_H 1
| #define HAVE_UNISTD_H 1
| #define HAVE_DLFCN_H 1
| #define HAVE_SGI_STL 1
| #define HAVE_CRYPT 1
| #define kde_socklen_t socklen_t
| #define ksize_t socklen_t
| #define HAVE_SYS_TYPES_H 1
| #define HAVE_STDINT_H 1
| #define HAVE_SYS_BITYPES_H 1
| #define HAVE_RES_INIT 1
| #define HAVE_RES_INIT 1
| #define HAVE_RES_INIT_PROTO 1
| #define SIZEOF_INT 4
| #define SIZEOF_SHORT 2
| #define SIZEOF_LONG 4
| #define SIZEOF_CHAR_P 4
| #define SIZEOF_SIZE_T 4
| #define SIZEOF_UNSIGNED_LONG 4
| #define HAVE_VSNPRINTF 1
| #define HAVE_SNPRINTF 1
| #define HAVE_LIBZ 1
| #define HAVE_LIBPNG 1
| /* end confdefs.h.  */
| 
| #ifdef __cplusplus
| extern "C" {
| #endif
| void jpeg_CreateDecompress();
| #ifdef __cplusplus
| }
| #endif
| 
| int
| main ()
| {
| jpeg_CreateDecompress();
|   ;
|   return 0;
| }
configure:29615: result: no
configure:29618: checking for libjpeg
configure:29652: i386-pc-linux-gnu-gcc -o conftest -std=iso9899:1990 -W -Wall -Wchar-subscripts -Wshadow -Wpointer-arith -Wmissing-prototypes -Wwrite-strings -D_XOPEN_SOURCE=500 -D_BSD_SOURCE -DNDEBUG -O2  -O2 -mcpu=i686 -Wformat-security -Wmissing-format-attribute -I.  -I/usr/include/db4.2  -D_REENTRANT  conftest.c -L/usr/lib    -ljpeg -lm >&5
configure:29658: $? = 0
configure:29662: test -z 
			 || test ! -s conftest.err
configure:29665: $? = 0
configure:29668: test -s conftest
configure:29671: $? = 0
configure:29690: result: -ljpeg
configure: 29714: ${prefix}/include/jpeglib.h
configure: 29714: /usr/include/jpeglib.h
taking that
configure:29761: checking for perl
configure:29821: result: /usr/bin/perl
configure:29947: checking for Qt
configure: 30012: /usr/qt/3/include/qstyle.h
taking that
configure:30130: rm -rf SunWS_cache; i386-pc-linux-gnu-g++ -o conftest -Wno-long-long -Wundef -ansi -D_XOPEN_SOURCE=500 -D_BSD_SOURCE -Wcast-align -Wconversion -Wchar-subscripts -Wall -W -Wpointer-arith -DNDEBUG -DNO_DEBUG -O2 -O2 -mcpu=i686 -Wformat-security -Wmissing-format-attribute -Wno-non-virtual-dtor -fno-exceptions -fno-check-new -fno-common -I/usr/qt/3/include -I.  -DQT_THREAD_SUPPORT  -D_REENTRANT  -L/usr/qt/3/lib -L/usr/lib     conftest.cc  -lqt-mt -lpng -lz -lm -ljpeg -ldl  -lXext -lX11 -lSM -lICE  -lpthread 1>&5
configure:30133: $? = 0
configure:30192: result: libraries /usr/qt/3/lib, headers /usr/qt/3/include using -mt
configure:30374: checking for moc
configure:30446: result: /usr/qt/3/bin/moc
configure:30454: checking for uic
configure:30508: result: /usr/qt/3/bin/uic
configure:30539: checking whether uic supports -L 
configure:30550: /usr/qt/3/bin/uic -L /nonexistent conftest.ui >/dev/null
configure:30553: $? = 0
configure:30565: result: yes
configure:30577: checking whether uic supports -nounload 
configure:30588: /usr/qt/3/bin/uic -nounload  conftest.ui >/dev/null
configure:30591: $? = 0
configure:30603: result: yes
configure:30640: checking if Qt needs -ljpeg
configure:30681: rm -rf SunWS_cache; i386-pc-linux-gnu-g++ -o conftest -Wno-long-long -Wundef -ansi -D_XOPEN_SOURCE=500 -D_BSD_SOURCE -Wcast-align -Wconversion -Wchar-subscripts -Wall -W -Wpointer-arith -DNDEBUG -DNO_DEBUG -O2 -O2 -mcpu=i686 -Wformat-security -Wmissing-format-attribute -Wno-non-virtual-dtor -fno-exceptions -fno-check-new -fno-common -I/usr/qt/3/include -I.  -I/usr/include/db4.2  -DQT_THREAD_SUPPORT  -D_REENTRANT  conftest.cc -L/usr/qt/3/lib -L/usr/lib -lqt-mt -lpng -lz -lm  -ldl -lXext -lX11 -lSM -lICE 1>&5
conftest.cc: In function `int main()':
conftest.cc:54: warning: `char**argv' might be used uninitialized in this 
   function
configure:30687: $? = 0
configure:30691: test -z 
			 || test ! -s conftest.err
configure:30694: $? = 0
configure:30697: test -s conftest
configure:30700: $? = 0
configure:30729: result: no
configure:30761: checking for rpath
configure:30793: result: yes
configure:30796: checking for KDE
configure: 30849: /usr/kde/3.5/include/ksharedptr.h
taking that
configure: 30879: /usr/kde/3.5/lib/libkio.la
taking that
configure: 30897: /usr/kde/3.5/lib/kde3/plugins/designer/kdewidgets.la
taking that
configure:30970: result: libraries /usr/kde/3.5/lib, headers /usr/kde/3.5/include
configure:31009: checking if UIC has KDE plugins available
configure:31036: /usr/qt/3/bin/uic -L /usr/kde/3.5/lib/kde3/plugins/designer -nounload -impl actest.h actest.ui > actest.cpp
configure:31039: $? = 0
configure:31053: result: yes
configure:31108: checking for KDE paths
configure:31725: result: defaults
configure:31773: checking for dcopidl
configure:31835: result: /usr/kde/3.5/bin/dcopidl
configure:31842: checking for dcopidl2cpp
configure:31904: result: /usr/kde/3.5/bin/dcopidl2cpp
configure:31912: checking for mcopidl
configure:31976: result: /usr/kde/3.5/bin/mcopidl
configure:31983: checking for artsc-config
configure:32047: result: /usr/kde/3.5/bin/artsc-config
configure:32055: checking for meinproc
configure:32109: result: /usr/kde/3.5/bin/meinproc
configure:32139: checking for kconfig_compiler
configure:32201: result: /usr/kde/3.5/bin/kconfig_compiler
configure:32208: checking for dcopidlng
configure:32270: result: /usr/kde/3.5/bin/dcopidlng
configure:32279: checking for makekdewidgets
configure:32341: result: /usr/kde/3.5/bin/makekdewidgets
configure:32350: checking for xmllint
configure:32404: result: /usr/bin/xmllint
configure: 32420: /usr/kde/3.5/share/apps/ksgmltools2/customization/kde-chunk.xsl
taking that
configure:32580: checking for setenv
configure:32625: i386-pc-linux-gnu-g++ -c -Wno-long-long -Wundef -ansi -D_XOPEN_SOURCE=500 -D_BSD_SOURCE -Wcast-align -Wconversion -Wchar-subscripts -Wall -W -Wpointer-arith -DNDEBUG -DNO_DEBUG -O2 -O2 -mcpu=i686 -Wformat-security -Wmissing-format-attribute -Wno-non-virtual-dtor -fno-exceptions -fno-check-new -fno-common -pedantic-errors  -DQT_THREAD_SUPPORT  -D_REENTRANT conftest.cc >&5
configure:32631: $? = 0
configure:32635: test -z 
			 || test ! -s conftest.err
configure:32638: $? = 0
configure:32641: test -s conftest.o
configure:32644: $? = 0
configure:32666: result: yes
configure:32669: checking if setenv needs custom prototype
configure:32770: result: no
configure:32821: checking atlantik/ui/board.h usability
configure:32833: i386-pc-linux-gnu-g++ -c -Wno-long-long -Wundef -ansi -D_XOPEN_SOURCE=500 -D_BSD_SOURCE -Wcast-align -Wconversion -Wchar-subscripts -Wall -W -Wpointer-arith -DNDEBUG -DNO_DEBUG -O2 -O2 -mcpu=i686 -Wformat-security -Wmissing-format-attribute -Wno-non-virtual-dtor -fno-exceptions -fno-check-new -fno-common -DQT_CLEAN_NAMESPACE -DQT_NO_ASCII_CAST -DQT_NO_STL -DQT_NO_COMPAT -DQT_NO_TRANSLATION  -DQT_THREAD_SUPPORT  -D_REENTRANT -I/usr/kde/3.5/include -I/usr/qt/3/include -I.  -I/usr/include/db4.2 conftest.cc >&5
configure:32839: $? = 0
configure:32843: test -z 
			 || test ! -s conftest.err
configure:32846: $? = 0
configure:32849: test -s conftest.o
configure:32852: $? = 0
configure:32862: result: yes
configure:32866: checking atlantik/ui/board.h presence
configure:32876: i386-pc-linux-gnu-g++ -E  -DQT_THREAD_SUPPORT  -D_REENTRANT -I/usr/kde/3.5/include -I/usr/qt/3/include -I.  -I/usr/include/db4.2 conftest.cc
configure:32882: $? = 0
configure:32902: result: yes
configure:32937: checking for atlantik/ui/board.h
configure:32944: result: yes
configure:32991: checking kaddressbook/xxport.h usability
configure:33003: i386-pc-linux-gnu-g++ -c -Wno-long-long -Wundef -ansi -D_XOPEN_SOURCE=500 -D_BSD_SOURCE -Wcast-align -Wconversion -Wchar-subscripts -Wall -W -Wpointer-arith -DNDEBUG -DNO_DEBUG -O2 -O2 -mcpu=i686 -Wformat-security -Wmissing-format-attribute -Wno-non-virtual-dtor -fno-exceptions -fno-check-new -fno-common -DQT_CLEAN_NAMESPACE -DQT_NO_ASCII_CAST -DQT_NO_STL -DQT_NO_COMPAT -DQT_NO_TRANSLATION  -DQT_THREAD_SUPPORT  -D_REENTRANT -I/usr/kde/3.5/include -I/usr/qt/3/include -I.  -I/usr/include/db4.2 conftest.cc >&5
configure:33009: $? = 0
configure:33013: test -z 
			 || test ! -s conftest.err
configure:33016: $? = 0
configure:33019: test -s conftest.o
configure:33022: $? = 0
configure:33032: result: yes
configure:33036: checking kaddressbook/xxport.h presence
configure:33046: i386-pc-linux-gnu-g++ -E  -DQT_THREAD_SUPPORT  -D_REENTRANT -I/usr/kde/3.5/include -I/usr/qt/3/include -I.  -I/usr/include/db4.2 conftest.cc
configure:33052: $? = 0
configure:33072: result: yes
configure:33107: checking for kaddressbook/xxport.h
configure:33114: result: yes
configure:33162: checking for OpenSSL
configure: 33178: NO/openssl/ssl.h
configure: 33178: /usr/include/openssl/ssl.h
taking that
configure:33225: i386-pc-linux-gnu-gcc -o conftest -std=iso9899:1990 -W -Wall -Wchar-subscripts -Wshadow -Wpointer-arith -Wmissing-prototypes -Wwrite-strings -D_XOPEN_SOURCE=500 -D_BSD_SOURCE -DNDEBUG -O2  -O2 -mcpu=i686 -Wformat-security -Wmissing-format-attribute  -DQT_THREAD_SUPPORT  -D_REENTRANT  -L/usr/lib -L/usr/kde/3.5/lib -L/usr/qt/3/lib -L/usr/lib    conftest.c  -lssl -lcrypto -lRSAglue -lrsaref >&5
/usr/lib/gcc-lib/i386-pc-linux-gnu/3.3.6/../../../../i386-pc-linux-gnu/bin/ld: cannot find -lRSAglue
collect2: ld returned 1 exit status
configure:33231: $? = 1
configure: failed program was:
| /* confdefs.h.  */
| 
| #define PACKAGE_NAME ""
| #define PACKAGE_TARNAME ""
| #define PACKAGE_VERSION ""
| #define PACKAGE_STRING ""
| #define PACKAGE_BUGREPORT ""
| #define PACKAGE "kdeaddons"
| #define VERSION "3.5.2"
| #ifdef __cplusplus
| extern "C" void std::exit (int) throw (); using std::exit;
| #endif
| #define KDELIBSUFF ""
| #define STDC_HEADERS 1
| #define HAVE_SYS_TYPES_H 1
| #define HAVE_SYS_STAT_H 1
| #define HAVE_STDLIB_H 1
| #define HAVE_STRING_H 1
| #define HAVE_MEMORY_H 1
| #define HAVE_STRINGS_H 1
| #define HAVE_INTTYPES_H 1
| #define HAVE_STDINT_H 1
| #define HAVE_UNISTD_H 1
| #define HAVE_DLFCN_H 1
| #define HAVE_SGI_STL 1
| #define HAVE_CRYPT 1
| #define kde_socklen_t socklen_t
| #define ksize_t socklen_t
| #define HAVE_SYS_TYPES_H 1
| #define HAVE_STDINT_H 1
| #define HAVE_SYS_BITYPES_H 1
| #define HAVE_RES_INIT 1
| #define HAVE_RES_INIT 1
| #define HAVE_RES_INIT_PROTO 1
| #define SIZEOF_INT 4
| #define SIZEOF_SHORT 2
| #define SIZEOF_LONG 4
| #define SIZEOF_CHAR_P 4
| #define SIZEOF_SIZE_T 4
| #define SIZEOF_UNSIGNED_LONG 4
| #define HAVE_VSNPRINTF 1
| #define HAVE_SNPRINTF 1
| #define HAVE_LIBZ 1
| #define HAVE_LIBPNG 1
| #define HAVE_LIBJPEG 1
| #define HAVE_LIBPTHREAD 1
| #define HAVE_SETENV 1
| #define HAVE_SETENV_PROTO 1
| /* end confdefs.h.  */
| 
| int
| main ()
| {
| void RSAPrivateEncrypt(void);RSAPrivateEncrypt();
|   ;
|   return 0;
| }
configure:33273: result: libraries /usr/lib, headers /usr/include
configure:33276: checking whether OpenSSL uses rsaref
configure:33278: result: no
configure:33281: checking for easter eggs
configure:33283: result: none found
configure:33291: checking for OpenSSL version
configure:33320: i386-pc-linux-gnu-gcc -o conftest -std=iso9899:1990 -W -Wall -Wchar-subscripts -Wshadow -Wpointer-arith -Wmissing-prototypes -Wwrite-strings -D_XOPEN_SOURCE=500 -D_BSD_SOURCE -DNDEBUG -O2  -O2 -mcpu=i686 -Wformat-security -Wmissing-format-attribute  -DQT_THREAD_SUPPORT  -D_REENTRANT  conftest.c  >&5
configure:33323: $? = 0
configure:33365: result: ok
configure:33442: checking fcntl.h usability
configure:33454: i386-pc-linux-gnu-gcc -c -std=iso9899:1990 -W -Wall -Wchar-subscripts -Wshadow -Wpointer-arith -Wmissing-prototypes -Wwrite-strings -D_XOPEN_SOURCE=500 -D_BSD_SOURCE -DNDEBUG -O2  -O2 -mcpu=i686 -Wformat-security -Wmissing-format-attribute  -DQT_THREAD_SUPPORT  -D_REENTRANT conftest.c >&5
configure:33460: $? = 0
configure:33464: test -z 
			 || test ! -s conftest.err
configure:33467: $? = 0
configure:33470: test -s conftest.o
configure:33473: $? = 0
configure:33483: result: yes
configure:33487: checking fcntl.h presence
configure:33497: i386-pc-linux-gnu-gcc -E  -DQT_THREAD_SUPPORT  -D_REENTRANT conftest.c
configure:33503: $? = 0
configure:33523: result: yes
configure:33558: checking for fcntl.h
configure:33565: result: yes
configure:33578: checking for kstat_open in -lkstat
configure:33608: i386-pc-linux-gnu-gcc -o conftest -std=iso9899:1990 -W -Wall -Wchar-subscripts -Wshadow -Wpointer-arith -Wmissing-prototypes -Wwrite-strings -D_XOPEN_SOURCE=500 -D_BSD_SOURCE -DNDEBUG -O2  -O2 -mcpu=i686 -Wformat-security -Wmissing-format-attribute  -DQT_THREAD_SUPPORT  -D_REENTRANT  conftest.c -lkstat   >&5
/usr/lib/gcc-lib/i386-pc-linux-gnu/3.3.6/../../../../i386-pc-linux-gnu/bin/ld: cannot find -lkstat
collect2: ld returned 1 exit status
configure:33614: $? = 1
configure: failed program was:
| /* confdefs.h.  */
| 
| #define PACKAGE_NAME ""
| #define PACKAGE_TARNAME ""
| #define PACKAGE_VERSION ""
| #define PACKAGE_STRING ""
| #define PACKAGE_BUGREPORT ""
| #define PACKAGE "kdeaddons"
| #define VERSION "3.5.2"
| #ifdef __cplusplus
| extern "C" void std::exit (int) throw (); using std::exit;
| #endif
| #define KDELIBSUFF ""
| #define STDC_HEADERS 1
| #define HAVE_SYS_TYPES_H 1
| #define HAVE_SYS_STAT_H 1
| #define HAVE_STDLIB_H 1
| #define HAVE_STRING_H 1
| #define HAVE_MEMORY_H 1
| #define HAVE_STRINGS_H 1
| #define HAVE_INTTYPES_H 1
| #define HAVE_STDINT_H 1
| #define HAVE_UNISTD_H 1
| #define HAVE_DLFCN_H 1
| #define HAVE_SGI_STL 1
| #define HAVE_CRYPT 1
| #define kde_socklen_t socklen_t
| #define ksize_t socklen_t
| #define HAVE_SYS_TYPES_H 1
| #define HAVE_STDINT_H 1
| #define HAVE_SYS_BITYPES_H 1
| #define HAVE_RES_INIT 1
| #define HAVE_RES_INIT 1
| #define HAVE_RES_INIT_PROTO 1
| #define SIZEOF_INT 4
| #define SIZEOF_SHORT 2
| #define SIZEOF_LONG 4
| #define SIZEOF_CHAR_P 4
| #define SIZEOF_SIZE_T 4
| #define SIZEOF_UNSIGNED_LONG 4
| #define HAVE_VSNPRINTF 1
| #define HAVE_SNPRINTF 1
| #define HAVE_LIBZ 1
| #define HAVE_LIBPNG 1
| #define HAVE_LIBJPEG 1
| #define HAVE_LIBPTHREAD 1
| #define HAVE_SETENV 1
| #define HAVE_SETENV_PROTO 1
| #define HAVE_SSL 1
| #define HAVE_FCNTL_H 1
| /* end confdefs.h.  */
| 
| /* Override any gcc2 internal prototype to avoid an error.  */
| #ifdef __cplusplus
| extern "C"
| #endif
| /* We use char because int might match the return type of a gcc2
|    builtin and then its argument prototype would still apply.  */
| char kstat_open ();
| int
| main ()
| {
| kstat_open ();
|   ;
|   return 0;
| }
configure:33640: result: no
configure:33662: checking for libxmms
configure:33690: i386-pc-linux-gnu-gcc -o conftest -std=iso9899:1990 -W -Wall -Wchar-subscripts -Wshadow -Wpointer-arith -Wmissing-prototypes -Wwrite-strings -D_XOPEN_SOURCE=500 -D_BSD_SOURCE -DNDEBUG -O2  -O2 -mcpu=i686 -Wformat-security -Wmissing-format-attribute  -DQT_THREAD_SUPPORT  -D_REENTRANT -I/usr/kde/3.5/include -I/usr/qt/3/include -I.  -I/usr/include/db4.2 -I/usr/include/xmms -I/usr/include/gtk-1.2 -I/usr/include/glib-1.2 -I/usr/lib/glib/include  -L/usr/kde/3.5/lib -L/usr/qt/3/lib -L/usr/lib    conftest.c -L/usr/lib -lgtk -lgdk -rdynamic -lgmodule -lglib -lXi -lXext -lX11 -lm -lxmms >&5
configure:33696: $? = 0
configure:33700: test -z 
			 || test ! -s conftest.err
configure:33703: $? = 0
configure:33706: test -s conftest
configure:33709: $? = 0
configure:33727: result: yes
configure:33752: checking whether byte ordering is bigendian
configure:33779: i386-pc-linux-gnu-gcc -c -std=iso9899:1990 -W -Wall -Wchar-subscripts -Wshadow -Wpointer-arith -Wmissing-prototypes -Wwrite-strings -D_XOPEN_SOURCE=500 -D_BSD_SOURCE -DNDEBUG -O2  -O2 -mcpu=i686 -Wformat-security -Wmissing-format-attribute  -DQT_THREAD_SUPPORT  -D_REENTRANT conftest.c >&5
configure:33785: $? = 0
configure:33789: test -z 
			 || test ! -s conftest.err
configure:33792: $? = 0
configure:33795: test -s conftest.o
configure:33798: $? = 0
configure:33822: i386-pc-linux-gnu-gcc -c -std=iso9899:1990 -W -Wall -Wchar-subscripts -Wshadow -Wpointer-arith -Wmissing-prototypes -Wwrite-strings -D_XOPEN_SOURCE=500 -D_BSD_SOURCE -DNDEBUG -O2  -O2 -mcpu=i686 -Wformat-security -Wmissing-format-attribute  -DQT_THREAD_SUPPORT  -D_REENTRANT conftest.c >&5
conftest.c: In function `main':
conftest.c:60: error: `not' undeclared (first use in this function)
conftest.c:60: error: (Each undeclared identifier is reported only once
conftest.c:60: error: for each function it appears in.)
conftest.c:60: error: syntax error before "big"
configure:33828: $? = 1
configure: failed program was:
| /* confdefs.h.  */
| 
| #define PACKAGE_NAME ""
| #define PACKAGE_TARNAME ""
| #define PACKAGE_VERSION ""
| #define PACKAGE_STRING ""
| #define PACKAGE_BUGREPORT ""
| #define PACKAGE "kdeaddons"
| #define VERSION "3.5.2"
| #ifdef __cplusplus
| extern "C" void std::exit (int) throw (); using std::exit;
| #endif
| #define KDELIBSUFF ""
| #define STDC_HEADERS 1
| #define HAVE_SYS_TYPES_H 1
| #define HAVE_SYS_STAT_H 1
| #define HAVE_STDLIB_H 1
| #define HAVE_STRING_H 1
| #define HAVE_MEMORY_H 1
| #define HAVE_STRINGS_H 1
| #define HAVE_INTTYPES_H 1
| #define HAVE_STDINT_H 1
| #define HAVE_UNISTD_H 1
| #define HAVE_DLFCN_H 1
| #define HAVE_SGI_STL 1
| #define HAVE_CRYPT 1
| #define kde_socklen_t socklen_t
| #define ksize_t socklen_t
| #define HAVE_SYS_TYPES_H 1
| #define HAVE_STDINT_H 1
| #define HAVE_SYS_BITYPES_H 1
| #define HAVE_RES_INIT 1
| #define HAVE_RES_INIT 1
| #define HAVE_RES_INIT_PROTO 1
| #define SIZEOF_INT 4
| #define SIZEOF_SHORT 2
| #define SIZEOF_LONG 4
| #define SIZEOF_CHAR_P 4
| #define SIZEOF_SIZE_T 4
| #define SIZEOF_UNSIGNED_LONG 4
| #define HAVE_VSNPRINTF 1
| #define HAVE_SNPRINTF 1
| #define HAVE_LIBZ 1
| #define HAVE_LIBPNG 1
| #define HAVE_LIBJPEG 1
| #define HAVE_LIBPTHREAD 1
| #define HAVE_SETENV 1
| #define HAVE_SETENV_PROTO 1
| #define HAVE_SSL 1
| #define HAVE_FCNTL_H 1
| #define HAVE_XMMS 1
| /* end confdefs.h.  */
| #include <sys/types.h>
| #include <sys/param.h>
| 
| int
| main ()
| {
| #if BYTE_ORDER != BIG_ENDIAN
|  not big endian
| #endif
| 
|   ;
|   return 0;
| }
configure:33963: result: no
configure:33983: checking for MAXPATHLEN
configure:34005: i386-pc-linux-gnu-gcc -E  -DQT_THREAD_SUPPORT  -D_REENTRANT conftest.c 2>/dev/null | grep '^KDE_HELLO' >conftest.out
configure:34008: $? = 0
configure:34020: result: 4096
configure:34101: checking for sdl-config
configure:34119: found /usr/bin/sdl-config
configure:34132: result: /usr/bin/sdl-config
configure:34140: checking for SDL - version >= 1.2.0
configure:34230: i386-pc-linux-gnu-gcc -o conftest -std=iso9899:1990 -W -Wall -Wchar-subscripts -Wshadow -Wpointer-arith -Wmissing-prototypes -Wwrite-strings -D_XOPEN_SOURCE=500 -D_BSD_SOURCE -DNDEBUG -O2  -O2 -mcpu=i686 -Wformat-security -Wmissing-format-attribute -I/usr/include/SDL -D_REENTRANT  -DQT_THREAD_SUPPORT  -D_REENTRANT  conftest.c  -lSDL -lpthread >&5
conftest.c:62: warning: no previous prototype for `my_strdup'
conftest.c: In function `main':
conftest.c:87: warning: passing arg 1 of `my_strdup' discards qualifiers from pointer target type
conftest.c:76: warning: unused parameter `argc'
conftest.c:76: warning: unused parameter `argv'
/usr/lib/gcc-lib/i386-pc-linux-gnu/3.3.6/../../../../i386-pc-linux-gnu/bin/ld: warning: libdirectfb-0.9.so.22, needed by /usr/lib/gcc-lib/i386-pc-linux-gnu/3.3.6/../../../libSDL.so, not found (try using -rpath or -rpath-link)
/usr/lib/gcc-lib/i386-pc-linux-gnu/3.3.6/../../../../i386-pc-linux-gnu/bin/ld: warning: libfusion-0.9.so.22, needed by /usr/lib/gcc-lib/i386-pc-linux-gnu/3.3.6/../../../libSDL.so, not found (try using -rpath or -rpath-link)
/usr/lib/gcc-lib/i386-pc-linux-gnu/3.3.6/../../../../i386-pc-linux-gnu/bin/ld: warning: libdirect-0.9.so.22, needed by /usr/lib/gcc-lib/i386-pc-linux-gnu/3.3.6/../../../libSDL.so, not found (try using -rpath or -rpath-link)
/usr/lib/gcc-lib/i386-pc-linux-gnu/3.3.6/../../../libSDL.so: undefined reference to `DirectFBCreate'
/usr/lib/gcc-lib/i386-pc-linux-gnu/3.3.6/../../../libSDL.so: undefined reference to `DirectFBErrorString'
/usr/lib/gcc-lib/i386-pc-linux-gnu/3.3.6/../../../libSDL.so: undefined reference to `DirectFBError'
/usr/lib/gcc-lib/i386-pc-linux-gnu/3.3.6/../../../libSDL.so: undefined reference to `DirectFBInit'
collect2: ld returned 1 exit status
configure:34233: $? = 1
configure: program exited with status 1
configure: failed program was:
| /* confdefs.h.  */
| 
| #define PACKAGE_NAME ""
| #define PACKAGE_TARNAME ""
| #define PACKAGE_VERSION ""
| #define PACKAGE_STRING ""
| #define PACKAGE_BUGREPORT ""
| #define PACKAGE "kdeaddons"
| #define VERSION "3.5.2"
| #ifdef __cplusplus
| extern "C" void std::exit (int) throw (); using std::exit;
| #endif
| #define KDELIBSUFF ""
| #define STDC_HEADERS 1
| #define HAVE_SYS_TYPES_H 1
| #define HAVE_SYS_STAT_H 1
| #define HAVE_STDLIB_H 1
| #define HAVE_STRING_H 1
| #define HAVE_MEMORY_H 1
| #define HAVE_STRINGS_H 1
| #define HAVE_INTTYPES_H 1
| #define HAVE_STDINT_H 1
| #define HAVE_UNISTD_H 1
| #define HAVE_DLFCN_H 1
| #define HAVE_SGI_STL 1
| #define HAVE_CRYPT 1
| #define kde_socklen_t socklen_t
| #define ksize_t socklen_t
| #define HAVE_SYS_TYPES_H 1
| #define HAVE_STDINT_H 1
| #define HAVE_SYS_BITYPES_H 1
| #define HAVE_RES_INIT 1
| #define HAVE_RES_INIT 1
| #define HAVE_RES_INIT_PROTO 1
| #define SIZEOF_INT 4
| #define SIZEOF_SHORT 2
| #define SIZEOF_LONG 4
| #define SIZEOF_CHAR_P 4
| #define SIZEOF_SIZE_T 4
| #define SIZEOF_UNSIGNED_LONG 4
| #define HAVE_VSNPRINTF 1
| #define HAVE_SNPRINTF 1
| #define HAVE_LIBZ 1
| #define HAVE_LIBPNG 1
| #define HAVE_LIBJPEG 1
| #define HAVE_LIBPTHREAD 1
| #define HAVE_SETENV 1
| #define HAVE_SETENV_PROTO 1
| #define HAVE_SSL 1
| #define HAVE_FCNTL_H 1
| #define HAVE_XMMS 1
| #define KDEMAXPATHLEN 4096
| /* end confdefs.h.  */
| 
| #include <stdio.h>
| #include <stdlib.h>
| #include <string.h>
| #include "SDL.h"
| 
| char*
| my_strdup (char *str)
| {
|   char *new_str;
| 
|   if (str)
|     {
|       new_str = (char *)malloc ((strlen (str) + 1) * sizeof(char));
|       strcpy (new_str, str);
|     }
|   else
|     new_str = NULL;
| 
|   return new_str;
| }
| 
| int main (int argc, char *argv[])
| {
|   int major, minor, micro;
|   char *tmp_version;
| 
|   /* This hangs on some systems (?)
|   system ("touch conf.sdltest");
|   */
|   { FILE *fp = fopen("conf.sdltest", "a"); if ( fp ) fclose(fp); }
| 
|   /* HP/UX 9 (%@#!) writes to sscanf strings */
|   tmp_version = my_strdup("1.2.0");
|   if (sscanf(tmp_version, "%d.%d.%d", &major, &minor, &micro) != 3) {
|      printf("%s, bad version string\n", "1.2.0");
|      exit(1);
|    }
| 
|    if ((1 > major) ||
|       ((1 == major) && (2 > minor)) ||
|       ((1 == major) && (2 == minor) && (8 >= micro)))
|     {
|       return 0;
|     }
|   else
|     {
|       printf("\n*** 'sdl-config --version' returned %d.%d.%d, but the minimum version\n", 1, 2, 8);
|       printf("*** of SDL required is %d.%d.%d. If sdl-config is correct, then it is\n", major, minor, micro);
|       printf("*** best to upgrade to the required version.\n");
|       printf("*** If sdl-config was wrong, set the environment variable SDL_CONFIG\n");
|       printf("*** to point to the correct copy of sdl-config, and remove the file\n");
|       printf("*** config.cache before re-running configure\n");
|       return 1;
|     }
| }
| 
| 
configure:34260: result: no
configure:34293: i386-pc-linux-gnu-gcc -o conftest -std=iso9899:1990 -W -Wall -Wchar-subscripts -Wshadow -Wpointer-arith -Wmissing-prototypes -Wwrite-strings -D_XOPEN_SOURCE=500 -D_BSD_SOURCE -DNDEBUG -O2  -O2 -mcpu=i686 -Wformat-security -Wmissing-format-attribute -I/usr/include/SDL -D_REENTRANT  -DQT_THREAD_SUPPORT  -D_REENTRANT  conftest.c  -lSDL -lpthread >&5
/usr/lib/gcc-lib/i386-pc-linux-gnu/3.3.6/../../../../i386-pc-linux-gnu/bin/ld: warning: libdirectfb-0.9.so.22, needed by /usr/lib/gcc-lib/i386-pc-linux-gnu/3.3.6/../../../libSDL.so, not found (try using -rpath or -rpath-link)
/usr/lib/gcc-lib/i386-pc-linux-gnu/3.3.6/../../../../i386-pc-linux-gnu/bin/ld: warning: libfusion-0.9.so.22, needed by /usr/lib/gcc-lib/i386-pc-linux-gnu/3.3.6/../../../libSDL.so, not found (try using -rpath or -rpath-link)
/usr/lib/gcc-lib/i386-pc-linux-gnu/3.3.6/../../../../i386-pc-linux-gnu/bin/ld: warning: libdirect-0.9.so.22, needed by /usr/lib/gcc-lib/i386-pc-linux-gnu/3.3.6/../../../libSDL.so, not found (try using -rpath or -rpath-link)
/usr/lib/gcc-lib/i386-pc-linux-gnu/3.3.6/../../../libSDL.so: undefined reference to `DirectFBCreate'
/usr/lib/gcc-lib/i386-pc-linux-gnu/3.3.6/../../../libSDL.so: undefined reference to `DirectFBErrorString'
/usr/lib/gcc-lib/i386-pc-linux-gnu/3.3.6/../../../libSDL.so: undefined reference to `DirectFBError'
/usr/lib/gcc-lib/i386-pc-linux-gnu/3.3.6/../../../libSDL.so: undefined reference to `DirectFBInit'
collect2: ld returned 1 exit status
configure:34299: $? = 1
configure: failed program was:
| /* confdefs.h.  */
| 
| #define PACKAGE_NAME ""
| #define PACKAGE_TARNAME ""
| #define PACKAGE_VERSION ""
| #define PACKAGE_STRING ""
| #define PACKAGE_BUGREPORT ""
| #define PACKAGE "kdeaddons"
| #define VERSION "3.5.2"
| #ifdef __cplusplus
| extern "C" void std::exit (int) throw (); using std::exit;
| #endif
| #define KDELIBSUFF ""
| #define STDC_HEADERS 1
| #define HAVE_SYS_TYPES_H 1
| #define HAVE_SYS_STAT_H 1
| #define HAVE_STDLIB_H 1
| #define HAVE_STRING_H 1
| #define HAVE_MEMORY_H 1
| #define HAVE_STRINGS_H 1
| #define HAVE_INTTYPES_H 1
| #define HAVE_STDINT_H 1
| #define HAVE_UNISTD_H 1
| #define HAVE_DLFCN_H 1
| #define HAVE_SGI_STL 1
| #define HAVE_CRYPT 1
| #define kde_socklen_t socklen_t
| #define ksize_t socklen_t
| #define HAVE_SYS_TYPES_H 1
| #define HAVE_STDINT_H 1
| #define HAVE_SYS_BITYPES_H 1
| #define HAVE_RES_INIT 1
| #define HAVE_RES_INIT 1
| #define HAVE_RES_INIT_PROTO 1
| #define SIZEOF_INT 4
| #define SIZEOF_SHORT 2
| #define SIZEOF_LONG 4
| #define SIZEOF_CHAR_P 4
| #define SIZEOF_SIZE_T 4
| #define SIZEOF_UNSIGNED_LONG 4
| #define HAVE_VSNPRINTF 1
| #define HAVE_SNPRINTF 1
| #define HAVE_LIBZ 1
| #define HAVE_LIBPNG 1
| #define HAVE_LIBJPEG 1
| #define HAVE_LIBPTHREAD 1
| #define HAVE_SETENV 1
| #define HAVE_SETENV_PROTO 1
| #define HAVE_SSL 1
| #define HAVE_FCNTL_H 1
| #define HAVE_XMMS 1
| #define KDEMAXPATHLEN 4096
| /* end confdefs.h.  */
| 
| #include <stdio.h>
| #include "SDL.h"
| 
| int
| main ()
| {
|  return 0;
|   ;
|   return 0;
| }
configure:34348: error: --with-sdl was given, but test for SDL failed

## ---------------- ##
## Cache variables. ##
## ---------------- ##

ac_cv_build=i386-pc-linux-gnu
ac_cv_build_alias=i386-pc-linux-gnu
ac_cv_c_bigendian=no
ac_cv_c_compiler_gnu=yes
ac_cv_cxx_compiler_gnu=yes
ac_cv_env_CC_set=
ac_cv_env_CC_value=
ac_cv_env_CFLAGS_set=set
ac_cv_env_CFLAGS_value='-O2 -mcpu=i686'
ac_cv_env_CPPFLAGS_set=
ac_cv_env_CPPFLAGS_value=
ac_cv_env_CPP_set=
ac_cv_env_CPP_value=
ac_cv_env_CXXCPP_set=
ac_cv_env_CXXCPP_value=
ac_cv_env_CXXFLAGS_set=set
ac_cv_env_CXXFLAGS_value='-O2 -mcpu=i686'
ac_cv_env_CXX_set=
ac_cv_env_CXX_value=
ac_cv_env_F77_set=
ac_cv_env_F77_value=
ac_cv_env_FFLAGS_set=
ac_cv_env_FFLAGS_value=
ac_cv_env_LDFLAGS_set=
ac_cv_env_LDFLAGS_value=
ac_cv_env_build_alias_set=set
ac_cv_env_build_alias_value=i386-pc-linux-gnu
ac_cv_env_host_alias_set=set
ac_cv_env_host_alias_value=i386-pc-linux-gnu
ac_cv_env_target_alias_set=
ac_cv_env_target_alias_value=
ac_cv_exeext=
ac_cv_f77_compiler_gnu=yes
ac_cv_func__NSGetEnviron=no
ac_cv_func_connect=yes
ac_cv_func_dlopen=no
ac_cv_func_inet_ntoa=yes
ac_cv_func_remove=yes
ac_cv_func_shl_load=no
ac_cv_func_shmat=yes
ac_cv_func_snprintf=yes
ac_cv_func_vsnprintf=yes
ac_cv_have_dlfcn=yes
ac_cv_have_kde='have_kde=yes     ac_kde_includes=/usr/kde/3.5/include ac_kde_libraries=/usr/kde/3.5/lib'
ac_cv_have_qt='have_qt=yes     ac_qt_includes=/usr/qt/3/include ac_qt_libraries=/usr/qt/3/lib'
ac_cv_have_ssl='have_ssl=yes     ac_ssl_includes=/usr/include ac_ssl_libraries=/usr/lib ac_ssl_rsaref=no'
ac_cv_have_xmms=yes
ac_cv_header_Carbon_Carbon_h=no
ac_cv_header_CoreAudio_CoreAudio_h=no
ac_cv_header_atlantik_ui_board_h=yes
ac_cv_header_crt_externs_h=no
ac_cv_header_dlfcn_h=yes
ac_cv_header_fcntl_h=yes
ac_cv_header_inttypes_h=yes
ac_cv_header_kaddressbook_xxport_h=yes
ac_cv_header_memory_h=yes
ac_cv_header_stdc=yes
ac_cv_header_stdint_h=yes
ac_cv_header_stdlib_h=yes
ac_cv_header_string_h=yes
ac_cv_header_strings_h=yes
ac_cv_header_sys_bitypes_h=yes
ac_cv_header_sys_stat_h=yes
ac_cv_header_sys_types_h=yes
ac_cv_header_unistd_h=yes
ac_cv_host=i386-pc-linux-gnu
ac_cv_host_alias=i386-pc-linux-gnu
ac_cv_lib_ICE_IceConnectionNumber=yes
ac_cv_lib_compat_main=no
ac_cv_lib_crypt_crypt=yes
ac_cv_lib_dl_dlopen=yes
ac_cv_lib_dld_shl_load=no
ac_cv_lib_dld_shl_unload=no
ac_cv_lib_dnet_dnet_ntoa=no
ac_cv_lib_dnet_stub_dnet_ntoa=no
ac_cv_lib_jpeg_6b=no
ac_cv_lib_jpeg_normal=-ljpeg
ac_cv_lib_kstat_kstat_open=no
ac_cv_lib_png='-lpng -lz -lm'
ac_cv_lib_poll_poll=no
ac_cv_lib_pthread_pthread_create=yes
ac_cv_lib_ucb_killpg=no
ac_cv_lib_util_main=yes
ac_cv_lib_z=-lz
ac_cv_maxpathlen=4096
ac_cv_objext=o
ac_cv_path_GMSGFMT=/usr/bin/gmsgfmt
ac_cv_path_MSGFMT=/usr/bin/msgfmt
ac_cv_path_SDL_CONFIG=/usr/bin/sdl-config
ac_cv_path_XGETTEXT=/usr/bin/xgettext
ac_cv_path_install='/bin/install -c'
ac_cv_prog_AR=i386-pc-linux-gnu-ar
ac_cv_prog_AWK=gawk
ac_cv_prog_CC=i386-pc-linux-gnu-gcc
ac_cv_prog_CPP='i386-pc-linux-gnu-gcc -E'
ac_cv_prog_CXX=i386-pc-linux-gnu-g++
ac_cv_prog_CXXCPP='i386-pc-linux-gnu-g++ -E'
ac_cv_prog_F77=i386-pc-linux-gnu-g77
ac_cv_prog_RANLIB=i386-pc-linux-gnu-ranlib
ac_cv_prog_STRIP=i386-pc-linux-gnu-strip
ac_cv_prog_cc_g=yes
ac_cv_prog_cc_stdc=
ac_cv_prog_cxx_g=yes
ac_cv_prog_egrep='grep -E'
ac_cv_prog_f77_g=yes
ac_cv_prog_make_make_set=yes
ac_cv_sizeof_char_p=4
ac_cv_sizeof_int=4
ac_cv_sizeof_long=4
ac_cv_sizeof_short=2
ac_cv_sizeof_size_t=4
ac_cv_sizeof_unsigned_long=4
ac_cv_ssl_version=ssl_version=ok
ac_cv_target=i386-pc-linux-gnu
ac_cv_target_alias=i386-pc-linux-gnu
ac_cv_type_char_p=yes
ac_cv_type_int=yes
ac_cv_type_long=yes
ac_cv_type_short=yes
ac_cv_type_size_t=yes
ac_cv_type_unsigned_long=yes
am_cv_CC_dependencies_compiler_type=none
am_cv_CXX_dependencies_compiler_type=none
kde_cv_all_paths='kde_have_all_paths="yes" 	kde_htmldir="\${datadir}/doc/HTML" 	kde_appsdir="\${datadir}/applnk" 	kde_icondir="\${datadir}/icons" 	kde_sounddir="\${datadir}/sounds" 	kde_datadir="\${datadir}/apps" 	kde_locale="\${datadir}/locale" 	kde_cgidir="\${exec_prefix}/cgi-bin" 	kde_confdir="\${datadir}/config" 	kde_kcfgdir="\${datadir}/config.kcfg" 	kde_mimedir="\${datadir}/mimelnk" 	kde_toolbardir="\${datadir}/toolbar" 	kde_wallpaperdir="\${datadir}/wallpapers" 	kde_templatesdir="\${datadir}/templates" 	kde_bindir="\${exec_prefix}/bin" 	kde_servicesdir="\${datadir}/services" 	kde_servicetypesdir="\${datadir}/servicetypes" 	kde_moduledir="\${libdir}/kde3" 	kde_styledir="\${libdir}/kde3/plugins/styles" 	kde_widgetdir="/usr/kde/3.5/lib/kde3/plugins/designer" 	xdg_appsdir="\${datadir}/applications/kde" 	xdg_menudir="\${sysconfdir}/xdg/menus" 	xdg_directorydir="\${datadir}/desktop-directories" 	kde_result=defaults'
kde_cv_func_res_init=yes
kde_cv_func_setenv=yes
kde_cv_func_strlcat=no
kde_cv_func_strlcpy=no
kde_cv_have_libXext=yes
kde_cv_have_x='have_x=yes          kde_x_includes=. kde_x_libraries=/usr/lib'
kde_cv_opt_noinline_match=irrelevant
kde_cv_path=/usr/bin/xmllint
kde_cv_path_artsc_config=/usr/kde/3.5/bin/artsc-config
kde_cv_path_dcopidl=/usr/kde/3.5/bin/dcopidl
kde_cv_path_dcopidl2cpp=/usr/kde/3.5/bin/dcopidl2cpp
kde_cv_path_dcopidlng=/usr/kde/3.5/bin/dcopidlng
kde_cv_path_kconfig_compiler=/usr/kde/3.5/bin/kconfig_compiler
kde_cv_path_kde_config=/usr/kde/3.5/bin/kde-config
kde_cv_path_makekdewidgets=/usr/kde/3.5/bin/makekdewidgets
kde_cv_path_mcopidl=/usr/kde/3.5/bin/mcopidl
kde_cv_path_meinproc=/usr/kde/3.5/bin/meinproc
kde_cv_path_moc=/usr/qt/3/bin/moc
kde_cv_path_perl=/usr/bin/perl
kde_cv_path_uic=/usr/qt/3/bin/uic
kde_cv_path_xmllint=/usr/bin/xmllint
kde_cv_prog_cc_Wmissing_format_attribute=yes
kde_cv_prog_cxx_O0=yes
kde_cv_prog_cxx_Wl___allow_shlib_undefined=yes
kde_cv_prog_cxx_Wl___no_undefined=yes
kde_cv_prog_cxx_Wmissing_format_attribute=yes
kde_cv_prog_cxx_Wno_long_long=yes
kde_cv_prog_cxx_Wno_non_virtual_dtor=yes
kde_cv_prog_cxx_Wundef=yes
kde_cv_prog_cxx_fexceptions=yes
kde_cv_prog_cxx_fno_check_new=yes
kde_cv_prog_cxx_fno_common=yes
kde_cv_prog_cxx_fno_exceptions=yes
kde_cv_prog_cxx_fno_reorder_blocks=yes
kde_cv_prog_cxx_fvisibility_hidden=no
kde_cv_prog_uic_L=yes
kde_cv_prog_uic_nounload=yes
kde_cv_proto_res_init=no
kde_cv_proto_setenv=no
kde_cv_proto_strlcat='yes - in libkdefakes'
kde_cv_proto_strlcpy='yes - in libkdefakes'
kde_cv_qt_jpeg=no
kde_cv_socklen_t=yes
kde_cv_socklen_t_equiv=socklen_t
kde_cv_stl_works=yes
kde_cv_uic_plugins=yes
kde_cv_val_pie_support=yes
lt_cv_deplibs_check_method=pass_all
lt_cv_dlopen=dlopen
lt_cv_dlopen_libs=-ldl
lt_cv_dlopen_self=yes
lt_cv_dlopen_self_static=yes
lt_cv_file_magic_cmd='$MAGIC_CMD'
lt_cv_file_magic_test_file='/lib/libc.so.6 /lib/libc-2.3.6.so'
lt_cv_ld_reload_flag=-r
lt_cv_objdir=.libs
lt_cv_path_LD=/usr/i386-pc-linux-gnu/bin/ld
lt_cv_path_LDCXX=/usr/i386-pc-linux-gnu/bin/ld
lt_cv_path_NM='/usr/bin/i386-pc-linux-gnu-nm -B'
lt_cv_path_SED=/bin/sed
lt_cv_prog_compiler_c_o=yes
lt_cv_prog_compiler_c_o_CXX=yes
lt_cv_prog_compiler_c_o_F77=yes
lt_cv_prog_compiler_rtti_exceptions=no
lt_cv_prog_gnu_ld=yes
lt_cv_prog_gnu_ldcxx=yes
lt_cv_sys_global_symbol_pipe='sed -n -e '\''s/^.*[ 	]\([ABCDGISTW][ABCDGISTW]*\)[ 	][ 	]*\(\)\([_A-Za-z][_A-Za-z0-9]*\)$/\1 \2\3 \3/p'\'''
lt_cv_sys_global_symbol_to_c_name_address='sed -n -e '\''s/^: \([^ ]*\) $/  {\"\1\", (lt_ptr) 0},/p'\'' -e '\''s/^[BCDEGRST] \([^ ]*\) \([^ ]*\)$/  {"\2", (lt_ptr) \&\2},/p'\'''
lt_cv_sys_global_symbol_to_cdecl='sed -n -e '\''s/^. .* \(.*\)$/extern int \1;/p'\'''
lt_cv_sys_max_cmd_len=32768
lt_lt_cv_prog_compiler_c_o='"yes"'
lt_lt_cv_prog_compiler_c_o_CXX='"yes"'
lt_lt_cv_prog_compiler_c_o_F77='"yes"'
lt_lt_cv_sys_global_symbol_pipe='"sed -n -e '\''s/^.*[ 	]\\([ABCDGISTW][ABCDGISTW]*\\)[ 	][ 	]*\\(\\)\\([_A-Za-z][_A-Za-z0-9]*\\)\$/\\1 \\2\\3 \\3/p'\''"'
lt_lt_cv_sys_global_symbol_to_c_name_address='"sed -n -e '\''s/^: \\([^ ]*\\) \$/  {\\\"\\1\\\", (lt_ptr) 0},/p'\'' -e '\''s/^[BCDEGRST] \\([^ ]*\\) \\([^ ]*\\)\$/  {\"\\2\", (lt_ptr) \\&\\2},/p'\''"'
lt_lt_cv_sys_global_symbol_to_cdecl='"sed -n -e '\''s/^. .* \\(.*\\)\$/extern int \\1;/p'\''"'

## ----------------- ##
## Output variables. ##
## ----------------- ##

ACLOCAL='${SHELL} /var/tmp/portage/kdeaddons-3.5.2-r1/work/kdeaddons-3.5.2/admin/missing --run aclocal-1.9'
AMDEPBACKSLASH=''
AMDEP_FALSE=''
AMDEP_TRUE='#'
AMTAR='${SHELL} /var/tmp/portage/kdeaddons-3.5.2-r1/work/kdeaddons-3.5.2/admin/missing --run tar'
AR='i386-pc-linux-gnu-ar'
ARTSCCONFIG='/usr/kde/3.5/bin/artsc-config'
AUTOCONF='$(SHELL) $(top_srcdir)/admin/cvs.sh configure || touch configure'
AUTODIRS=''
AUTOHEADER='${SHELL} /var/tmp/portage/kdeaddons-3.5.2-r1/work/kdeaddons-3.5.2/admin/missing --run autoheader'
AUTOMAKE='${SHELL} /var/tmp/portage/kdeaddons-3.5.2-r1/work/kdeaddons-3.5.2/admin/missing --run automake-1.9'
AWK='gawk'
BERKELEY_DB_LIBS=''
CC='i386-pc-linux-gnu-gcc'
CCDEPMODE='depmode=none'
CFLAGS='-std=iso9899:1990 -W -Wall -Wchar-subscripts -Wshadow -Wpointer-arith -Wmissing-prototypes -Wwrite-strings -D_XOPEN_SOURCE=500 -D_BSD_SOURCE -DNDEBUG -O2  -O2 -mcpu=i686 -Wformat-security -Wmissing-format-attribute'
CONF_FILES=' $(top_srcdir)/./admin/configure.in.min $(top_srcdir)/configure.in.in $(top_srcdir)/./atlantikdesigner/configure.in.bot $(top_srcdir)/./atlantikdesigner/configure.in.in $(top_srcdir)/./kaddressbook-plugins/configure.in.in $(top_srcdir)/./kfile-plugins/cert/configure.in.in $(top_srcdir)/./kicker-applets/ktimemon/configure.in.in $(top_srcdir)/./kicker-applets/mediacontrol/configure.in.in $(top_srcdir)/./konq-plugins/sidebar/metabar/configure.in.in $(top_srcdir)/./noatun-plugins/configure.in.bot $(top_srcdir)/./noatun-plugins/configure.in.in $(top_srcdir)/./noatun-plugins/dub/configure.in.in $(top_srcdir)/./noatun-plugins/oblique/configure.in.in'
CPP='i386-pc-linux-gnu-gcc -E'
CPPFLAGS=' -DQT_THREAD_SUPPORT  -D_REENTRANT'
CXX='i386-pc-linux-gnu-g++'
CXXCPP='i386-pc-linux-gnu-g++ -E'
CXXDEPMODE='depmode=none'
CXXFLAGS='-Wno-long-long -Wundef -ansi -D_XOPEN_SOURCE=500 -D_BSD_SOURCE -Wcast-align -Wconversion -Wchar-subscripts -Wall -W -Wpointer-arith -DNDEBUG -DNO_DEBUG -O2 -O2 -mcpu=i686 -Wformat-security -Wmissing-format-attribute -Wno-non-virtual-dtor -fno-exceptions -fno-check-new -fno-common -DQT_CLEAN_NAMESPACE -DQT_NO_ASCII_CAST -DQT_NO_STL -DQT_NO_COMPAT -DQT_NO_TRANSLATION'
CYGPATH_W='echo'
DCOPIDL2CPP='/usr/kde/3.5/bin/dcopidl2cpp'
DCOPIDL='/usr/kde/3.5/bin/dcopidl'
DCOPIDLNG='/usr/kde/3.5/bin/dcopidlng'
DCOP_DEPENDENCIES='$(DCOPIDL) $(DCOPIDLNG)'
DEFS=''
DEPDIR='.deps'
ECHO='echo'
ECHO_C=''
ECHO_N='-n'
ECHO_T=''
EGREP='grep -E'
ENABLE_PERMISSIVE_FLAG='-fpermissive'
EXEEXT=''
F77='i386-pc-linux-gnu-g77'
FFLAGS='-g -O2'
FRAMEWORK_COREAUDIO=''
GMSGFMT='/usr/bin/gmsgfmt'
HAVE_GCC_VISIBILITY='0'
INSTALL_DATA='${INSTALL} -m 644'
INSTALL_PROGRAM='${INSTALL} $(INSTALL_STRIP_FLAG)'
INSTALL_SCRIPT='${INSTALL}'
INSTALL_STRIP_PROGRAM='${SHELL} $(install_sh) -c -s'
KCFG_DEPENDENCIES='$(KCONFIG_COMPILER)'
KCONFIG_COMPILER='/usr/kde/3.5/bin/kconfig_compiler'
KDECONFIG='/usr/kde/3.5/bin/kde-config'
KDE_CHECK_PLUGIN='$(KDE_PLUGIN) -rpath $(libdir)'
KDE_EXTRA_RPATH=''
KDE_INCLUDES='-I/usr/kde/3.5/include'
KDE_LDFLAGS='-L/usr/kde/3.5/lib'
KDE_MT_LDFLAGS=''
KDE_MT_LIBS='-lpthread'
KDE_NO_UNDEFINED='-Wl,--no-undefined -Wl,--allow-shlib-undefined'
KDE_PLUGIN='-avoid-version -module -no-undefined $(KDE_NO_UNDEFINED) $(KDE_RPATH) $(KDE_MT_LDFLAGS)'
KDE_RPATH='-R $(libdir) -R $(kde_libraries) -R $(qt_libraries) -R $(x_libraries)'
KDE_USE_CLOSURE_FALSE=''
KDE_USE_CLOSURE_TRUE='#'
KDE_USE_FINAL_FALSE=''
KDE_USE_FINAL_TRUE='#'
KDE_USE_FPIE='-fPIE'
KDE_USE_NMCHECK_FALSE=''
KDE_USE_NMCHECK_TRUE='#'
KDE_USE_PIE='-pie'
KDE_XSL_STYLESHEET='/usr/kde/3.5/share/apps/ksgmltools2/customization/kde-chunk.xsl'
LDFLAGS=''
LDFLAGS_AS_NEEDED=''
LDFLAGS_NEW_DTAGS=''
LIBCOMPAT=''
LIBCRYPT='-lcrypt'
LIBDL='-ldl'
LIBJPEG='-ljpeg'
LIBKSTAT=''
LIBOBJS=''
LIBPNG='-lpng -lz -lm'
LIBPTHREAD='-lpthread'
LIBRESOLV='-lresolv'
LIBS=''
LIBSM='-lSM -lICE'
LIBSOCKET=''
LIBSSL='-lssl -lcrypto'
LIBTOOL='$(SHELL) $(top_builddir)/libtool --silent'
LIBUCB=''
LIBUTIL='-lutil'
LIBZ='-lz'
LIB_KAB='-lkab'
LIB_KABC='-lkabc'
LIB_KDECORE='-lkdecore'
LIB_KDED=''
LIB_KDEPIM='-lkdepim'
LIB_KDEPRINT='-lkdeprint'
LIB_KDEUI='-lkdeui'
LIB_KDNSSD='-lkdnssd'
LIB_KFILE='-lkio'
LIB_KFM=''
LIB_KHTML='-lkhtml'
LIB_KIMPROXY='-lkimproxy'
LIB_KIO='-lkio'
LIB_KJS='-lkjs'
LIB_KNEWSTUFF='-lknewstuff'
LIB_KPARTS='-lkparts'
LIB_KSPELL='-lkspell'
LIB_KSYCOCA='-lkio'
LIB_KUNITTEST='-lkunittest'
LIB_KUTILS='-lkutils'
LIB_POLL=''
LIB_QPE=''
LIB_QT='-lqt-mt  $(LIBZ) $(LIBPNG) -lXext $(LIB_X11) $(LIBSM) -lpthread'
LIB_SMB='-lsmb'
LIB_X11='-lX11 $(LIBSOCKET)'
LIB_XEXT='-lXext'
LIB_XRENDER=''
LN_S='ln -s'
LTLIBOBJS=''
MAKEINFO='${SHELL} /var/tmp/portage/kdeaddons-3.5.2-r1/work/kdeaddons-3.5.2/admin/missing --run makeinfo'
MAKEKDEWIDGETS='/usr/kde/3.5/bin/makekdewidgets'
MCOPIDL='/usr/kde/3.5/bin/mcopidl'
MEINPROC='/usr/kde/3.5/bin/meinproc'
MOC='/usr/qt/3/bin/moc'
MSGFMT='/usr/bin/gmsgfmt'
NOOPT_CFLAGS='-O0'
NOOPT_CXXFLAGS='-O0'
OBJEXT='o'
PACKAGE='kdeaddons'
PACKAGE_BUGREPORT=''
PACKAGE_NAME=''
PACKAGE_STRING=''
PACKAGE_TARNAME=''
PACKAGE_VERSION=''
PATH_SEPARATOR=':'
PERL='/usr/bin/perl'
QTE_NORTTI=''
QT_INCLUDES='-I/usr/qt/3/include'
QT_LDFLAGS='-L/usr/qt/3/lib'
RANLIB='i386-pc-linux-gnu-ranlib'
SDL_CFLAGS=''
SDL_CONFIG='/usr/bin/sdl-config'
SDL_LIBS=''
SET_MAKE=''
SHELL='/bin/sh'
SSL_INCLUDES=''
SSL_LDFLAGS=''
STRIP='i386-pc-linux-gnu-strip'
TOPSUBDIRS=''
UIC='/usr/qt/3/bin/uic -L $(kde_widgetdir) -nounload'
UIC_TR='tr2i18n'
USER_INCLUDES=' -I/usr/include/db4.2'
USER_LDFLAGS=''
USE_EXCEPTIONS='-fexceptions'
USE_RTTI=''
USE_THREADS=''
VERSION='3.5.2'
WOVERLOADED_VIRTUAL=''
XGETTEXT='/usr/bin/xgettext'
XMLLINT='/usr/bin/xmllint'
XMMS_INCLUDES='-I/usr/include/xmms -I/usr/include/gtk-1.2 -I/usr/include/glib-1.2 -I/usr/lib/glib/include'
XMMS_LIBS='-L/usr/lib -lgtk -lgdk -rdynamic -lgmodule -lglib -lXi -lXext -lX11 -lm -lxmms'
X_EXTRA_LIBS=''
X_INCLUDES='-I.'
X_LDFLAGS='-L/usr/lib'
X_PRE_LIBS=''
X_RPATH='-R $(x_libraries)'
ac_ct_AR=''
ac_ct_CC=''
ac_ct_CXX=''
ac_ct_F77=''
ac_ct_RANLIB=''
ac_ct_STRIP=''
all_includes='-I/usr/kde/3.5/include -I/usr/qt/3/include -I.  -I/usr/include/db4.2'
all_libraries='-L/usr/kde/3.5/lib -L/usr/qt/3/lib -L/usr/lib   '
am__fastdepCC_FALSE=''
am__fastdepCC_TRUE='#'
am__fastdepCXX_FALSE=''
am__fastdepCXX_TRUE='#'
am__include='include'
am__leading_dot='.'
am__quote=''
am__tar='${AMTAR} chof - "$$tardir"'
am__untar='${AMTAR} xf -'
atlantikdesigner_SUBDIR_included_FALSE=''
atlantikdesigner_SUBDIR_included_TRUE=''
bindir='${exec_prefix}/bin'
build='i386-pc-linux-gnu'
build_alias='i386-pc-linux-gnu'
build_cpu='i386'
build_os='linux-gnu'
build_vendor='pc'
datadir='/usr/kde/3.5/share'
doc_SUBDIR_included_FALSE=''
doc_SUBDIR_included_TRUE=''
exec_prefix='NONE'
host='i386-pc-linux-gnu'
host_alias='i386-pc-linux-gnu'
host_cpu='i386'
host_os='linux-gnu'
host_vendor='pc'
include_ARTS_FALSE='#'
include_ARTS_TRUE=''
include_BERKELEY_DB_FALSE=''
include_BERKELEY_DB_TRUE=''
include_SDL_FALSE=''
include_SDL_TRUE=''
include_kfileplugin_cert_SUBDIR_FALSE='#'
include_kfileplugin_cert_SUBDIR_TRUE=''
include_noatunplugin_FALSE='#'
include_noatunplugin_TRUE=''
include_x11_FALSE='#'
include_x11_TRUE=''
includedir='${prefix}/include'
infodir='/usr/kde/3.5/share/info'
install_sh='/var/tmp/portage/kdeaddons-3.5.2-r1/work/kdeaddons-3.5.2/admin/install-sh'
kaddressbook_plugins_SUBDIR_included_FALSE=''
kaddressbook_plugins_SUBDIR_included_TRUE=''
kate_SUBDIR_included_FALSE=''
kate_SUBDIR_included_TRUE=''
kde_appsdir='${datadir}/applnk'
kde_bindir='${exec_prefix}/bin'
kde_confdir='${datadir}/config'
kde_datadir='${datadir}/apps'
kde_htmldir='${datadir}/doc/HTML'
kde_icondir='${datadir}/icons'
kde_includes='/usr/kde/3.5/include'
kde_kcfgdir='${datadir}/config.kcfg'
kde_libraries='/usr/kde/3.5/lib'
kde_libs_htmldir='/usr/kde/3.5/share/doc/HTML'
kde_libs_prefix='/usr/kde/3.5'
kde_locale='${datadir}/locale'
kde_mimedir='${datadir}/mimelnk'
kde_moduledir='${libdir}/kde3'
kde_qtver='3'
kde_servicesdir='${datadir}/services'
kde_servicetypesdir='${datadir}/servicetypes'
kde_sounddir='${datadir}/sounds'
kde_styledir='${libdir}/kde3/plugins/styles'
kde_templatesdir='${datadir}/templates'
kde_wallpaperdir='${datadir}/wallpapers'
kde_widgetdir='/usr/kde/3.5/lib/kde3/plugins/designer'
kdeinitdir='$(kde_moduledir)'
kfile_plugins_SUBDIR_included_FALSE=''
kfile_plugins_SUBDIR_included_TRUE=''
kicker_applets_SUBDIR_included_FALSE=''
kicker_applets_SUBDIR_included_TRUE=''
knewsticker_scripts_SUBDIR_included_FALSE=''
knewsticker_scripts_SUBDIR_included_TRUE=''
konq_plugins_SUBDIR_included_FALSE=''
konq_plugins_SUBDIR_included_TRUE=''
ksig_SUBDIR_included_FALSE=''
ksig_SUBDIR_included_TRUE=''
libdir='${exec_prefix}/lib'
libexecdir='${exec_prefix}/libexec'
localstatedir='/var/lib'
mandir='/usr/kde/3.5/share/man'
mkdir_p='mkdir -p --'
noatun_plugins_SUBDIR_included_FALSE=''
noatun_plugins_SUBDIR_included_TRUE=''
oldincludedir='/usr/include'
prefix='/usr/kde/3.5'
program_transform_name='s,x,x,'
qt_includes='/usr/qt/3/include'
qt_libraries='/usr/qt/3/lib'
renamedlgplugins_SUBDIR_included_FALSE=''
renamedlgplugins_SUBDIR_included_TRUE=''
sbindir='${exec_prefix}/sbin'
sharedstatedir='${prefix}/com'
sysconfdir='/usr/kde/3.5/etc'
target='i386-pc-linux-gnu'
target_alias=''
target_cpu='i386'
target_os='linux-gnu'
target_vendor='pc'
unsermake_enable_pch_FALSE=''
unsermake_enable_pch_TRUE='#'
x_includes='.'
x_libraries='/usr/lib'
xdg_appsdir='${datadir}/applications/kde'
xdg_directorydir='${datadir}/desktop-directories'
xdg_menudir='${sysconfdir}/xdg/menus'

## ----------- ##
## confdefs.h. ##
## ----------- ##

#define HAVE_CRYPT 1
#define HAVE_DLFCN_H 1
#define HAVE_FCNTL_H 1
#define HAVE_INTTYPES_H 1
#define HAVE_LIBJPEG 1
#define HAVE_LIBPNG 1
#define HAVE_LIBPTHREAD 1
#define HAVE_LIBZ 1
#define HAVE_MEMORY_H 1
#define HAVE_RES_INIT 1
#define HAVE_RES_INIT 1
#define HAVE_RES_INIT_PROTO 1
#define HAVE_SETENV 1
#define HAVE_SETENV_PROTO 1
#define HAVE_SGI_STL 1
#define HAVE_SNPRINTF 1
#define HAVE_SSL 1
#define HAVE_STDINT_H 1
#define HAVE_STDINT_H 1
#define HAVE_STDLIB_H 1
#define HAVE_STRINGS_H 1
#define HAVE_STRING_H 1
#define HAVE_SYS_BITYPES_H 1
#define HAVE_SYS_STAT_H 1
#define HAVE_SYS_TYPES_H 1
#define HAVE_SYS_TYPES_H 1
#define HAVE_UNISTD_H 1
#define HAVE_VSNPRINTF 1
#define HAVE_XMMS 1
#define KDELIBSUFF ""
#define KDEMAXPATHLEN 4096
#define PACKAGE "kdeaddons"
#define PACKAGE_BUGREPORT ""
#define PACKAGE_NAME ""
#define PACKAGE_STRING ""
#define PACKAGE_TARNAME ""
#define PACKAGE_VERSION ""
#define SIZEOF_CHAR_P 4
#define SIZEOF_INT 4
#define SIZEOF_LONG 4
#define SIZEOF_SHORT 2
#define SIZEOF_SIZE_T 4
#define SIZEOF_UNSIGNED_LONG 4
#define STDC_HEADERS 1
#define VERSION "3.5.2"
#define kde_socklen_t socklen_t
#define ksize_t socklen_t
#endif
#ifdef __cplusplus
extern "C" void std::exit (int) throw (); using std::exit;

configure: exit 1