NOTE: Running task 2001 of 2901 (ID: 1734, /home/chris/gumstix/gumstix-oe/com.gumstix.collection/packages/netbase/netbase_4.21.bb, do_configure)
NOTE: package netbase-4.21: started
NOTE: package netbase-4.21-r23: task do_configure: started
NOTE: package netbase-4.21-r23: task do_configure: completed
NOTE: package netbase-4.21: completed
ERROR: function do_compile failed
ERROR: log data follows (/home/chris/gumstix/gumstix-oe/tmp/work/armv5te-angstrom-linux-gnueabi/webkit-gtk-0.1+svnr26915-r4/temp/log.do_compile.8803)
| NOTE: make -j 5 MAKEFLAGS=
| cd WebCore/ && make -f Makefile
| make[1]: Entering directory `/home/chris/gumstix/gumstix-oe/tmp/work/armv5te-angstrom-linux-gnueabi/webkit-gtk-0.1+svnr26915-r4/WebKitBuilds/Debug/WebCore'
| arm-angstrom-linux-gnueabi-g++ -march=armv5te -mtune=xscale -c -pipe -isystem/home/chris/gumstix/gumstix-oe/tmp/staging/arm-angstrom-linux-gnueabi/include -fexpensive-optimizations -fomit-frame-pointer -frename-registers -Os -isystem/home/chris/gumstix/gumstix-oe/tmp/staging/arm-angstrom-linux-gnueabi/include -fexpensive-optimizations -fomit-frame-pointer -frename-registers -Os -fpermissive -fvisibility-inlines-hidden -isystem/home/chris/gumstix/gumstix-oe/tmp/staging/arm-angstrom-linux-gnueabi/include -D_REENTRANT -I/home/chris/gumstix/gumstix-oe/tmp/staging/arm-angstrom-linux-gnueabi/lib/../include -Wall -W -Wcast-align -Wchar-subscripts -Wformat-security -Wmissing-format-attribute -Wpointer-arith -Wwrite-strings -Wno-format-y2k -Wno-unused-parameter -Wundef -fno-exceptions -fno-rtti -Wreturn-type -fno-strict-aliasing -I/home/chris/gumstix/gumstix-oe/tmp/staging/arm-angstrom-linux-gnueabi/include/cairo -I/home/chris/gumstix/gumstix-oe/tmp/staging/arm-angstrom-linux-gnueabi/include/freetype2 -I/home/chris/gumstix/gumstix-oe/tmp/staging/arm-angstrom-linux-gnueabi/include -I/home/chris/gumstix/gumstix-oe/tmp/staging/arm-angstrom-linux-gnueabi/include/libpng12 -I/home/chris/gumstix/gumstix-oe/tmp/staging/arm-angstrom-linux-gnueabi/include/cairo -I/home/chris/gumstix/gumstix-oe/tmp/staging/arm-angstrom-linux-gnueabi/include/freetype2 -I/home/chris/gumstix/gumstix-oe/tmp/staging/arm-angstrom-linux-gnueabi/include -I/home/chris/gumstix/gumstix-oe/tmp/staging/arm-angstrom-linux-gnueabi/include/libpng12 -I/home/chris/gumstix/gumstix-oe/tmp/staging/arm-angstrom-linux-gnueabi/include/gtk-2.0 -I/home/chris/gumstix/gumstix-oe/tmp/staging/arm-angstrom-linux-gnueabi/lib/gtk-2.0/include -I/home/chris/gumstix/gumstix-oe/tmp/staging/arm-angstrom-linux-gnueabi/include/atk-1.0 -I/home/chris/gumstix/gumstix-oe/tmp/staging/arm-angstrom-linux-gnueabi/include/cairo -I/home/chris/gumstix/gumstix-oe/tmp/staging/arm-angstrom-linux-gnueabi/include/pango-1.0 -I/home/chris/gumstix/gumstix-oe/tmp/staging/arm-angstrom-linux-gnueabi/include/glib-2.0 -I/home/chris/gumstix/gumstix-oe/tmp/staging/arm-angstrom-linux-gnueabi/lib/glib-2.0/include -I/home/chris/gumstix/gumstix-oe/tmp/staging/arm-angstrom-linux-gnueabi/include/freetype2 -I/home/chris/gumstix/gumstix-oe/tmp/staging/arm-angstrom-linux-gnueabi/include -I/home/chris/gumstix/gumstix-oe/tmp/staging/arm-angstrom-linux-gnueabi/include/libpng12 -I/home/chris/gumstix/gumstix-oe/tmp/staging/arm-angstrom-linux-gnueabi/include -pthread -I/home/chris/gumstix/gumstix-oe/tmp/staging/arm-angstrom-linux-gnueabi/include/glib-2.0 -I/home/chris/gumstix/gumstix-oe/tmp/staging/arm-angstrom-linux-gnueabi/lib/glib-2.0/include -I/home/chris/gumstix/gumstix-oe/tmp/staging/arm-angstrom-linux-gnueabi/include/libxml2 -I/home/chris/gumstix/gumstix-oe/tmp/staging/arm-angstrom-linux-gnueabi/include -I/home/chris/gumstix/gumstix-oe/tmp/staging/arm-angstrom-linux-gnueabi/include/libxml2 -fPIC -DBUILDING_CAIRO__=1 -DBUILDING_GTK__=1 -DUSE_SYSTEM_MALLOC -DNDEBUG -DHAVE_STDINT_H -DBUILD_WEBKIT -DENABLE_DATABASE=1 -DENABLE_ICONDATABASE=1 -DENABLE_XPATH=1 -DENABLE_XSLT=1 -DENABLE_SVG=1 -DWTF_CHANGES=1 -DBUILDING_GTK__ -I/home/chris/gumstix/gumstix-oe/tmp/cross/share/qt4/mkspecs/linux-gnueabi-oe-g++ -I../../../WebCore -I../../../../webkit-gtk-0.1+svnr26915-r4 -I../../../WebCore/platform/gtk -I../../../WebCore/platform/network/curl -I../../../WebCore/platform/graphics/cairo -I../../../WebCore/loader/gtk -I../../../WebCore/page/gtk -I/home/chris/gumstix/gumstix-oe/tmp/work/armv5te-angstrom-linux-gnueabi/webkit-gtk-0.1+svnr26915-r4/WebKit/gtk/WebView -I../../../WebKit/gtk/WebCoreSupport -I../../../JavaScriptCore -I../../../JavaScriptCore/kjs -I../../../JavaScriptCore/bindings -I../../../JavaScriptCore/bindings/c -I../../../JavaScriptCore/wtf -I../../../JavaScriptCore/ForwardingHeaders -I../../../WebCore -I../../../WebCore/ForwardingHeaders -I../../../WebCore/platform -I../../../WebCore/platform/network -I../../../WebCore/platform/graphics -I../../../WebCore/loader -I../../../WebCore/page -I../../../WebCore/css -I../../../WebCore/dom -I../../../WebCore/bridge -I../../../WebCore/editing -I../../../WebCore/rendering -I../../../WebCore/history -I../../../WebCore/xml -I../../../WebCore/html -Itmp -Itmp -Itmp -I../../../JavaScriptCore -I../../../JavaScriptCore/kjs -I../../../JavaScriptCore/bindings -I../../../JavaScriptCore/bindings/c -I../../../JavaScriptCore/wtf -I../../../JavaScriptCore/pcre -I/home/chris/gumstix/gumstix-oe/tmp/work/armv5te-angstrom-linux-gnueabi/webkit-gtk-0.1+svnr26915-r4/WebKitBuilds/Debug//JavaScriptCore/kjs/tmp -I../../../WebCore/platform/graphics/svg/cairo -I../../../WebCore/platform/image-decoders/bmp -I../../../WebCore/platform/image-decoders/gif -I../../../WebCore/platform/image-decoders/ico -I../../../WebCore/platform/image-decoders/jpeg -I../../../WebCore/platform/image-decoders/png -I../../../WebCore/platform/image-decoders/xbm -I../../../WebCore -I../../../WebCore/ForwardingHeaders -I../../../../webkit-gtk-0.1+svnr26915-r4 -I../../../JavaScriptCore/kjs -I../../../JavaScriptCore/bindings -I../../../WebCore/platform -I../../../WebCore/platform/network -I../../../WebCore/platform/graphics -I../../../WebCore/platform/graphics/svg -I../../../WebCore/platform/graphics/svg/filters -I../../../WebCore/platform/sql -I../../../WebCore/storage -I../../../WebCore/loader -I../../../WebCore/loader/icon -I../../../WebCore/css -I../../../WebCore/dom -I../../../WebCore/page -I../../../WebCore/bridge -I../../../WebCore/editing -I../../../WebCore/rendering -I../../../WebCore/history -I../../../WebCore/xml -I../../../WebCore/html -I../../../WebCore/bindings/js -I../../../WebCore/ksvg2 -I../../../WebCore/ksvg2/css -I../../../WebCore/ksvg2/svg -I../../../WebCore/ksvg2/misc -I../../../WebCore/ksvg2/events -I../../../WebCore/platform/image-decoders -I../../../WebCore -I. -o tmp/ChromeClientGtk.o ../../../WebKit/gtk/WebCoreSupport/ChromeClientGtk.cpp
| In file included from ../../../WebKit/gtk/WebCoreSupport/ChromeClientGtk.cpp:29:
| ../../../WebCore/config.h:25:5: warning: "__APPLE__" is not defined
| ../../../WebKit/gtk/WebCoreSupport/ChromeClientGtk.cpp:37:27: error: webkitgtkpage.h: No such file or directory
| ../../../WebKit/gtk/WebCoreSupport/ChromeClientGtk.cpp:38:30: error: webkitgtkprivate.h: No such file or directory
| ../../../WebKit/gtk/WebCoreSupport/ChromeClientGtk.cpp: In member function 'virtual WebCore::Page* WebKit::ChromeClient::createWindow(WebCore::Frame*, const WebCore::FrameLoadRequest&)':
| ../../../WebKit/gtk/WebCoreSupport/ChromeClientGtk.cpp:90: error: 'WEBKIT_PAGE_GET_CLASS' was not declared in this scope
| ../../../WebKit/gtk/WebCoreSupport/ChromeClientGtk.cpp:94: error: 'WebKitPagePrivate' was not declared in this scope
| ../../../WebKit/gtk/WebCoreSupport/ChromeClientGtk.cpp:94: error: 'privateData' was not declared in this scope
| ../../../WebKit/gtk/WebCoreSupport/ChromeClientGtk.cpp:94: error: 'WEBKIT_PAGE' was not declared in this scope
| ../../../WebKit/gtk/WebCoreSupport/ChromeClientGtk.cpp:94: error: 'WEBKIT_PAGE_GET_PRIVATE' was not declared in this scope
| ../../../WebKit/gtk/WebCoreSupport/ChromeClientGtk.cpp: In member function 'virtual void WebKit::ChromeClient::addMessageToConsole(const WebCore::String&, unsigned int, const WebCore::String&)':
| ../../../WebKit/gtk/WebCoreSupport/ChromeClientGtk.cpp:201: error: 'WEBKIT_PAGE_GET_CLASS' was not declared in this scope
| ../../../WebKit/gtk/WebCoreSupport/ChromeClientGtk.cpp: In member function 'virtual void WebKit::ChromeClient::runJavaScriptAlert(WebCore::Frame*, const WebCore::String&)':
| ../../../WebKit/gtk/WebCoreSupport/ChromeClientGtk.cpp:207: error: 'WEBKIT_PAGE_GET_CLASS' was not declared in this scope
| ../../../WebKit/gtk/WebCoreSupport/ChromeClientGtk.cpp:207: error: 'kit' was not declared in this scope
| ../../../WebKit/gtk/WebCoreSupport/ChromeClientGtk.cpp: In member function 'virtual bool WebKit::ChromeClient::runJavaScriptConfirm(WebCore::Frame*, const WebCore::String&)':
| ../../../WebKit/gtk/WebCoreSupport/ChromeClientGtk.cpp:213: error: 'WEBKIT_PAGE_GET_CLASS' was not declared in this scope
| ../../../WebKit/gtk/WebCoreSupport/ChromeClientGtk.cpp:213: error: 'kit' was not declared in this scope
| ../../../WebKit/gtk/WebCoreSupport/ChromeClientGtk.cpp: In member function 'virtual bool WebKit::ChromeClient::runJavaScriptPrompt(WebCore::Frame*, const WebCore::String&, const WebCore::String&, WebCore::String&)':
| ../../../WebKit/gtk/WebCoreSupport/ChromeClientGtk.cpp:221: error: 'gchar' was not declared in this scope
| ../../../WebKit/gtk/WebCoreSupport/ChromeClientGtk.cpp:221: error: 'cresult' was not declared in this scope
| ../../../WebKit/gtk/WebCoreSupport/ChromeClientGtk.cpp:221: error: 'WEBKIT_PAGE_GET_CLASS' was not declared in this scope
| ../../../WebKit/gtk/WebCoreSupport/ChromeClientGtk.cpp:222: error: 'kit' was not declared in this scope
| ../../../WebKit/gtk/WebCoreSupport/ChromeClientGtk.cpp:229: error: 'g_free' was not declared in this scope
| ../../../WebKit/gtk/WebCoreSupport/ChromeClientGtk.cpp: In member function 'virtual void WebKit::ChromeClient::setStatusbarText(const WebCore::String&)':
| ../../../WebKit/gtk/WebCoreSupport/ChromeClientGtk.cpp:237: error: 'g_signal_emit_by_name' was not declared in this scope
| ../../../WebKit/gtk/WebCoreSupport/ChromeClientGtk.cpp: In member function 'virtual void WebKit::ChromeClient::mouseDidMoveOverElement(const WebCore::HitTestResult&, unsigned int)':
| ../../../WebKit/gtk/WebCoreSupport/ChromeClientGtk.cpp:282: error: 'g_signal_emit_by_name' was not declared in this scope
| ../../../WebKit/gtk/WebCoreSupport/ChromeClientGtk.cpp:286: error: 'g_signal_emit_by_name' was not declared in this scope
| make[1]: *** [tmp/ChromeClientGtk.o] Error 1
| make[1]: Leaving directory `/home/chris/gumstix/gumstix-oe/tmp/work/armv5te-angstrom-linux-gnueabi/webkit-gtk-0.1+svnr26915-r4/WebKitBuilds/Debug/WebCore'
| make: *** [sub-WebCore-make_default-ordered] Error 2
| FATAL: oe_runmake failed
NOTE: Task failed: /home/chris/gumstix/gumstix-oe/tmp/work/armv5te-angstrom-linux-gnueabi/webkit-gtk-0.1+svnr26915-r4/temp/log.do_compile.8803
NOTE: package webkit-gtk-0.1+svnr26915-r4: task do_compile: failed
ERROR: TaskFailed event exception, aborting
NOTE: package webkit-gtk-0.1+svnr26915: failed
ERROR: Build of /home/chris/gumstix/gumstix-oe/com.gumstix.collection/packages/webkit/webkit-gtk_svn.bb do_compile failed
NOTE: Running task 2002 of 2901 (ID: 1727, /home/chris/gumstix/gumstix-oe/com.gumstix.collection/packages/version/version.bb, do_patch)
NOTE: package version-1.0: started
NOTE: package version-1.0-r1: task do_patch: started
NOTE: package version-1.0-r1: task do_patch: completed
NOTE: package version-1.0: completed
ERROR: Task 1416 (/home/chris/gumstix/gumstix-oe/com.gumstix.collection/packages/webkit/webkit-gtk_svn.bb, do_compile) failed
NOTE: Waiting for 1 active tasks to finish
NOTE: 1: /home/chris/gumstix/gumstix-oe/com.gumstix.collection/packages/version/version.bb, do_patch (9028)
NOTE: Tasks Summary: Attempted 2000 tasks of which 1997 didn't need to be rerun and 1 failed.
ERROR: '/home/chris/gumstix/gumstix-oe/com.gumstix.collection/packages/webkit/webkit-gtk_svn.bb' failed
chris@homer:~/gumstix/gumstix-oe$