All pastes #903071 Raw Edit

Something

public text v1 · immutable
·published 2008-02-13 23:34 UTC
rendered paste body
make[2]: Entering directory `/home/hads/src/mythtv/libs/libmythfreesurround'
g++ -c -pipe -march=pentium3 -fomit-frame-pointer -O3 -Wall -Wno-switch -Wpointer-arith -Wredundant-decls -Wno-non-virtual-dtor -D__STDC_CONSTANT_MACROS -I/usr/include/kde/artsc -pthread -I/usr/include/glib-2.0 -I/usr/lib/glib-2.0/include -fPIC -DPIC -w -D_REENTRANT  -DMMX -Di386 -D_GNU_SOURCE -D_FILE_OFFSET_BITS=64 -DPREFIX=\"/usr/local\" -DLIBDIR=\"/usr/local/lib\" -DQT_NO_DEBUG -DQT_THREAD_SUPPORT -DQT_SHARED -DQT_TABLET_SUPPORT -I/usr/share/qt3/mkspecs/default -I. -I/usr/local/include -I../../libs/libavcodec -I../.. -I../../libs/libavutil -I/usr/include/qt3 -o el_processor.o el_processor.cpp
distcc[22391] ERROR: compile /home/hads/.ccache/el_process.tmp.smokey.22387.ii on snowman failed
/usr/include/c++/4.2/i486-linux-gnu/bits/c++config.h:149: error: expected `=' before '__attribute__'
/usr/include/c++/4.2/i486-linux-gnu/bits/c++config.h:149: error: expected identifier before '__attribute__'
/usr/include/c++/4.2/i486-linux-gnu/bits/c++config.h:149: error: expected `;' before '__attribute__'
/usr/include/c++/4.2/i486-linux-gnu/bits/c++config.h:149: error: expected unqualified-id before '{' token
/usr/include/c++/4.2/cstddef:53: error: expected `=' before '__attribute__'
/usr/include/c++/4.2/cstddef:53: error: expected identifier before '__attribute__'
/usr/include/c++/4.2/cstddef:53: error: expected `;' before '__attribute__'
/usr/include/c++/4.2/cstddef:53: error: expected unqualified-id before '{' token
/usr/include/c++/4.2/cstdlib:104: error: expected `=' before '__attribute__'
/usr/include/c++/4.2/cstdlib:104: error: expected identifier before '__attribute__'
/usr/include/c++/4.2/cstdlib:104: error: expected `;' before '__attribute__'
/usr/include/c++/4.2/cstdlib:104: error: expected unqualified-id before '{' token
/usr/include/c++/4.2/cstdlib:161: error: expected `=' before '__attribute__'
/usr/include/c++/4.2/cstdlib:161: error: expected identifier before '__attribute__'
/usr/include/c++/4.2/cstdlib:161: error: expected `;' before '__attribute__'
/usr/include/c++/4.2/cstdlib:161: error: expected unqualified-id before '{' token
/usr/include/c++/4.2/cstdlib:203: error: expected `=' before '__attribute__'
/usr/include/c++/4.2/cstdlib:203: error: expected identifier before '__attribute__'
/usr/include/c++/4.2/cstdlib:203: error: expected `;' before '__attribute__'
/usr/include/c++/4.2/cstdlib:203: error: expected unqualified-id before '{' token
/usr/include/c++/4.2/cstring:78: error: expected `=' before '__attribute__'
/usr/include/c++/4.2/cstring:78: error: expected identifier before '__attribute__'
/usr/include/c++/4.2/cstring:78: error: expected `;' before '__attribute__'
/usr/include/c++/4.2/cstring:78: error: expected unqualified-id before '{' token
/usr/include/c++/4.2/bits/cpp_type_traits.h:74: error: expected `=' before '__attribute__'
/usr/include/c++/4.2/bits/cpp_type_traits.h:74: error: expected identifier before '__attribute__'
/usr/include/c++/4.2/bits/cpp_type_traits.h:74: error: expected `;' before '__attribute__'
/usr/include/c++/4.2/bits/cpp_type_traits.h:74: error: expected unqualified-id before '{' token
/usr/include/c++/4.2/bits/cpp_type_traits.h:81: error: expected `=' before '__attribute__'
/usr/include/c++/4.2/bits/cpp_type_traits.h:81: error: expected identifier before '__attribute__'
/usr/include/c++/4.2/bits/cpp_type_traits.h:81: error: expected `;' before '__attribute__'
/usr/include/c++/4.2/bits/cpp_type_traits.h:81: error: expected unqualified-id before '{' token
/usr/include/c++/4.2/bits/stl_relops.h:74: error: expected `=' before '__attribute__'
/usr/include/c++/4.2/bits/stl_relops.h:74: error: expected identifier before '__attribute__'
/usr/include/c++/4.2/bits/stl_relops.h:74: error: expected `;' before '__attribute__'
/usr/include/c++/4.2/bits/stl_relops.h:74: error: expected unqualified-id before '{' token
/usr/include/c++/4.2/bits/stl_pair.h:64: error: expected `=' before '__attribute__'
/usr/include/c++/4.2/bits/stl_pair.h:64: error: expected identifier before '__attribute__'
/usr/include/c++/4.2/bits/stl_pair.h:64: error: expected `;' before '__attribute__'
/usr/include/c++/4.2/bits/stl_pair.h:64: error: expected unqualified-id before '{' token
/usr/include/c++/4.2/ext/type_traits.h:44: error: expected `=' before '__attribute__'
/usr/include/c++/4.2/ext/type_traits.h:44: error: expected identifier before '__attribute__'
/usr/include/c++/4.2/ext/type_traits.h:44: error: expected `;' before '__attribute__'
/usr/include/c++/4.2/ext/type_traits.h:44: error: expected unqualified-id before '{' token
/usr/include/c++/4.2/cmath:82: error: expected `=' before '__attribute__'
/usr/include/c++/4.2/cmath:82: error: expected identifier before '__attribute__'
/usr/include/c++/4.2/cmath:82: error: expected `;' before '__attribute__'
/usr/include/c++/4.2/cmath:82: error: expected unqualified-id before '{' token
/usr/include/c++/4.2/cmath:464: error: expected `=' before '__attribute__'
/usr/include/c++/4.2/cmath:464: error: expected identifier before '__attribute__'
/usr/include/c++/4.2/cmath:464: error: expected `;' before '__attribute__'
/usr/include/c++/4.2/cmath:464: error: expected unqualified-id before '{' token
/usr/include/c++/4.2/cmath:535: error: expected `=' before '__attribute__'
/usr/include/c++/4.2/cmath:535: error: expected identifier before '__attribute__'
/usr/include/c++/4.2/cmath:535: error: expected `;' before '__attribute__'
/usr/include/c++/4.2/cmath:535: error: expected unqualified-id before '{' token
/usr/include/c++/4.2/bits/cmath.tcc:39: error: expected `=' before '__attribute__'
/usr/include/c++/4.2/bits/cmath.tcc:39: error: expected identifier before '__attribute__'
/usr/include/c++/4.2/bits/cmath.tcc:39: error: expected `;' before '__attribute__'
/usr/include/c++/4.2/bits/cmath.tcc:39: error: expected unqualified-id before '{' token
/usr/include/c++/4.2/cstdio:98: error: expected `=' before '__attribute__'
/usr/include/c++/4.2/cstdio:98: error: expected identifier before '__attribute__'
/usr/include/c++/4.2/cstdio:98: error: expected `;' before '__attribute__'
/usr/include/c++/4.2/cstdio:98: error: expected unqualified-id before '{' token
/usr/include/c++/4.2/cstdio:155: error: expected `=' before '__attribute__'
/usr/include/c++/4.2/cstdio:155: error: expected identifier before '__attribute__'
/usr/include/c++/4.2/cstdio:155: error: expected `;' before '__attribute__'
/usr/include/c++/4.2/cstdio:155: error: expected unqualified-id before '{' token
/usr/include/c++/4.2/cstdio:179: error: expected `=' before '__attribute__'
/usr/include/c++/4.2/cstdio:179: error: expected identifier before '__attribute__'
/usr/include/c++/4.2/cstdio:179: error: expected `;' before '__attribute__'
/usr/include/c++/4.2/cstdio:179: error: expected unqualified-id before '{' token
/usr/include/c++/4.2/clocale:57: error: expected `=' before '__attribute__'
/usr/include/c++/4.2/clocale:57: error: expected identifier before '__attribute__'
/usr/include/c++/4.2/clocale:57: error: expected `;' before '__attribute__'
/usr/include/c++/4.2/clocale:57: error: expected unqualified-id before '{' token
/usr/include/c++/4.2/cstdarg:58: error: expected `=' before '__attribute__'
/usr/include/c++/4.2/cstdarg:58: error: expected identifier before '__attribute__'
/usr/include/c++/4.2/cstdarg:58: error: expected `;' before '__attribute__'
/usr/include/c++/4.2/cstdarg:58: error: expected unqualified-id before '{' token
/usr/include/c++/4.2/i486-linux-gnu/bits/c++locale.h:60: error: expected `=' before '__attribute__'
/usr/include/c++/4.2/i486-linux-gnu/bits/c++locale.h:60: error: expected identifier before '__attribute__'
/usr/include/c++/4.2/i486-linux-gnu/bits/c++locale.h:60: error: expected `;' before '__attribute__'
/usr/include/c++/4.2/i486-linux-gnu/bits/c++locale.h:60: error: expected unqualified-id before '{' token
/usr/include/c++/4.2/i486-linux-gnu/bits/c++locale.h:67: error: expected `=' before '__attribute__'
/usr/include/c++/4.2/i486-linux-gnu/bits/c++locale.h:67: error: expected identifier before '__attribute__'
/usr/include/c++/4.2/i486-linux-gnu/bits/c++locale.h:67: error: expected `;' before '__attribute__'
/usr/include/c++/4.2/i486-linux-gnu/bits/c++locale.h:67: error: expected unqualified-id before '{' token
/usr/include/c++/4.2/i486-linux-gnu/bits/gthr-default.h:92: error: weak declaration of 'int __gthrw_pthread_once(pthread_once_t*, void (*)())' must be public
/usr/include/c++/4.2/i486-linux-gnu/bits/gthr-default.h:93: error: weak declaration of 'void* __gthrw_pthread_getspecific(pthread_key_t)' must be public
/usr/include/c++/4.2/i486-linux-gnu/bits/gthr-default.h:94: error: weak declaration of 'int __gthrw_pthread_setspecific(pthread_key_t, const void*)' must be public
/usr/include/c++/4.2/i486-linux-gnu/bits/gthr-default.h:95: error: weak declaration of 'int __gthrw_pthread_create(pthread_t*, const pthread_attr_t*, void* (*)(void*), void*)' must be public
/usr/include/c++/4.2/i486-linux-gnu/bits/gthr-default.h:96: error: weak declaration of 'int __gthrw_pthread_cancel(pthread_t)' must be public
/usr/include/c++/4.2/i486-linux-gnu/bits/gthr-default.h:97: error: weak declaration of 'int __gthrw_pthread_mutex_lock(pthread_mutex_t*)' must be public
/usr/include/c++/4.2/i486-linux-gnu/bits/gthr-default.h:98: error: weak declaration of 'int __gthrw_pthread_mutex_trylock(pthread_mutex_t*)' must be public
/usr/include/c++/4.2/i486-linux-gnu/bits/gthr-default.h:99: error: weak declaration of 'int __gthrw_pthread_mutex_unlock(pthread_mutex_t*)' must be public
/usr/include/c++/4.2/i486-linux-gnu/bits/gthr-default.h:100: error: weak declaration of 'int __gthrw_pthread_mutex_init(pthread_mutex_t*, const pthread_mutexattr_t*)' must be public
/usr/include/c++/4.2/i486-linux-gnu/bits/gthr-default.h:103: error: weak declaration of 'int __gthrw_pthread_key_create(pthread_key_t*, void (*)(void*))' must be public
/usr/include/c++/4.2/i486-linux-gnu/bits/gthr-default.h:104: error: weak declaration of 'int __gthrw_pthread_key_delete(pthread_key_t)' must be public
/usr/include/c++/4.2/i486-linux-gnu/bits/gthr-default.h:105: error: weak declaration of 'int __gthrw_pthread_mutexattr_init(pthread_mutexattr_t*)' must be public
/usr/include/c++/4.2/i486-linux-gnu/bits/gthr-default.h:106: error: weak declaration of 'int __gthrw_pthread_mutexattr_settype(pthread_mutexattr_t*, int)' must be public
/usr/include/c++/4.2/i486-linux-gnu/bits/gthr-default.h:107: error: weak declaration of 'int __gthrw_pthread_mutexattr_destroy(pthread_mutexattr_t*)' must be public
/usr/include/c++/4.2/i486-linux-gnu/bits/c++io.h:45: error: expected `=' before '__attribute__'
/usr/include/c++/4.2/i486-linux-gnu/bits/c++io.h:45: error: expected identifier before '__attribute__'
/usr/include/c++/4.2/i486-linux-gnu/bits/c++io.h:45: error: expected `;' before '__attribute__'
/usr/include/c++/4.2/i486-linux-gnu/bits/c++io.h:45: error: expected unqualified-id before '{' token
/usr/include/c++/4.2/cctype:68: error: expected `=' before '__attribute__'
/usr/include/c++/4.2/cctype:68: error: expected identifier before '__attribute__'
/usr/include/c++/4.2/cctype:68: error: expected `;' before '__attribute__'
/usr/include/c++/4.2/cctype:68: error: expected unqualified-id before '{' token
/usr/include/c++/4.2/bits/stringfwd.h:46: error: expected `=' before '__attribute__'
/usr/include/c++/4.2/bits/stringfwd.h:46: error: expected identifier before '__attribute__'
/usr/include/c++/4.2/bits/stringfwd.h:46: error: expected `;' before '__attribute__'
/usr/include/c++/4.2/bits/stringfwd.h:46: error: expected unqualified-id before '{' token
/usr/include/c++/4.2/ctime:64: error: expected `=' before '__attribute__'
/usr/include/c++/4.2/ctime:64: error: expected identifier before '__attribute__'
/usr/include/c++/4.2/ctime:64: error: expected `;' before '__attribute__'
/usr/include/c++/4.2/ctime:64: error: expected unqualified-id before '{' token
/usr/include/c++/4.2/cwchar:70: error: expected `=' before '__attribute__'
/usr/include/c++/4.2/cwchar:70: error: expected identifier before '__attribute__'
/usr/include/c++/4.2/cwchar:70: error: expected `;' before '__attribute__'
/usr/include/c++/4.2/cwchar:70: error: expected unqualified-id before '{' token
/usr/include/c++/4.2/cwchar:144: error: expected `=' before '__attribute__'
/usr/include/c++/4.2/cwchar:144: error: expected identifier before '__attribute__'
/usr/include/c++/4.2/cwchar:144: error: expected `;' before '__attribute__'
/usr/include/c++/4.2/cwchar:144: error: expected unqualified-id before '{' token
/usr/include/c++/4.2/cwchar:246: error: expected `=' before '__attribute__'
/usr/include/c++/4.2/cwchar:246: error: expected identifier before '__attribute__'
/usr/include/c++/4.2/cwchar:246: error: expected `;' before '__attribute__'
/usr/include/c++/4.2/cwchar:246: error: expected unqualified-id before '{' token
/usr/include/c++/4.2/cwchar:268: error: expected `=' before '__attribute__'
/usr/include/c++/4.2/cwchar:268: error: expected identifier before '__attribute__'
/usr/include/c++/4.2/cwchar:268: error: expected `;' before '__attribute__'
/usr/include/c++/4.2/cwchar:268: error: expected unqualified-id before '{' token
/usr/include/c++/4.2/bits/postypes.h:52: error: expected `=' before '__attribute__'
/usr/include/c++/4.2/bits/postypes.h:52: error: expected identifier before '__attribute__'
/usr/include/c++/4.2/bits/postypes.h:52: error: expected `;' before '__attribute__'
/usr/include/c++/4.2/bits/postypes.h:52: error: expected unqualified-id before '{' token
/usr/include/c++/4.2/bits/functexcept.h:44: error: expected `=' before '__attribute__'
/usr/include/c++/4.2/bits/functexcept.h:44: error: expected identifier before '__attribute__'
/usr/include/c++/4.2/bits/functexcept.h:44: error: expected `;' before '__attribute__'
/usr/include/c++/4.2/bits/functexcept.h:44: error: expected unqualified-id before '{' token
/usr/include/c++/4.2/iosfwd:52: error: expected `=' before '__attribute__'
/usr/include/c++/4.2/iosfwd:52: error: expected identifier before '__attribute__'
/usr/include/c++/4.2/iosfwd:52: error: expected `;' before '__attribute__'
/usr/include/c++/4.2/iosfwd:52: error: expected unqualified-id before '{' token
/usr/include/c++/4.2/exception:115: error: expected `=' before '__attribute__'
/usr/include/c++/4.2/exception:115: error: expected identifier before '__attribute__'
/usr/include/c++/4.2/exception:115: error: expected `;' before '__attribute__'
/usr/include/c++/4.2/exception:115: error: expected unqualified-id before '{' token
/usr/include/c++/4.2/bits/stl_iterator_base_types.h:69: error: expected `=' before '__attribute__'
/usr/include/c++/4.2/bits/stl_iterator_base_types.h:69: error: expected identifier before '__attribute__'
/usr/include/c++/4.2/bits/stl_iterator_base_types.h:69: error: expected `;' before '__attribute__'
/usr/include/c++/4.2/bits/stl_iterator_base_types.h:69: error: expected unqualified-id before '{' token
/usr/include/c++/4.2/bits/stl_iterator_base_funcs.h:71: error: expected `=' before '__attribute__'
/usr/include/c++/4.2/bits/stl_iterator_base_funcs.h:71: error: expected identifier before '__attribute__'
/usr/include/c++/4.2/bits/stl_iterator_base_funcs.h:71: error: expected `;' before '__attribute__'
/usr/include/c++/4.2/bits/stl_iterator_base_funcs.h:71: error: expected unqualified-id before '{' token
/usr/include/c++/4.2/bits/stl_iterator.h:72: error: expected `=' before '__attribute__'
/usr/include/c++/4.2/bits/stl_iterator.h:72: error: expected identifier before '__attribute__'
/usr/include/c++/4.2/bits/stl_iterator.h:72: error: expected `;' before '__attribute__'
/usr/include/c++/4.2/bits/stl_iterator.h:72: error: expected unqualified-id before '{' token
/usr/include/c++/4.2/bits/stl_iterator.h:624: error: expected `=' before '__attribute__'
/usr/include/c++/4.2/bits/stl_iterator.h:624: error: expected identifier before '__attribute__'
/usr/include/c++/4.2/bits/stl_iterator.h:624: error: expected `;' before '__attribute__'
/usr/include/c++/4.2/bits/stl_iterator.h:624: error: expected unqualified-id before '{' token
/usr/include/c++/4.2/bits/stl_algobase.h:80: error: expected `=' before '__attribute__'
/usr/include/c++/4.2/bits/stl_algobase.h:80: error: expected identifier before '__attribute__'
/usr/include/c++/4.2/bits/stl_algobase.h:80: error: expected `;' before '__attribute__'
/usr/include/c++/4.2/bits/stl_algobase.h:80: error: expected unqualified-id before '{' token
/usr/include/c++/4.2/bits/char_traits.h:49: error: expected `=' before '__attribute__'
/usr/include/c++/4.2/bits/char_traits.h:49: error: expected identifier before '__attribute__'
/usr/include/c++/4.2/bits/char_traits.h:49: error: expected `;' before '__attribute__'
/usr/include/c++/4.2/bits/char_traits.h:49: error: expected unqualified-id before '{' token
/usr/include/c++/4.2/bits/char_traits.h:210: error: expected `=' before '__attribute__'
/usr/include/c++/4.2/bits/char_traits.h:210: error: expected identifier before '__attribute__'
/usr/include/c++/4.2/bits/char_traits.h:210: error: expected `;' before '__attribute__'
/usr/include/c++/4.2/bits/char_traits.h:210: error: expected unqualified-id before '{' token
/usr/include/c++/4.2/bits/localefwd.h:50: error: expected `=' before '__attribute__'
/usr/include/c++/4.2/bits/localefwd.h:50: error: expected identifier before '__attribute__'
/usr/include/c++/4.2/bits/localefwd.h:50: error: expected `;' before '__attribute__'
/usr/include/c++/4.2/bits/localefwd.h:50: error: expected unqualified-id before '{' token
/usr/include/c++/4.2/ext/atomicity.h:42: error: expected `=' before '__attribute__'
/usr/include/c++/4.2/ext/atomicity.h:42: error: expected identifier before '__attribute__'
/usr/include/c++/4.2/ext/atomicity.h:42: error: expected `;' before '__attribute__'
/usr/include/c++/4.2/ext/atomicity.h:42: error: expected unqualified-id before '{' token
/usr/include/c++/4.2/new:95: error: declaration of 'operator new' as non-function
/usr/include/c++/4.2/new:95: error: 'size_t' is not a member of 'std'
/usr/include/c++/4.2/new:96: error: declaration of 'operator new []' as non-function
/usr/include/c++/4.2/new:96: error: 'size_t' is not a member of 'std'
/usr/include/c++/4.2/new:99: error: declaration of 'operator new' as non-function
/usr/include/c++/4.2/new:99: error: 'size_t' is not a member of 'std'
/usr/include/c++/4.2/new:99: error: expected primary-expression before 'const'
/usr/include/c++/4.2/new:100: error: declaration of 'operator new []' as non-function
/usr/include/c++/4.2/new:100: error: 'size_t' is not a member of 'std'
/usr/include/c++/4.2/new:100: error: expected primary-expression before 'const'
/usr/include/c++/4.2/new:105: error: declaration of 'operator new' as non-function
/usr/include/c++/4.2/new:105: error: 'size_t' is not a member of 'std'
/usr/include/c++/4.2/new:105: error: expected primary-expression before 'void'
/usr/include/c++/4.2/new:106: error: declaration of 'operator new []' as non-function
/usr/include/c++/4.2/new:106: error: 'size_t' is not a member of 'std'
/usr/include/c++/4.2/new:106: error: expected primary-expression before 'void'
/usr/include/c++/4.2/ext/new_allocator.h:40: error: expected `=' before '__attribute__'
/usr/include/c++/4.2/ext/new_allocator.h:40: error: expected identifier before '__attribute__'
/usr/include/c++/4.2/ext/new_allocator.h:40: error: expected `;' before '__attribute__'
/usr/include/c++/4.2/ext/new_allocator.h:40: error: expected unqualified-id before '{' token
/usr/include/c++/4.2/bits/allocator.h:57: error: expected `=' before '__attribute__'
/usr/include/c++/4.2/bits/allocator.h:57: error: expected identifier before '__attribute__'
/usr/include/c++/4.2/bits/allocator.h:57: error: expected `;' before '__attribute__'
/usr/include/c++/4.2/bits/allocator.h:57: error: expected unqualified-id before '{' token
/usr/include/c++/4.2/bits/stl_construct.h:67: error: expected `=' before '__attribute__'
/usr/include/c++/4.2/bits/stl_construct.h:67: error: expected identifier before '__attribute__'
/usr/include/c++/4.2/bits/stl_construct.h:67: error: expected `;' before '__attribute__'
/usr/include/c++/4.2/bits/stl_construct.h:67: error: expected unqualified-id before '{' token
/usr/include/c++/4.2/bits/stl_uninitialized.h:67: error: expected `=' before '__attribute__'
/usr/include/c++/4.2/bits/stl_uninitialized.h:67: error: expected identifier before '__attribute__'
/usr/include/c++/4.2/bits/stl_uninitialized.h:67: error: expected `;' before '__attribute__'
/usr/include/c++/4.2/bits/stl_uninitialized.h:67: error: expected unqualified-id before '{' token
/usr/include/c++/4.2/bits/stl_raw_storage_iter.h:64: error: expected `=' before '__attribute__'
/usr/include/c++/4.2/bits/stl_raw_storage_iter.h:64: error: expected identifier before '__attribute__'
/usr/include/c++/4.2/bits/stl_raw_storage_iter.h:64: error: expected `;' before '__attribute__'
/usr/include/c++/4.2/bits/stl_raw_storage_iter.h:64: error: expected unqualified-id before '{' token
/usr/include/c++/4.2/limits:150: error: expected `=' before '__attribute__'
/usr/include/c++/4.2/limits:150: error: expected identifier before '__attribute__'
/usr/include/c++/4.2/limits:150: error: expected `;' before '__attribute__'
/usr/include/c++/4.2/limits:150: error: expected unqualified-id before '{' token
/usr/include/c++/4.2/memory:62: error: expected `=' before '__attribute__'
/usr/include/c++/4.2/memory:62: error: expected identifier before '__attribute__'
/usr/include/c++/4.2/memory:62: error: expected `;' before '__attribute__'
/usr/include/c++/4.2/memory:62: error: expected unqualified-id before '{' token
/usr/include/c++/4.2/bits/ostream_insert.h:42: error: expected `=' before '__attribute__'
/usr/include/c++/4.2/bits/ostream_insert.h:42: error: expected identifier before '__attribute__'
/usr/include/c++/4.2/bits/ostream_insert.h:42: error: expected `;' before '__attribute__'
/usr/include/c++/4.2/bits/ostream_insert.h:42: error: expected unqualified-id before '{' token
/usr/include/c++/4.2/bits/stl_function.h:64: error: expected `=' before '__attribute__'
/usr/include/c++/4.2/bits/stl_function.h:64: error: expected identifier before '__attribute__'
/usr/include/c++/4.2/bits/stl_function.h:64: error: expected `;' before '__attribute__'
/usr/include/c++/4.2/bits/stl_function.h:64: error: expected unqualified-id before '{' token
/usr/include/c++/4.2/bits/basic_string.h:49: error: expected `=' before '__attribute__'
/usr/include/c++/4.2/bits/basic_string.h:49: error: expected identifier before '__attribute__'
/usr/include/c++/4.2/bits/basic_string.h:49: error: expected `;' before '__attribute__'
/usr/include/c++/4.2/bits/basic_string.h:49: error: expected unqualified-id before '{' token
/usr/include/c++/4.2/bits/stl_heap.h:65: error: expected `=' before '__attribute__'
/usr/include/c++/4.2/bits/stl_heap.h:65: error: expected identifier before '__attribute__'
/usr/include/c++/4.2/bits/stl_heap.h:65: error: expected `;' before '__attribute__'
/usr/include/c++/4.2/bits/stl_heap.h:65: error: expected unqualified-id before '{' token
/usr/include/c++/4.2/bits/stl_tempbuf.h:67: error: expected `=' before '__attribute__'
/usr/include/c++/4.2/bits/stl_tempbuf.h:67: error: expected identifier before '__attribute__'
/usr/include/c++/4.2/bits/stl_tempbuf.h:67: error: expected `;' before '__attribute__'
/usr/include/c++/4.2/bits/stl_tempbuf.h:67: error: expected unqualified-id before '{' token
/usr/include/c++/4.2/bits/stl_algo.h:71: error: expected `=' before '__attribute__'
/usr/include/c++/4.2/bits/stl_algo.h:71: error: expected identifier before '__attribute__'
/usr/include/c++/4.2/bits/stl_algo.h:71: error: expected `;' before '__attribute__'
/usr/include/c++/4.2/bits/stl_algo.h:71: error: expected unqualified-id before '{' token
/usr/include/c++/4.2/bits/basic_string.tcc:49: error: expected `=' before '__attribute__'
/usr/include/c++/4.2/bits/basic_string.tcc:49: error: expected identifier before '__attribute__'
/usr/include/c++/4.2/bits/basic_string.tcc:49: error: expected `;' before '__attribute__'
/usr/include/c++/4.2/bits/basic_string.tcc:49: error: expected unqualified-id before '{' token
/usr/include/c++/4.2/bits/locale_classes.h:50: error: expected `=' before '__attribute__'
/usr/include/c++/4.2/bits/locale_classes.h:50: error: expected identifier before '__attribute__'
/usr/include/c++/4.2/bits/locale_classes.h:50: error: expected `;' before '__attribute__'
/usr/include/c++/4.2/bits/locale_classes.h:50: error: expected unqualified-id before '{' token
/usr/include/c++/4.2/bits/ios_base.h:49: error: expected `=' before '__attribute__'
/usr/include/c++/4.2/bits/ios_base.h:49: error: expected identifier before '__attribute__'
/usr/include/c++/4.2/bits/ios_base.h:49: error: expected `;' before '__attribute__'
/usr/include/c++/4.2/bits/ios_base.h:49: error: expected unqualified-id before '{' token
/usr/include/c++/4.2/streambuf:51: error: expected `=' before '__attribute__'
/usr/include/c++/4.2/streambuf:51: error: expected identifier before '__attribute__'
/usr/include/c++/4.2/streambuf:51: error: expected `;' before '__attribute__'
/usr/include/c++/4.2/streambuf:51: error: expected unqualified-id before '{' token
/usr/include/c++/4.2/bits/streambuf.tcc:45: error: expected `=' before '__attribute__'
/usr/include/c++/4.2/bits/streambuf.tcc:45: error: expected identifier before '__attribute__'
/usr/include/c++/4.2/bits/streambuf.tcc:45: error: expected `;' before '__attribute__'
/usr/include/c++/4.2/bits/streambuf.tcc:45: error: expected unqualified-id before '{' token
/usr/include/c++/4.2/bits/streambuf_iterator.h:44: error: expected `=' before '__attribute__'
/usr/include/c++/4.2/bits/streambuf_iterator.h:44: error: expected identifier before '__attribute__'
/usr/include/c++/4.2/bits/streambuf_iterator.h:44: error: expected `;' before '__attribute__'
/usr/include/c++/4.2/bits/streambuf_iterator.h:44: error: expected unqualified-id before '{' token
/usr/include/c++/4.2/cwctype:80: error: expected `=' before '__attribute__'
/usr/include/c++/4.2/cwctype:80: error: expected identifier before '__attribute__'
/usr/include/c++/4.2/cwctype:80: error: expected `;' before '__attribute__'
/usr/include/c++/4.2/cwctype:80: error: expected unqualified-id before '{' token
/usr/include/c++/4.2/i486-linux-gnu/bits/ctype_base.h:42: error: expected `=' before '__attribute__'
/usr/include/c++/4.2/i486-linux-gnu/bits/ctype_base.h:42: error: expected identifier before '__attribute__'
/usr/include/c++/4.2/i486-linux-gnu/bits/ctype_base.h:42: error: expected `;' before '__attribute__'
/usr/include/c++/4.2/i486-linux-gnu/bits/ctype_base.h:42: error: expected unqualified-id before '{' token
/usr/include/c++/4.2/bits/locale_facets.h:53: error: expected `=' before '__attribute__'
/usr/include/c++/4.2/bits/locale_facets.h:53: error: expected identifier before '__attribute__'
/usr/include/c++/4.2/bits/locale_facets.h:53: error: expected `;' before '__attribute__'
/usr/include/c++/4.2/bits/locale_facets.h:53: error: expected unqualified-id before '{' token
/usr/include/c++/4.2/i486-linux-gnu/bits/ctype_inline.h:42: error: expected `=' before '__attribute__'
/usr/include/c++/4.2/i486-linux-gnu/bits/ctype_inline.h:42: error: expected identifier before '__attribute__'
/usr/include/c++/4.2/i486-linux-gnu/bits/ctype_inline.h:42: error: expected `;' before '__attribute__'
/usr/include/c++/4.2/i486-linux-gnu/bits/ctype_inline.h:42: error: expected unqualified-id before '{' token
/usr/include/c++/4.2/bits/codecvt.h:47: error: expected `=' before '__attribute__'
/usr/include/c++/4.2/bits/codecvt.h:47: error: expected identifier before '__attribute__'
/usr/include/c++/4.2/bits/codecvt.h:47: error: expected `;' before '__attribute__'
/usr/include/c++/4.2/bits/codecvt.h:47: error: expected unqualified-id before '{' token
/usr/include/c++/4.2/bits/locale_facets.h:1538: error: expected `=' before '__attribute__'
/usr/include/c++/4.2/bits/locale_facets.h:1538: error: expected identifier before '__attribute__'
/usr/include/c++/4.2/bits/locale_facets.h:1538: error: expected `;' before '__attribute__'
/usr/include/c++/4.2/bits/locale_facets.h:1538: error: expected unqualified-id before '{' token
/usr/include/c++/4.2/i486-linux-gnu/bits/time_members.h:42: error: expected `=' before '__attribute__'
/usr/include/c++/4.2/i486-linux-gnu/bits/time_members.h:42: error: expected identifier before '__attribute__'
/usr/include/c++/4.2/i486-linux-gnu/bits/time_members.h:42: error: expected `;' before '__attribute__'
/usr/include/c++/4.2/i486-linux-gnu/bits/time_members.h:42: error: expected unqualified-id before '{' token
/usr/include/c++/4.2/bits/locale_facets.h:3042: error: expected `=' before '__attribute__'
/usr/include/c++/4.2/bits/locale_facets.h:3042: error: expected identifier before '__attribute__'
/usr/include/c++/4.2/bits/locale_facets.h:3042: error: expected `;' before '__attribute__'
/usr/include/c++/4.2/bits/locale_facets.h:3042: error: expected unqualified-id before '{' token
/usr/include/c++/4.2/i486-linux-gnu/bits/messages_members.h:41: error: expected `=' before '__attribute__'
/usr/include/c++/4.2/i486-linux-gnu/bits/messages_members.h:41: error: expected identifier before '__attribute__'
/usr/include/c++/4.2/i486-linux-gnu/bits/messages_members.h:41: error: expected `;' before '__attribute__'
/usr/include/c++/4.2/i486-linux-gnu/bits/messages_members.h:41: error: expected unqualified-id before '{' token
/usr/include/c++/4.2/bits/locale_facets.h:4601: error: expected `=' before '__attribute__'
/usr/include/c++/4.2/bits/locale_facets.h:4601: error: expected identifier before '__attribute__'
/usr/include/c++/4.2/bits/locale_facets.h:4601: error: expected `;' before '__attribute__'
/usr/include/c++/4.2/bits/locale_facets.h:4601: error: expected unqualified-id before '{' token
/usr/include/c++/4.2/bits/basic_ios.h:46: error: expected `=' before '__attribute__'
/usr/include/c++/4.2/bits/basic_ios.h:46: error: expected identifier before '__attribute__'
/usr/include/c++/4.2/bits/basic_ios.h:46: error: expected `;' before '__attribute__'
/usr/include/c++/4.2/bits/basic_ios.h:46: error: expected unqualified-id before '{' token
/usr/include/c++/4.2/bits/basic_ios.tcc:41: error: expected `=' before '__attribute__'
/usr/include/c++/4.2/bits/basic_ios.tcc:41: error: expected identifier before '__attribute__'
/usr/include/c++/4.2/bits/basic_ios.tcc:41: error: expected `;' before '__attribute__'
/usr/include/c++/4.2/bits/basic_ios.tcc:41: error: expected unqualified-id before '{' token
/usr/include/c++/4.2/istream:47: error: expected `=' before '__attribute__'
/usr/include/c++/4.2/istream:47: error: expected identifier before '__attribute__'
/usr/include/c++/4.2/istream:47: error: expected `;' before '__attribute__'
/usr/include/c++/4.2/istream:47: error: expected unqualified-id before '{' token
/usr/include/c++/4.2/bits/locale_facets.tcc:47: error: expected `=' before '__attribute__'
/usr/include/c++/4.2/bits/locale_facets.tcc:47: error: expected identifier before '__attribute__'
/usr/include/c++/4.2/bits/locale_facets.tcc:47: error: expected `;' before '__attribute__'
/usr/include/c++/4.2/bits/locale_facets.tcc:47: error: expected unqualified-id before '{' token
/usr/include/c++/4.2/ostream:48: error: expected `=' before '__attribute__'
/usr/include/c++/4.2/ostream:48: error: expected identifier before '__attribute__'
/usr/include/c++/4.2/ostream:48: error: expected `;' before '__attribute__'
/usr/include/c++/4.2/ostream:48: error: expected unqualified-id before '{' token
/usr/include/c++/4.2/bits/ostream.tcc:48: error: expected `=' before '__attribute__'
/usr/include/c++/4.2/bits/ostream.tcc:48: error: expected identifier before '__attribute__'
/usr/include/c++/4.2/bits/ostream.tcc:48: error: expected `;' before '__attribute__'
/usr/include/c++/4.2/bits/ostream.tcc:48: error: expected unqualified-id before '{' token
/usr/include/c++/4.2/bits/istream.tcc:49: error: expected `=' before '__attribute__'
/usr/include/c++/4.2/bits/istream.tcc:49: error: expected identifier before '__attribute__'
/usr/include/c++/4.2/bits/istream.tcc:49: error: expected `;' before '__attribute__'
/usr/include/c++/4.2/bits/istream.tcc:49: error: expected unqualified-id before '{' token
/usr/include/c++/4.2/sstream:47: error: expected `=' before '__attribute__'
/usr/include/c++/4.2/sstream:47: error: expected identifier before '__attribute__'
/usr/include/c++/4.2/sstream:47: error: expected `;' before '__attribute__'
/usr/include/c++/4.2/sstream:47: error: expected unqualified-id before '{' token
/usr/include/c++/4.2/bits/sstream.tcc:47: error: expected `=' before '__attribute__'
/usr/include/c++/4.2/bits/sstream.tcc:47: error: expected identifier before '__attribute__'
/usr/include/c++/4.2/bits/sstream.tcc:47: error: expected `;' before '__attribute__'
/usr/include/c++/4.2/bits/sstream.tcc:47: error: expected unqualified-id before '{' token
/usr/include/c++/4.2/complex:52: error: expected `=' before '__attribute__'
/usr/include/c++/4.2/complex:52: error: expected identifier before '__attribute__'
/usr/include/c++/4.2/complex:52: error: expected `;' before '__attribute__'
/usr/include/c++/4.2/complex:52: error: expected unqualified-id before '{' token
/usr/include/c++/4.2/bits/stl_vector.h:69: error: expected `=' before '__attribute__'
/usr/include/c++/4.2/bits/stl_vector.h:69: error: expected identifier before '__attribute__'
/usr/include/c++/4.2/bits/stl_vector.h:69: error: expected `;' before '__attribute__'
/usr/include/c++/4.2/bits/stl_vector.h:69: error: expected unqualified-id before '{' token
/usr/include/c++/4.2/bits/stl_bvector.h:65: error: expected `=' before '__attribute__'
/usr/include/c++/4.2/bits/stl_bvector.h:65: error: expected identifier before '__attribute__'
/usr/include/c++/4.2/bits/stl_bvector.h:65: error: expected `;' before '__attribute__'
/usr/include/c++/4.2/bits/stl_bvector.h:65: error: expected unqualified-id before '{' token
/usr/include/c++/4.2/bits/stl_bvector.h:435: error: expected `=' before '__attribute__'
/usr/include/c++/4.2/bits/stl_bvector.h:435: error: expected identifier before '__attribute__'
/usr/include/c++/4.2/bits/stl_bvector.h:435: error: expected `;' before '__attribute__'
/usr/include/c++/4.2/bits/stl_bvector.h:435: error: expected unqualified-id before '{' token
/usr/include/c++/4.2/bits/vector.tcc:64: error: expected `=' before '__attribute__'
/usr/include/c++/4.2/bits/vector.tcc:64: error: expected identifier before '__attribute__'
/usr/include/c++/4.2/bits/vector.tcc:64: error: expected `;' before '__attribute__'
/usr/include/c++/4.2/bits/vector.tcc:64: error: expected unqualified-id before '{' token
el_processor.cpp:39: error: expected initializer before '<' token
el_processor.cpp:243: error: 'cfloat' does not name a type
el_processor.cpp:483: error: 'cfloat' has not been declared
el_processor.cpp:589: error: ISO C++ forbids declaration of 'vector' with no type
el_processor.cpp:589: error: invalid use of '::'
el_processor.cpp:589: error: expected ';' before '<' token
el_processor.cpp:590: error: ISO C++ forbids declaration of 'vector' with no type
el_processor.cpp:590: error: invalid use of '::'
el_processor.cpp:590: error: expected ';' before '<' token
el_processor.cpp:591: error: ISO C++ forbids declaration of 'vector' with no type
el_processor.cpp:591: error: invalid use of '::'
el_processor.cpp:591: error: expected ';' before '<' token
el_processor.cpp:592: error: ISO C++ forbids declaration of 'vector' with no type
el_processor.cpp:592: error: invalid use of '::'
el_processor.cpp:592: error: expected ';' before '<' token
el_processor.cpp:593: error: ISO C++ forbids declaration of 'vector' with no type
el_processor.cpp:593: error: invalid use of '::'
el_processor.cpp:593: error: expected ';' before '<' token
el_processor.cpp:594: error: ISO C++ forbids declaration of 'vector' with no type
el_processor.cpp:594: error: invalid use of '::'
el_processor.cpp:594: error: expected ';' before '<' token
el_processor.cpp:595: error: ISO C++ forbids declaration of 'vector' with no type
el_processor.cpp:595: error: invalid use of '::'
el_processor.cpp:595: error: expected ';' before '<' token
el_processor.cpp:605: error: 'cfloat' does not name a type
el_processor.cpp: In constructor 'decoder_impl::decoder_impl(unsigned int)':
el_processor.cpp:87: error: 'frontR' was not declared in this scope
el_processor.cpp:88: error: 'frontL' was not declared in this scope
el_processor.cpp:89: error: 'avg' was not declared in this scope
el_processor.cpp:90: error: 'surR' was not declared in this scope
el_processor.cpp:91: error: 'surL' was not declared in this scope
el_processor.cpp:92: error: 'trueavg' was not declared in this scope
el_processor.cpp:93: error: 'xfs' was not declared in this scope
el_processor.cpp:94: error: 'yfs' was not declared in this scope
el_processor.cpp:95: error: 'inbuf' was not declared in this scope
el_processor.cpp:98: error: 'outbuf' was not declared in this scope
el_processor.cpp:99: error: 'filter' was not declared in this scope
el_processor.cpp:104: error: 'filter' was not declared in this scope
el_processor.cpp:110: error: 'wnd' was not declared in this scope
el_processor.cpp: In member function 'float** decoder_impl::getInputBuffers()':
el_processor.cpp:150: error: 'inbuf' was not declared in this scope
el_processor.cpp: In member function 'float** decoder_impl::getOutputBuffers()':
el_processor.cpp:157: error: 'outbuf' was not declared in this scope
el_processor.cpp: In member function 'void decoder_impl::decode(float, float, float)':
el_processor.cpp:174: error: 'inbuf' was not declared in this scope
el_processor.cpp: In member function 'void decoder_impl::flush()':
el_processor.cpp:186: error: 'outbuf' was not declared in this scope
el_processor.cpp:187: error: 'inbuf' was not declared in this scope
el_processor.cpp: In member function 'void decoder_impl::sample_rate(unsigned int)':
el_processor.cpp:198: error: 'filter' was not declared in this scope
el_processor.cpp:200: error: 'filter' was not declared in this scope
el_processor.cpp: In member function 'void decoder_impl::surround_coefficients(float, float)':
el_processor.cpp:212: error: 'cfloat' was not declared in this scope
el_processor.cpp:212: error: expected `;' before 'i'
el_processor.cpp:213: error: 'A' was not declared in this scope
el_processor.cpp:213: error: 'v' was not declared in this scope
el_processor.cpp:213: error: 'o' was not declared in this scope
el_processor.cpp:213: error: 'n' was not declared in this scope
el_processor.cpp:213: error: 'B' was not declared in this scope
el_processor.cpp:213: error: 'u' was not declared in this scope
el_processor.cpp:213: error: 'C' was not declared in this scope
el_processor.cpp:213: error: 'D' was not declared in this scope
el_processor.cpp:214: error: 'E' was not declared in this scope
el_processor.cpp:214: error: 'F' was not declared in this scope
el_processor.cpp:214: error: 'G' was not declared in this scope
el_processor.cpp:214: error: 'H' was not declared in this scope
el_processor.cpp: In member function 'void decoder_impl::surround_gain(float)':
el_processor.cpp:220: error: 'wnd' was not declared in this scope
el_processor.cpp: In member function 'void decoder_impl::add_output(float**, float**, float, float, float, bool)':
el_processor.cpp:253: error: 'outbuf' was not declared in this scope
el_processor.cpp: In member function 'void decoder_impl::block_decode(float**, float**, float**, float, float, float)':
el_processor.cpp:263: error: 'wnd' was not declared in this scope
el_processor.cpp:346: error: 'yfs' was not declared in this scope
el_processor.cpp:347: error: 'xfs' was not declared in this scope
el_processor.cpp:368: error: 'filter' was not declared in this scope
el_processor.cpp:381: error: 'xfs' was not declared in this scope
el_processor.cpp:384: error: 'yfs' was not declared in this scope
el_processor.cpp:413: error: 'filter' was not declared in this scope
el_processor.cpp:417: error: 'frontL' was not declared in this scope
el_processor.cpp:417: error: 'polar' was not declared in this scope
el_processor.cpp:418: error: 'frontR' was not declared in this scope
el_processor.cpp:419: error: 'avg' was not declared in this scope
el_processor.cpp:420: error: 'surL' was not declared in this scope
el_processor.cpp:421: error: 'surR' was not declared in this scope
el_processor.cpp:422: error: 'trueavg' was not declared in this scope
el_processor.cpp:422: error: 'cfloat' was not declared in this scope
el_processor.cpp:426: error: 'frontL' was not declared in this scope
el_processor.cpp:426: error: 'filter' was not declared in this scope
el_processor.cpp:427: error: 'avg' was not declared in this scope
el_processor.cpp:428: error: 'frontR' was not declared in this scope
el_processor.cpp:429: error: 'surL' was not declared in this scope
el_processor.cpp:430: error: 'surR' was not declared in this scope
el_processor.cpp:431: error: 'trueavg' was not declared in this scope
el_processor.cpp: In member function 'void decoder_impl::apply_filter(int*, float*, float*)':
el_processor.cpp:487: error: request for member 'real' in '*(((int*)(f * 4u)) + signal)', which is of non-class type 'int'
el_processor.cpp:488: error: request for member 'imag' in '*(((int*)(f * 4u)) + signal)', which is of non-class type 'int'
el_processor.cpp:518: error: 'wnd' was not declared in this scope
make[2]: *** [el_processor.o] Error 1
make[2]: Leaving directory `/home/hads/src/mythtv/libs/libmythfreesurround'
make[1]: *** [sub-libmythfreesurround] Error 2
make[1]: Leaving directory `/home/hads/src/mythtv/libs'
make: *** [sub-libs] Error 2
hads@smokey:~/src/mythtv$