All pastes #901610 Raw Edit

Miscellany

public text v1 · immutable
·published 2008-02-12 20:18 UTC
rendered paste body
[ 24%] Built target archiveengine
make -f src/streams/tests/CMakeFiles/testrunner-streams.dir/build.make src/streams/tests/CMakeFiles/testrunner-streams.dir/depend
make[2]:`/home/kde4-devel/kde/build/kdesupport/strigi' dizinine giriliyor
cd /home/kde4-devel/kde/build/kdesupport/strigi && /usr/bin/cmake -E cmake_depends "Unix Makefiles" /home/kde4-devel/kde/src/kdesupport/strigi /home/kde4-devel/kde/src/kdesupport/strigi/src/streams/tests /home/kde4-devel/kde/build/kdesupport/strigi /home/kde4-devel/kde/build/kdesupport/strigi/src/streams/tests /home/kde4-devel/kde/build/kdesupport/strigi/src/streams/tests/CMakeFiles/testrunner-streams.dir/DependInfo.cmake --color=
Scanning dependencies of target testrunner-streams
make[2]: `/home/kde4-devel/kde/build/kdesupport/strigi' dizininden çıkılıyor
make -f src/streams/tests/CMakeFiles/testrunner-streams.dir/build.make src/streams/tests/CMakeFiles/testrunner-streams.dir/build
make[2]:`/home/kde4-devel/kde/build/kdesupport/strigi' dizinine giriliyor
Linking CXX executable testrunner-streams
cd /home/kde4-devel/kde/build/kdesupport/strigi/src/streams/tests && /usr/bin/cmake -E cmake_link_script CMakeFiles/testrunner-streams.dir/link.txt --verbose=1
/usr/bin/c++    -Wnon-virtual-dtor -Wno-long-long -ansi -Wundef -Wcast-align -Wchar-subscripts -Wall -W -Wpointer-arith -Wformat-security -fno-check-new -fno-common -fno-exceptions -Wno-unused-parameter -fvisibility=hidden -fvisibility-inlines-hidden  -fPIC "CMakeFiles/testrunner-streams.dir/testrunner.cpp.o" "CMakeFiles/testrunner-streams.dir/Base64InputStreamTest.cpp.o" "CMakeFiles/testrunner-streams.dir/BZ2InputStreamTest.cpp.o" "CMakeFiles/testrunner-streams.dir/EventInputStreamTest.cpp.o" "CMakeFiles/testrunner-streams.dir/FileInputStreamTest.cpp.o" "CMakeFiles/testrunner-streams.dir/GZipInputStreamTest.cpp.o" "CMakeFiles/testrunner-streams.dir/InputStreamReaderTest.cpp.o" "CMakeFiles/testrunner-streams.dir/InputStreamTest.cpp.o" "CMakeFiles/testrunner-streams.dir/KmpSearcherTest.cpp.o" "CMakeFiles/testrunner-streams.dir/MailInputStreamTest.cpp.o" "CMakeFiles/testrunner-streams.dir/RpmInputStreamTest.cpp.o" "CMakeFiles/testrunner-streams.dir/StringTerminatedSubStreamTest.cpp.o" "CMakeFiles/testrunner-streams.dir/SubInputStreamTest.cpp.o" "CMakeFiles/testrunner-streams.dir/SdfInputStreamTest.cpp.o" "CMakeFiles/testrunner-streams.dir/TarInputStreamTest.cpp.o" "CMakeFiles/testrunner-streams.dir/ZipInputStreamTest.cpp.o" "CMakeFiles/testrunner-streams.dir/stat64bitTest.cpp.o" "CMakeFiles/testrunner-streams.dir/ArchiveReaderTest.cpp.o" "CMakeFiles/testrunner-streams.dir/ProcessInputStreamTest.cpp.o" "CMakeFiles/testrunner-streams.dir/StringStreamTest.cpp.o" "CMakeFiles/testrunner-streams.dir/inputstreamtests.cpp.o"  -o testrunner-streams -rdynamic ../libstreams.so.0.5.7 -lz -lbz2 /usr/bin/iconv -Wl,-rpath,/home/kde4-devel/kde/build/kdesupport/strigi/src/streams:/usr/lib
Linking CXX shared library libstrigiqtdbusclient.so
cd /home/kde4-devel/kde/build/kdesupport/strigi/src/searchclient/qtdbus && /usr/bin/cmake -E cmake_link_script CMakeFiles/strigiqtdbusclient.dir/link.txt --verbose=1
/usr/bin/c++  -fPIC  -Wnon-virtual-dtor -Wno-long-long -ansi -Wundef -Wcast-align -Wchar-subscripts -Wall -W -Wpointer-arith -Wformat-security -fno-check-new -fno-common -fno-exceptions -Wno-unused-parameter -fvisibility=hidden -fvisibility-inlines-hidden  -shared -Wl,-soname,libstrigiqtdbusclient.so.0 -o libstrigiqtdbusclient.so.0.5.7 "CMakeFiles/strigiqtdbusclient.dir/strigiasyncclient.cpp.o" "CMakeFiles/strigiqtdbusclient.dir/strigiclient.cpp.o" "CMakeFiles/strigiqtdbusclient.dir/strigidbus.cpp.o" "CMakeFiles/strigiqtdbusclient.dir/strigitypes.cpp.o" "CMakeFiles/strigiqtdbusclient.dir/moc_strigiasyncclient.cxx.o" "CMakeFiles/strigiqtdbusclient.dir/moc_strigidbus.cxx.o" -lQtCore -lpthread -lQtDBus -Wl,-rpath,/usr/lib
/usr/bin/ld: ../libstreams.so.0.5.7: EntryEEEeqERKS5_: invalid version 2 (max 0)
../libstreams.so.0.5.7: could not read symbols: Bad value
collect2: ld çıkış durumu 1 ile döndü
make[2]: *** [src/streams/tests/testrunner-streams] Hata 1
make[2]: `/home/kde4-devel/kde/build/kdesupport/strigi' dizininden çıkılıyor
make[1]: *** [src/streams/tests/CMakeFiles/testrunner-streams.dir/all] Hata 2
make[1]: *** Bitmemiş işler için bekliyor....
cd /home/kde4-devel/kde/build/kdesupport/strigi/src/searchclient/qtdbus && /usr/bin/cmake -E cmake_symlink_library libstrigiqtdbusclient.so.0.5.7 libstrigiqtdbusclient.so.0 libstrigiqtdbusclient.so
make[2]: `/home/kde4-devel/kde/build/kdesupport/strigi' dizininden çıkılıyor
/usr/bin/cmake -E cmake_progress_report /home/kde4-devel/kde/build/kdesupport/strigi/CMakeFiles  82 83 84
[ 25%] Built target strigiqtdbusclient
make[1]: `/home/kde4-devel/kde/build/kdesupport/strigi' dizininden çıkılıyor
make: *** [all] Hata 2