All pastes #900805 Raw Edit

Something

public cpp v1 · immutable
·published 2008-02-12 04:47 UTC
rendered paste body
------ Build started: Project: InstanceScripts, Configuration: Release Win32 ------Compiling...Raid_OnyxiasLair.cpp..\src\InstanceScripts\Raid_OnyxiasLair.cpp(21) : error C2550: 'LadyAnacondraAI' : constructor initializer lists are only allowed on constructor definitions..\src\InstanceScripts\Raid_OnyxiasLair.cpp(22) : error C2065: 'nrspells' : undeclared identifier..\src\InstanceScripts\Raid_OnyxiasLair.cpp(25) : error C2065: 'm_spellcheck' : undeclared identifier..\src\InstanceScripts\Raid_OnyxiasLair.cpp(28) : error C2143: syntax error : missing ';' before '['..\src\InstanceScripts\Raid_OnyxiasLair.cpp(28) : error C3409: empty attribute block is not allowed..\src\InstanceScripts\Raid_OnyxiasLair.cpp(28) : error C2143: syntax error : missing ']' before 'constant'..\src\InstanceScripts\Raid_OnyxiasLair.cpp(28) : error C2143: syntax error : missing ';' before 'constant'..\src\InstanceScripts\Raid_OnyxiasLair.cpp(28) : error C2143: syntax error : missing ';' before ']'..\src\InstanceScripts\Raid_OnyxiasLair.cpp(28) : error C2143: syntax error : missing ';' before ']'..\src\InstanceScripts\Raid_OnyxiasLair.cpp(29) : error C2143: syntax error : missing ';' before '['..\src\InstanceScripts\Raid_OnyxiasLair.cpp(29) : error C3409: empty attribute block is not allowed..\src\InstanceScripts\Raid_OnyxiasLair.cpp(29) : error C2143: syntax error : missing ']' before 'constant'..\src\InstanceScripts\Raid_OnyxiasLair.cpp(29) : error C2143: syntax error : missing ';' before 'constant'..\src\InstanceScripts\Raid_OnyxiasLair.cpp(29) : error C2143: syntax error : missing ';' before ']'..\src\InstanceScripts\Raid_OnyxiasLair.cpp(29) : error C2143: syntax error : missing ';' before ']'..\src\InstanceScripts\Raid_OnyxiasLair.cpp(31) : error C2143: syntax error : missing ';' before '['..\src\InstanceScripts\Raid_OnyxiasLair.cpp(31) : error C3409: empty attribute block is not allowed..\src\InstanceScripts\Raid_OnyxiasLair.cpp(31) : error C2143: syntax error : missing ']' before 'constant'..\src\InstanceScripts\Raid_OnyxiasLair.cpp(31) : error C2143: syntax error : missing ';' before 'constant'..\src\InstanceScripts\Raid_OnyxiasLair.cpp(31) : error C2143: syntax error : missing ';' before ']'..\src\InstanceScripts\Raid_OnyxiasLair.cpp(31) : error C2143: syntax error : missing ';' before ']'..\src\InstanceScripts\Raid_OnyxiasLair.cpp(32) : error C2143: syntax error : missing ';' before '['..\src\InstanceScripts\Raid_OnyxiasLair.cpp(32) : error C3409: empty attribute block is not allowed..\src\InstanceScripts\Raid_OnyxiasLair.cpp(32) : error C2143: syntax error : missing ']' before 'constant'..\src\InstanceScripts\Raid_OnyxiasLair.cpp(32) : error C2143: syntax error : missing ';' before 'constant'..\src\InstanceScripts\Raid_OnyxiasLair.cpp(32) : error C2143: syntax error : missing ';' before ']'..\src\InstanceScripts\Raid_OnyxiasLair.cpp(32) : error C2143: syntax error : missing ';' before ']'..\src\InstanceScripts\Raid_OnyxiasLair.cpp(35) : error C2143: syntax error : missing ';' before '['..\src\InstanceScripts\Raid_OnyxiasLair.cpp(35) : error C3409: empty attribute block is not allowed..\src\InstanceScripts\Raid_OnyxiasLair.cpp(35) : error C2143: syntax error : missing ']' before 'constant'..\src\InstanceScripts\Raid_OnyxiasLair.cpp(35) : error C2143: syntax error : missing ';' before 'constant'..\src\InstanceScripts\Raid_OnyxiasLair.cpp(35) : error C2143: syntax error : missing ';' before ']'..\src\InstanceScripts\Raid_OnyxiasLair.cpp(35) : error C2143: syntax error : missing ';' before ']'..\src\InstanceScripts\Raid_OnyxiasLair.cpp(36) : error C2143: syntax error : missing ';' before '['..\src\InstanceScripts\Raid_OnyxiasLair.cpp(36) : error C3409: empty attribute block is not allowed..\src\InstanceScripts\Raid_OnyxiasLair.cpp(36) : error C2143: syntax error : missing ']' before 'constant'..\src\InstanceScripts\Raid_OnyxiasLair.cpp(36) : error C2143: syntax error : missing ';' before 'constant'..\src\InstanceScripts\Raid_OnyxiasLair.cpp(36) : error C2143: syntax error : missing ';' before ']'..\src\InstanceScripts\Raid_OnyxiasLair.cpp(36) : error C2143: syntax error : missing ';' before ']'..\src\InstanceScripts\Raid_OnyxiasLair.cpp(38) : error C2143: syntax error : missing ';' before '['..\src\InstanceScripts\Raid_OnyxiasLair.cpp(38) : error C3409: empty attribute block is not allowed..\src\InstanceScripts\Raid_OnyxiasLair.cpp(38) : error C2143: syntax error : missing ']' before 'constant'..\src\InstanceScripts\Raid_OnyxiasLair.cpp(38) : error C2143: syntax error : missing ';' before 'constant'..\src\InstanceScripts\Raid_OnyxiasLair.cpp(38) : error C2143: syntax error : missing ';' before ']'..\src\InstanceScripts\Raid_OnyxiasLair.cpp(38) : error C2143: syntax error : missing ';' before ']'..\src\InstanceScripts\Raid_OnyxiasLair.cpp(39) : error C2143: syntax error : missing ';' before '['..\src\InstanceScripts\Raid_OnyxiasLair.cpp(39) : error C3409: empty attribute block is not allowed..\src\InstanceScripts\Raid_OnyxiasLair.cpp(39) : error C2143: syntax error : missing ']' before 'constant'..\src\InstanceScripts\Raid_OnyxiasLair.cpp(39) : error C2143: syntax error : missing ';' before 'constant'..\src\InstanceScripts\Raid_OnyxiasLair.cpp(39) : error C2143: syntax error : missing ';' before ']'..\src\InstanceScripts\Raid_OnyxiasLair.cpp(39) : error C2143: syntax error : missing ';' before ']'..\src\InstanceScripts\Raid_OnyxiasLair.cpp(16) : error C2664: 'LadyAnacondraAI::LadyAnacondraAI' : cannot convert parameter 1 from 'Creature *' to 'const LadyAnacondraAI &'        Reason: cannot convert from 'Creature *' to 'const LadyAnacondraAI'        No constructor could take the source type, or constructor overload resolution was ambiguous..\src\InstanceScripts\Raid_OnyxiasLair.cpp(47) : error C2065: '_unit' : undeclared identifier..\src\InstanceScripts\Raid_OnyxiasLair.cpp(47) : error C2227: left of '->GetUInt32Value' must point to class/struct/union/generic type        type is ''unknown-type''..\src\InstanceScripts\Raid_OnyxiasLair.cpp(47) : error C3861: 'RegisterAIUpdateEvent': identifier not found..\src\InstanceScripts\Raid_OnyxiasLair.cpp(48) : error C2227: left of '->SendChatMessage' must point to class/struct/union/generic type        type is ''unknown-type''..\src\InstanceScripts\Raid_OnyxiasLair.cpp(54) : error C2227: left of '->GetAIInterface' must point to class/struct/union/generic type        type is ''unknown-type''..\src\InstanceScripts\Raid_OnyxiasLair.cpp(54) : error C2227: left of '->setCurrentAgent' must point to class/struct/union/generic type..\src\InstanceScripts\Raid_OnyxiasLair.cpp(55) : error C2227: left of '->GetAIInterface' must point to class/struct/union/generic type        type is ''unknown-type''..\src\InstanceScripts\Raid_OnyxiasLair.cpp(55) : error C2227: left of '->SetAIState' must point to class/struct/union/generic type..\src\InstanceScripts\Raid_OnyxiasLair.cpp(56) : error C3861: 'RemoveAIUpdateEvent': identifier not found..\src\InstanceScripts\Raid_OnyxiasLair.cpp(62) : error C3861: 'RemoveAIUpdateEvent': identifier not found..\src\InstanceScripts\Raid_OnyxiasLair.cpp(67) : error C2065: 'sRand' : undeclared identifier..\src\InstanceScripts\Raid_OnyxiasLair.cpp(67) : error C2228: left of '.rand' must have class/struct/union        type is ''unknown-type''..\src\InstanceScripts\Raid_OnyxiasLair.cpp(68) : error C3861: 'SpellCast': identifier not found..\src\InstanceScripts\Raid_OnyxiasLair.cpp(72) : error C2365: 'SpellCast' : redefinition; previous definition was 'formerly unknown identifier'..\src\InstanceScripts\Raid_OnyxiasLair.cpp(73) : error C2227: left of '->GetCurrentSpell' must point to class/struct/union/generic type        type is ''unknown-type''..\src\InstanceScripts\Raid_OnyxiasLair.cpp(73) : error C2227: left of '->GetAIInterface' must point to class/struct/union/generic type        type is ''unknown-type''..\src\InstanceScripts\Raid_OnyxiasLair.cpp(73) : error C2227: left of '->GetNextTarget' must point to class/struct/union/generic type..\src\InstanceScripts\Raid_OnyxiasLair.cpp(79) : error C2275: 'spells' : illegal use of this type as an expression        c:\ascent\server\trunk\src\ascent-world\Player.h(191) : see declaration of 'spells'..\src\InstanceScripts\Raid_OnyxiasLair.cpp(79) : error C2228: left of '.perctrigger' must have class/struct/union..\src\InstanceScripts\Raid_OnyxiasLair.cpp(83) : error C2227: left of '->GetAIInterface' must point to class/struct/union/generic type        type is ''unknown-type''..\src\InstanceScripts\Raid_OnyxiasLair.cpp(83) : error C2227: left of '->GetNextTarget' must point to class/struct/union/generic type..\src\InstanceScripts\Raid_OnyxiasLair.cpp(84) : error C2059: syntax error : '['..\src\InstanceScripts\Raid_OnyxiasLair.cpp(85) : error C2143: syntax error : missing ';' before '{'..\src\InstanceScripts\Raid_OnyxiasLair.cpp(86) : error C2046: illegal case..\src\InstanceScripts\Raid_OnyxiasLair.cpp(87) : error C2046: illegal case..\src\InstanceScripts\Raid_OnyxiasLair.cpp(88) : error C2227: left of '->CastSpell' must point to class/struct/union/generic type        type is ''unknown-type''..\src\InstanceScripts\Raid_OnyxiasLair.cpp(88) : error C2275: 'spells' : illegal use of this type as an expression        c:\ascent\server\trunk\src\ascent-world\Player.h(191) : see declaration of 'spells'..\src\InstanceScripts\Raid_OnyxiasLair.cpp(88) : error C2228: left of '.info' must have class/struct/union..\src\InstanceScripts\Raid_OnyxiasLair.cpp(88) : error C2275: 'spells' : illegal use of this type as an expression        c:\ascent\server\trunk\src\ascent-world\Player.h(191) : see declaration of 'spells'..\src\InstanceScripts\Raid_OnyxiasLair.cpp(88) : error C2228: left of '.instant' must have class/struct/union..\src\InstanceScripts\Raid_OnyxiasLair.cpp(89) : error C2046: illegal case..\src\InstanceScripts\Raid_OnyxiasLair.cpp(90) : error C2227: left of '->CastSpell' must point to class/struct/union/generic type        type is ''unknown-type''..\src\InstanceScripts\Raid_OnyxiasLair.cpp(90) : error C2275: 'spells' : illegal use of this type as an expression        c:\ascent\server\trunk\src\ascent-world\Player.h(191) : see declaration of 'spells'..\src\InstanceScripts\Raid_OnyxiasLair.cpp(90) : error C2228: left of '.info' must have class/struct/union..\src\InstanceScripts\Raid_OnyxiasLair.cpp(90) : error C2275: 'spells' : illegal use of this type as an expression        c:\ascent\server\trunk\src\ascent-world\Player.h(191) : see declaration of 'spells'..\src\InstanceScripts\Raid_OnyxiasLair.cpp(90) : error C2228: left of '.instant' must have class/struct/union..\src\InstanceScripts\Raid_OnyxiasLair.cpp(92) : error C2046: illegal case..\src\InstanceScripts\Raid_OnyxiasLair.cpp(93) : error C2227: left of '->CastSpellAoF' must point to class/struct/union/generic type        type is ''unknown-type''..\src\InstanceScripts\Raid_OnyxiasLair.cpp(93) : error C2275: 'spells' : illegal use of this type as an expression        c:\ascent\server\trunk\src\ascent-world\Player.h(191) : see declaration of 'spells'..\src\InstanceScripts\Raid_OnyxiasLair.cpp(93) : error C2228: left of '.info' must have class/struct/union..\src\InstanceScripts\Raid_OnyxiasLair.cpp(93) : error C2275: 'spells' : illegal use of this type as an expression        c:\ascent\server\trunk\src\ascent-world\Player.h(191) : see declaration of 'spells'..\src\InstanceScripts\Raid_OnyxiasLair.cpp(93) : error C2228: left of '.instant' must have class/struct/union..\src\InstanceScripts\Raid_OnyxiasLair.cpp(99) : error C2275: 'spells' : illegal use of this type as an expression        c:\ascent\server\trunk\src\ascent-world\Player.h(191) : see declaration of 'spells'..\src\InstanceScripts\Raid_OnyxiasLair.cpp(99) : error C2228: left of '.perctrigger' must have class/struct/union..\src\InstanceScripts\Raid_OnyxiasLair.cpp(101) : error C2227: left of '->setAttackTimer' must point to class/struct/union/generic type        type is ''unknown-type''..\src\InstanceScripts\Raid_OnyxiasLair.cpp(101) : error C2275: 'spells' : illegal use of this type as an expression        c:\ascent\server\trunk\src\ascent-world\Player.h(191) : see declaration of 'spells'..\src\InstanceScripts\Raid_OnyxiasLair.cpp(101) : error C2228: left of '.attackstoptimer' must have class/struct/union..\src\InstanceScripts\Raid_OnyxiasLair.cpp(104) : error C2275: 'spells' : illegal use of this type as an expression        c:\ascent\server\trunk\src\ascent-world\Player.h(191) : see declaration of 'spells'..\src\InstanceScripts\Raid_OnyxiasLair.cpp(104) : error C2228: left of '.perctrigger' must have class/struct/union..\src\InstanceScripts\Raid_OnyxiasLair.cpp(104) : fatal error C1003: error count exceeds 100; stopping compilationBuild log was saved at "file://c:\Ascent\Server\trunk\src\scripts\projects\2005_int_release_instancescripts\BuildLog.htm"InstanceScripts - 102 error(s), 0 warning(s)========== Build: 0 succeeded, 1 failed, 0 up-to-date, 0 skipped ==========