i686-pc-linux-gnu-gcc -DHAVE_CONFIG_H -I. -I. -I.. -I../gl -I../lib -I../includes -I../includes -I../lib/minitasn1 -I./openpgp -I/usr/include -I/usr/include -march=i686 -O2 -pipe -fomit-frame-pointer -D_REENTRANT -D_THREAD_SAFE -Wno-pointer-sign -pipe -MT gnutls_openpgp.lo -MD -MP -MF .deps/gnutls_openpgp.Tpo -c gnutls_openpgp.c -fPIC -DPIC -o .libs/gnutls_openpgp.o
i686-pc-linux-gnu-gcc -DHAVE_CONFIG_H -I. -I. -I.. -I../gl -I../lib -I../includes -I../includes -I../lib/minitasn1 -I./openpgp -I/usr/include -I/usr/include -march=i686 -O2 -pipe -fomit-frame-pointer -D_REENTRANT -D_THREAD_SAFE -Wno-pointer-sign -pipe -MT gnutls_extra.lo -MD -MP -MF .deps/gnutls_extra.Tpo -c gnutls_extra.c -fPIC -DPIC -o .libs/gnutls_extra.o
i686-pc-linux-gnu-gcc -DHAVE_CONFIG_H -I. -I. -I.. -I../gl -I../lib -I../includes -I../includes -I../lib/minitasn1 -I./openpgp -I/usr/include -I/usr/include -march=i686 -O2 -pipe -fomit-frame-pointer -D_REENTRANT -D_THREAD_SAFE -Wno-pointer-sign -pipe -MT gnutls_ia.lo -MD -MP -MF .deps/gnutls_ia.Tpo -c gnutls_ia.c -fPIC -DPIC -o .libs/gnutls_ia.o
gnutls_openpgp.c: In function 'openpgp_pk_to_gnutls_cert':
gnutls_openpgp.c:294: warning: passing argument 4 of 'cdk_pk_get_mpi' makes integer from pointer without a cast
gnutls_openpgp.c:294: error: too few arguments to function 'cdk_pk_get_mpi'
gnutls_openpgp.c: In function '_gnutls_openpgp_raw_privkey_to_gkey':
gnutls_openpgp.c:337: warning: assignment makes pointer from integer without a cast
gnutls_openpgp.c:363: warning: passing argument 4 of 'cdk_pk_get_mpi' makes integer from pointer without a cast
gnutls_openpgp.c:363: error: too few arguments to function 'cdk_pk_get_mpi'
gnutls_openpgp.c:376: warning: passing argument 4 of 'cdk_sk_get_mpi' makes integer from pointer without a cast
gnutls_openpgp.c:376: error: too few arguments to function 'cdk_sk_get_mpi'
gnutls_openpgp.c: In function 'gnutls_certificate_set_openpgp_key_mem':
gnutls_openpgp.c:583: error: too few arguments to function 'cdk_stream_tmp_from_mem'
gnutls_openpgp.c:673: error: too few arguments to function 'cdk_stream_tmp_from_mem'
gnutls_openpgp.c: In function 'gnutls_certificate_set_openpgp_keyring_mem':
gnutls_openpgp.c:946: error: too few arguments to function 'cdk_stream_tmp_from_mem'
i686-pc-linux-gnu-gcc -DHAVE_CONFIG_H -I. -I. -I.. -I../gl -I../lib -I../includes -I../includes -I../lib/minitasn1 -I./openpgp -I/usr/include -I/usr/include -march=i686 -O2 -pipe -fomit-frame-pointer -D_REENTRANT -D_THREAD_SAFE -Wno-pointer-sign -pipe -MT gnutls_extra.lo -MD -MP -MF .deps/gnutls_extra.Tpo -c gnutls_extra.c -o gnutls_extra.o >/dev/null 2>&1
make[3]: *** [gnutls_openpgp.lo] Error 1
make[3]: *** Waiting for unfinished jobs....
i686-pc-linux-gnu-gcc -DHAVE_CONFIG_H -I. -I. -I.. -I../gl -I../lib -I../includes -I../includes -I../lib/minitasn1 -I./openpgp -I/usr/include -I/usr/include -march=i686 -O2 -pipe -fomit-frame-pointer -D_REENTRANT -D_THREAD_SAFE -Wno-pointer-sign -pipe -MT gnutls_ia.lo -MD -MP -MF .deps/gnutls_ia.Tpo -c gnutls_ia.c -o gnutls_ia.o >/dev/null 2>&1
make[3]: Leaving directory `/var/tmp/portage/net-libs/gnutls-1.4.4-r1/work/gnutls-1.4.4/libextra'
make[2]: *** [all-recursive] Error 1
make[2]: Leaving directory `/var/tmp/portage/net-libs/gnutls-1.4.4-r1/work/gnutls-1.4.4/libextra'
make[1]: *** [all-recursive] Error 1
make[1]: Leaving directory `/var/tmp/portage/net-libs/gnutls-1.4.4-r1/work/gnutls-1.4.4'
make: *** [all] Error 2
*
* ERROR: net-libs/gnutls-1.4.4-r1 failed.
* Call stack:
* ebuild.sh, line 1701: Called dyn_compile
* ebuild.sh, line 1039: Called qa_call 'src_compile'
* ebuild.sh, line 44: Called src_compile
* gnutls-1.4.4-r1.ebuild, line 52: Called die
* The specific snippet of code:
* emake || die
* The die message:
* (no error message)
*
* If you need support, post the topmost build error, and the call stack if relevant.
* A complete build log is located at '/var/tmp/portage/net-libs/gnutls-1.4.4-r1/temp/build.log'.
*
satellite ~ #