rendered paste bodyMaking install in src
make[1]: Entering directory `/home/bnc/sbnc1.2/sbnc-1.2/src'
Making install in snprintf
make[2]: Entering directory `/home/bnc/sbnc1.2/sbnc-1.2/src/snprintf'
make[3]: Entering directory `/home/bnc/sbnc1.2/sbnc-1.2/src/snprintf'
make[3]: Nothing to be done for `install-exec-am'.
make[3]: Nothing to be done for `install-data-am'.
make[3]: Leaving directory `/home/bnc/sbnc1.2/sbnc-1.2/src/snprintf'
make[2]: Leaving directory `/home/bnc/sbnc1.2/sbnc-1.2/src/snprintf'
Making install in md5
make[2]: Entering directory `/home/bnc/sbnc1.2/sbnc-1.2/src/md5'
make[3]: Entering directory `/home/bnc/sbnc1.2/sbnc-1.2/src/md5'
make[3]: Nothing to be done for `install-exec-am'.
make[3]: Nothing to be done for `install-data-am'.
make[3]: Leaving directory `/home/bnc/sbnc1.2/sbnc-1.2/src/md5'
make[2]: Leaving directory `/home/bnc/sbnc1.2/sbnc-1.2/src/md5'
Making install in libltdl
make[2]: Entering directory `/home/bnc/sbnc1.2/sbnc-1.2/src/libltdl'
make[3]: Entering directory `/home/bnc/sbnc1.2/sbnc-1.2/src/libltdl'
make[3]: Nothing to be done for `install-exec-am'.
make[3]: Nothing to be done for `install-data-am'.
make[3]: Leaving directory `/home/bnc/sbnc1.2/sbnc-1.2/src/libltdl'
make[2]: Leaving directory `/home/bnc/sbnc1.2/sbnc-1.2/src/libltdl'
Making install in rpc
make[2]: Entering directory `/home/bnc/sbnc1.2/sbnc-1.2/src/rpc'
make[3]: Entering directory `/home/bnc/sbnc1.2/sbnc-1.2/src/rpc'
make[3]: Nothing to be done for `install-exec-am'.
make[3]: Nothing to be done for `install-data-am'.
make[3]: Leaving directory `/home/bnc/sbnc1.2/sbnc-1.2/src/rpc'
make[2]: Leaving directory `/home/bnc/sbnc1.2/sbnc-1.2/src/rpc'
Making install in sbncloader
make[2]: Entering directory `/home/bnc/sbnc1.2/sbnc-1.2/src/sbncloader'
make[3]: Entering directory `/home/bnc/sbnc1.2/sbnc-1.2/src/sbncloader'
/bin/sh ../../mkinstalldirs /root/sbnc
/bin/sh ../../libtool --mode=install /usr/bin/install -c sbnc /root/sbnc/sbnc
/usr/bin/install -c sbnc /root/sbnc/sbnc
make[3]: Nothing to be done for `install-data-am'.
make[3]: Leaving directory `/home/bnc/sbnc1.2/sbnc-1.2/src/sbncloader'
make[2]: Leaving directory `/home/bnc/sbnc1.2/sbnc-1.2/src/sbncloader'
Making install in c-ares
make[2]: Entering directory `/home/bnc/sbnc1.2/sbnc-1.2/src/c-ares'
make[3]: Entering directory `/home/bnc/sbnc1.2/sbnc-1.2/src/c-ares'
make[3]: Nothing to be done for `install-exec-am'.
make[3]: Nothing to be done for `install-data-am'.
make[3]: Leaving directory `/home/bnc/sbnc1.2/sbnc-1.2/src/c-ares'
make[2]: Leaving directory `/home/bnc/sbnc1.2/sbnc-1.2/src/c-ares'
make[2]: Entering directory `/home/bnc/sbnc1.2/sbnc-1.2/src'
make[3]: Entering directory `/home/bnc/sbnc1.2/sbnc-1.2/src'
/bin/sh ../mkinstalldirs /root/sbnc/lib-0
/bin/sh ../libtool --mode=install /usr/bin/install -c libsbnc.la /root/sbnc/lib-0/libsbnc.la
/usr/bin/install -c .libs/libsbnc.so.0.0.0 /root/sbnc/lib-0/libsbnc.so.0.0.0
(cd /root/sbnc/lib-0 && rm -f libsbnc.so.0 && ln -s libsbnc.so.0.0.0 libsbnc.so.0)
(cd /root/sbnc/lib-0 && rm -f libsbnc.so && ln -s libsbnc.so.0.0.0 libsbnc.so)
/usr/bin/install -c .libs/libsbnc.lai /root/sbnc/lib-0/libsbnc.la
libtool: install: warning: remember to run `libtool --finish /home/bnc/sbnc/lib-0'
make[3]: Nothing to be done for `install-data-am'.
make[3]: Leaving directory `/home/bnc/sbnc1.2/sbnc-1.2/src'
make[2]: Leaving directory `/home/bnc/sbnc1.2/sbnc-1.2/src'
make[1]: Leaving directory `/home/bnc/sbnc1.2/sbnc-1.2/src'
Making install in bnctcl
make[1]: Entering directory `/home/bnc/sbnc1.2/sbnc-1.2/bnctcl'
make[2]: Entering directory `/home/bnc/sbnc1.2/sbnc-1.2/bnctcl'
/bin/sh ../mkinstalldirs /root/sbnc/lib-0/
/bin/sh ../libtool --mode=install /usr/bin/install -c libbnctcl.la /root/sbnc/lib-0//libbnctcl.la
libtool: install: error: cannot install `libbnctcl.la' to a directory not ending in /home/bnc/sbnc/lib-0/
make[2]: *** [install-pkglibLTLIBRARIES] Error 1
make[2]: Leaving directory `/home/bnc/sbnc1.2/sbnc-1.2/bnctcl'
make[1]: *** [install-am] Error 2
make[1]: Leaving directory `/home/bnc/sbnc1.2/sbnc-1.2/bnctcl'
make: *** [install-recursive] Error 1