>>> Emerging (1 of 1) net-wireless/rt2570-20070209 to /
* rt2570-20070209.tar.bz2 RMD160 SHA1 SHA256 size ;-) ... [ ok ]
* checking ebuild checksums ;-) ... [ ok ]
* checking auxfile checksums ;-) ... [ ok ]
* checking miscfile checksums ;-) ... [ ok ]
* checking rt2570-20070209.tar.bz2 ;-) ... [ ok ]
* Determining the location of the kernel source code
* Found kernel source directory:
* /usr/src/linux
* Found kernel object directory:
* /lib/modules/2.6.23-sabayon-r1/build
* Found sources for kernel version:
* 2.6.23-sabayon-r1
* Checking for suitable kernel configuration options... [ ok ]
>>> Unpacking source...
>>> Unpacking rt2570-20070209.tar.bz2 to /var/tmp/portage/net-wireless/rt2570-20070209/work
>>> Source unpacked.
>>> Compiling source in /var/tmp/portage/net-wireless/rt2570-20070209/work/rt2570-20070209 ...
* Preparing rt2570 module
/var/tmp/portage/net-wireless/rt2570-20070209/work/rt2570-20070209/Module/rtusb_main.c: In function ‘usb_rtusb_probe’:
/var/tmp/portage/net-wireless/rt2570-20070209/work/rt2570-20070209/Module/rtusb_main.c:1907: error: ‘dev_base’ undeclared (first use in this function)
/var/tmp/portage/net-wireless/rt2570-20070209/work/rt2570-20070209/Module/rtusb_main.c:1907: error: (Each undeclared identifier is reported only once
/var/tmp/portage/net-wireless/rt2570-20070209/work/rt2570-20070209/Module/rtusb_main.c:1907: error: for each function it appears in.)
/var/tmp/portage/net-wireless/rt2570-20070209/work/rt2570-20070209/Module/rtusb_main.c:1907: error: ‘struct net_device’ has no member named ‘next’
make[1]: *** [/var/tmp/portage/net-wireless/rt2570-20070209/work/rt2570-20070209/Module/rtusb_main.o] Error 1
make[1]: *** Waiting for unfinished jobs....
make: *** [_module_/var/tmp/portage/net-wireless/rt2570-20070209/work/rt2570-20070209/Module] Error 2
*
* ERROR: net-wireless/rt2570-20070209 failed.
* Call stack:
* ebuild.sh, line 1701: Called dyn_compile
* ebuild.sh, line 1039: Called qa_call 'src_compile'
* ebuild.sh, line 44: Called src_compile
* ebuild.sh, line 1383: Called linux-mod_src_compile
* linux-mod.eclass, line 519: Called die
* The specific snippet of code:
* emake HOSTCC="$(tc-getBUILD_CC)" CC="$(get-KERNEL_CC)" LDFLAGS="$(get_abi_LDFLAGS)" \
* ${BUILD_FIXES} ${BUILD_PARAMS} ${BUILD_TARGETS} \
* || die "Unable to make ${BUILD_FIXES} ${BUILD_PARAMS} ${BUILD_TARGETS}."
* The die message:
* Unable to make -C /usr/src/linux M=/var/tmp/portage/net-wireless/rt2570-20070209/work/rt2570-20070209/Module modules.
*
* If you need support, post the topmost build error, and the call stack if relevant.
* A complete build log is located at '/var/tmp/portage/net-wireless/rt2570-20070209/temp/build.log'.
*
* Messages for package net-wireless/rt2570-20070209:
*
* ERROR: net-wireless/rt2570-20070209 failed.
* Call stack:
* ebuild.sh, line 1701: Called dyn_compile
* ebuild.sh, line 1039: Called qa_call 'src_compile'
* ebuild.sh, line 44: Called src_compile
* ebuild.sh, line 1383: Called linux-mod_src_compile
* linux-mod.eclass, line 519: Called die
* The specific snippet of code:
* emake HOSTCC="$(tc-getBUILD_CC)" CC="$(get-KERNEL_CC)" LDFLAGS="$(get_abi_LDFLAGS)" \
* ${BUILD_FIXES} ${BUILD_PARAMS} ${BUILD_TARGETS} \
* || die "Unable to make ${BUILD_FIXES} ${BUILD_PARAMS} ${BUILD_TARGETS}."
* The die message:
* Unable to make -C /usr/src/linux M=/var/tmp/portage/net-wireless/rt2570-20070209/work/rt2570-20070209/Module modules.
*
* If you need support, post the topmost build error, and the call stack if relevant.
* A complete build log is located at '/var/tmp/portage/net-wireless/rt2570-20070209/temp/build.log'.