root@neutrino:/SPACE/Builds/WIFI/Intel-iwl/iwlwifi# make clean
Removing stale, temporary, and built files...
root@neutrino:/SPACE/Builds/WIFI/Intel-iwl/iwlwifi# make
Checking kernel compatibility in:
/lib/modules/2.6.24/source
* Kernel requires compatibility version:
- Requires IEEE80211_CONF_CHANNEL_SWITCH compat.
- Remove CONFIG_IWL4965_HT option if defined
- Remove CONFIG_IWL4965_HT_AGG option if defined
Building compatibility version in 'compatible/' directory:
Copying compatible/ from origin/...done
+ Applying: patches/06-csa.patch
diff -urp old/iwl-helpers.h origin/iwl-helpers.h
make -C /lib/modules/2.6.24/source O=/lib/modules/2.6.24/build M=/SPACE/Builds/WIFI/Intel-iwl/iwlwifi/compatible/ EXTRA_CFLAGS="-DCONFIG_IWL3945_DEBUG=y -DCONFIG_IWL4965_DEBUG=y -DCONFIG_IWL3945_SPECTRUM_MEASUREMENT=y -DCONFIG_IWL4965_SPECTRUM_MEASUREMENT=y -DCONFIG_IWL4965_SENSITIVITY=y -DCONFIG_IWL3945_QOS=y -DCONFIG_IWL4965_QOS=y" modules
make[1]: Entering directory `/usr/src/linux-2.6.24'
CC [M] /SPACE/Builds/WIFI/Intel-iwl/iwlwifi/compatible/iwl3945-base.o
In file included from /SPACE/Builds/WIFI/Intel-iwl/iwlwifi/compatible/iwl3945-base.c:51:
/SPACE/Builds/WIFI/Intel-iwl/iwlwifi/compatible/iwl-3945.h:443: error: expected specifier-qualifier-list before 'ieee80211_key_alg'
/SPACE/Builds/WIFI/Intel-iwl/iwlwifi/compatible/iwl3945-base.c: In function 'iwl3945_add_station':
/SPACE/Builds/WIFI/Intel-iwl/iwlwifi/compatible/iwl3945-base.c:539: error: implicit declaration of function 'MAC_ARG'
/SPACE/Builds/WIFI/Intel-iwl/iwlwifi/compatible/iwl3945-base.c:539: warning: too few arguments for format
/SPACE/Builds/WIFI/Intel-iwl/iwlwifi/compatible/iwl3945-base.c: In function 'iwl3945_commit_rxon':
/SPACE/Builds/WIFI/Intel-iwl/iwlwifi/compatible/iwl3945-base.c:1161: warning: too few arguments for format
/SPACE/Builds/WIFI/Intel-iwl/iwlwifi/compatible/iwl3945-base.c: In function 'iwl3945_update_sta_key_info':
/SPACE/Builds/WIFI/Intel-iwl/iwlwifi/compatible/iwl3945-base.c:1400: error: 'struct iwl3945_hw_key' has no member named 'alg'
/SPACE/Builds/WIFI/Intel-iwl/iwlwifi/compatible/iwl3945-base.c:1401: error: 'struct iwl3945_hw_key' has no member named 'keylen'
/SPACE/Builds/WIFI/Intel-iwl/iwlwifi/compatible/iwl3945-base.c:1402: error: 'struct iwl3945_hw_key' has no member named 'key'
/SPACE/Builds/WIFI/Intel-iwl/iwlwifi/compatible/iwl3945-base.c:1402: error: 'struct iwl3945_hw_key' has no member named 'key'
/SPACE/Builds/WIFI/Intel-iwl/iwlwifi/compatible/iwl3945-base.c: In function 'iwl3945_build_tx_cmd_hwcrypto':
/SPACE/Builds/WIFI/Intel-iwl/iwlwifi/compatible/iwl3945-base.c:2594: error: 'struct iwl3945_hw_key' has no member named 'alg'
/SPACE/Builds/WIFI/Intel-iwl/iwlwifi/compatible/iwl3945-base.c:2597: error: 'struct iwl3945_hw_key' has no member named 'keylen'
/SPACE/Builds/WIFI/Intel-iwl/iwlwifi/compatible/iwl3945-base.c:2597: error: 'struct iwl3945_hw_key' has no member named 'key'
/SPACE/Builds/WIFI/Intel-iwl/iwlwifi/compatible/iwl3945-base.c:2597: error: 'struct iwl3945_hw_key' has no member named 'keylen'
/SPACE/Builds/WIFI/Intel-iwl/iwlwifi/compatible/iwl3945-base.c:2597: error: 'struct iwl3945_hw_key' has no member named 'key'
/SPACE/Builds/WIFI/Intel-iwl/iwlwifi/compatible/iwl3945-base.c:2597: error: 'struct iwl3945_hw_key' has no member named 'keylen'
/SPACE/Builds/WIFI/Intel-iwl/iwlwifi/compatible/iwl3945-base.c:2617: error: 'struct iwl3945_hw_key' has no member named 'keylen'
/SPACE/Builds/WIFI/Intel-iwl/iwlwifi/compatible/iwl3945-base.c:2620: error: 'struct iwl3945_hw_key' has no member named 'keylen'
/SPACE/Builds/WIFI/Intel-iwl/iwlwifi/compatible/iwl3945-base.c:2620: error: 'struct iwl3945_hw_key' has no member named 'key'
/SPACE/Builds/WIFI/Intel-iwl/iwlwifi/compatible/iwl3945-base.c:2620: error: 'struct iwl3945_hw_key' has no member named 'keylen'
/SPACE/Builds/WIFI/Intel-iwl/iwlwifi/compatible/iwl3945-base.c:2620: error: 'struct iwl3945_hw_key' has no member named 'key'
/SPACE/Builds/WIFI/Intel-iwl/iwlwifi/compatible/iwl3945-base.c:2620: error: 'struct iwl3945_hw_key' has no member named 'keylen'
/SPACE/Builds/WIFI/Intel-iwl/iwlwifi/compatible/iwl3945-base.c:2626: error: 'ALG_NONE' undeclared (first use in this function)
/SPACE/Builds/WIFI/Intel-iwl/iwlwifi/compatible/iwl3945-base.c:2626: error: (Each undeclared identifier is reported only once
/SPACE/Builds/WIFI/Intel-iwl/iwlwifi/compatible/iwl3945-base.c:2626: error: for each function it appears in.)
/SPACE/Builds/WIFI/Intel-iwl/iwlwifi/compatible/iwl3945-base.c:2631: error: 'struct iwl3945_hw_key' has no member named 'alg'
/SPACE/Builds/WIFI/Intel-iwl/iwlwifi/compatible/iwl3945-base.c: In function 'iwl3945_get_sta_id':
/SPACE/Builds/WIFI/Intel-iwl/iwlwifi/compatible/iwl3945-base.c:2739: warning: too few arguments for format
/SPACE/Builds/WIFI/Intel-iwl/iwlwifi/compatible/iwl3945-base.c: In function 'iwl3945_tx_skb':
/SPACE/Builds/WIFI/Intel-iwl/iwlwifi/compatible/iwl3945-base.c:2820: warning: too few arguments for format
/SPACE/Builds/WIFI/Intel-iwl/iwlwifi/compatible/iwl3945-base.c:2903: warning: comparison is always true due to limited range of data type
/SPACE/Builds/WIFI/Intel-iwl/iwlwifi/compatible/iwl3945-base.c: In function 'iwl3945_print_rx_config_cmd':
/SPACE/Builds/WIFI/Intel-iwl/iwlwifi/compatible/iwl3945-base.c:4514: warning: too few arguments for format
/SPACE/Builds/WIFI/Intel-iwl/iwlwifi/compatible/iwl3945-base.c:4516: warning: too few arguments for format
/SPACE/Builds/WIFI/Intel-iwl/iwlwifi/compatible/iwl3945-base.c: In function 'iwl3945_bg_post_associate':
/SPACE/Builds/WIFI/Intel-iwl/iwlwifi/compatible/iwl3945-base.c:6804: warning: too few arguments for format
/SPACE/Builds/WIFI/Intel-iwl/iwlwifi/compatible/iwl3945-base.c: In function 'iwl3945_mac_add_interface':
/SPACE/Builds/WIFI/Intel-iwl/iwlwifi/compatible/iwl3945-base.c:7096: warning: too few arguments for format
/SPACE/Builds/WIFI/Intel-iwl/iwlwifi/compatible/iwl3945-base.c: In function 'iwl3945_mac_config_interface':
/SPACE/Builds/WIFI/Intel-iwl/iwlwifi/compatible/iwl3945-base.c:7282: warning: too few arguments for format
/SPACE/Builds/WIFI/Intel-iwl/iwlwifi/compatible/iwl3945-base.c:7286: error: 'IEEE80211_HW_NO_PROBE_FILTERING' undeclared (first use in this function)
/SPACE/Builds/WIFI/Intel-iwl/iwlwifi/compatible/iwl3945-base.c:7302: warning: too few arguments for format
/SPACE/Builds/WIFI/Intel-iwl/iwlwifi/compatible/iwl3945-base.c: At top level:
/SPACE/Builds/WIFI/Intel-iwl/iwlwifi/compatible/iwl3945-base.c:7447: error: expected declaration specifiers or '...' before 'set_key_cmd'
/SPACE/Builds/WIFI/Intel-iwl/iwlwifi/compatible/iwl3945-base.c: In function 'iwl3945_mac_set_key':
/SPACE/Builds/WIFI/Intel-iwl/iwlwifi/compatible/iwl3945-base.c:7463: warning: too few arguments for format
/SPACE/Builds/WIFI/Intel-iwl/iwlwifi/compatible/iwl3945-base.c:7472: error: 'cmd' undeclared (first use in this function)
/SPACE/Builds/WIFI/Intel-iwl/iwlwifi/compatible/iwl3945-base.c: At top level:
/SPACE/Builds/WIFI/Intel-iwl/iwlwifi/compatible/iwl3945-base.c:8441: error: unknown field 'open' specified in initializer
/SPACE/Builds/WIFI/Intel-iwl/iwlwifi/compatible/iwl3945-base.c:8442: warning: initialization from incompatible pointer type
/SPACE/Builds/WIFI/Intel-iwl/iwlwifi/compatible/iwl3945-base.c:8447: warning: initialization from incompatible pointer type
/SPACE/Builds/WIFI/Intel-iwl/iwlwifi/compatible/iwl3945-base.c: In function 'iwl3945_pci_probe':
/SPACE/Builds/WIFI/Intel-iwl/iwlwifi/compatible/iwl3945-base.c:8516: error: 'IEEE80211_HW_WEP_INCLUDE_IV' undeclared (first use in this function)
/SPACE/Builds/WIFI/Intel-iwl/iwlwifi/compatible/iwl3945-base.c:8665: warning: too few arguments for format
make[3]: *** [/SPACE/Builds/WIFI/Intel-iwl/iwlwifi/compatible/iwl3945-base.o] Error 1
make[2]: *** [_module_/SPACE/Builds/WIFI/Intel-iwl/iwlwifi/compatible] Error 2
make[1]: *** [sub-make] Error 2
make[1]: Leaving directory `/usr/src/linux-2.6.24'
make: *** [modules] Error 2