All pastes #88490 Raw Edit

Something

public text v1 · immutable
·published 2006-07-15 00:49 UTC
rendered paste body
Last login: Fri Jul 14 16:37:43 on ttyp4
Welcome to Darwin!
Fuzzles-JR:~ malcolm$ cd TTO
Fuzzles-JR:~/TTO malcolm$ cd cegui_mk2
Fuzzles-JR:~/TTO/cegui_mk2 malcolm$ ./configure --prefix=$HOME/TTO/output --without-devil --disable-irrlicht-renderer
checking for a BSD-compatible install... /usr/bin/install -c
checking whether build environment is sane... yes
checking for gawk... gawk
checking whether make sets $(MAKE)... yes
checking for g++... g++
checking for C++ compiler default output file name... a.out
checking whether the C++ compiler works... yes
checking whether we are cross compiling... no
checking for suffix of executables... 
checking for suffix of object files... o
checking whether we are using the GNU C++ compiler... yes
checking whether g++ accepts -g... yes
checking for style of include used by make... GNU
checking dependency style of g++... gcc3
checking for gcc... gcc
checking whether we are using the GNU C compiler... yes
checking whether gcc accepts -g... yes
checking for gcc option to accept ANSI C... none needed
checking dependency style of gcc... gcc3
checking build system type... powerpc-apple-darwin8.7.0
checking host system type... powerpc-apple-darwin8.7.0
checking for a sed that does not truncate output... /usr/bin/sed
checking for egrep... grep -E
checking for ld used by gcc... /usr/bin/ld
checking if the linker (/usr/bin/ld) is GNU ld... no
checking for /usr/bin/ld option to reload object files... -r
checking for BSD-compatible nm... /usr/bin/nm -p
checking whether ln -s works... yes
checking how to recognise dependent libraries... pass_all
checking how to run the C preprocessor... gcc -E
checking for ANSI C header files... yes
checking for sys/types.h... yes
checking for sys/stat.h... yes
checking for stdlib.h... yes
checking for string.h... yes
checking for memory.h... yes
checking for strings.h... yes
checking for inttypes.h... yes
checking for stdint.h... yes
checking for unistd.h... yes
checking dlfcn.h usability... yes
checking dlfcn.h presence... yes
checking for dlfcn.h... yes
checking how to run the C++ preprocessor... g++ -E
checking for g77... no
checking for f77... no
checking for xlf... no
checking for frt... no
checking for pgf77... no
checking for fort77... no
checking for fl32... no
checking for af77... no
checking for f90... no
checking for xlf90... no
checking for pgf90... no
checking for epcf90... no
checking for f95... no
checking for fort... no
checking for xlf95... no
checking for ifc... no
checking for efc... no
checking for pgf95... no
checking for lf95... no
checking for gfortran... no
checking whether we are using the GNU Fortran 77 compiler... no
checking whether  accepts -g... no
checking the maximum length of command line arguments... 196608
checking command to parse /usr/bin/nm -p output from gcc object... ok
checking for objdir... .libs
checking for ar... ar
checking for ranlib... ranlib
checking for strip... strip
checking if gcc supports -fno-rtti -fno-exceptions... no
checking for gcc option to produce PIC... -fno-common
checking if gcc PIC flag -fno-common works... yes
checking if gcc static flag -static works... no
checking if gcc supports -c -o file.o... yes
checking whether the gcc linker (/usr/bin/ld) supports shared libraries... yes
checking dynamic linker characteristics... darwin8.7.0 dyld
checking how to hardcode library paths into programs... immediate
checking whether stripping libraries is possible... yes
checking if libtool supports shared libraries... yes
checking whether to build shared libraries... yes
checking whether to build static libraries... no
configure: creating libtool
appending configuration tag "CXX" to libtool
checking for ld used by g++... /usr/bin/ld
checking if the linker (/usr/bin/ld) is GNU ld... no
checking whether the g++ linker (/usr/bin/ld) supports shared libraries... yes
checking for g++ option to produce PIC... -fno-common
checking if g++ PIC flag -fno-common works... yes
checking if g++ static flag -static works... no
checking if g++ supports -c -o file.o... yes
checking whether the g++ linker (/usr/bin/ld) supports shared libraries... yes
checking dynamic linker characteristics... darwin8.7.0 dyld
checking how to hardcode library paths into programs... immediate
appending configuration tag "F77" to libtool
checking for main in -ldl... yes
checking for main in -lpthread... yes
checking for pkg-config... /sw/bin/pkg-config
checking pkg-config is at least version 0.9.0... yes
checking for freetype2_CFLAGS... -I/Users/malcolm/TTO/output/include/freetype2 -I/Users/malcolm/TTO/output/include  
checking for freetype2_LIBS... -L/Users/malcolm/TTO/output/lib -lfreetype -lz  
checking for pcre_CFLAGS... -I/Users/malcolm/TTO/output/include  
checking for pcre_LIBS... -L/Users/malcolm/TTO/output/lib -lpcre  
checking for libxml_CFLAGS... -I/sw/include/libxml2 -I/sw/include  
checking for libxml_LIBS... -L/sw/lib -lxml2 -lpthread -lz -liconv -lm  
checking for main in -lxerces-c... no
./configure: line 19277: unset: `ac_cv_lib_xerces-c_main': not a valid identifier
checking for XML_ParserCreate in -lexpat... no
./configure: line 19428: unset: `ac_cv_lib_expat-c_main': not a valid identifier
configure: Default XML Parser will be: XercesParser
checking for ANSI C header files... (cached) yes
checking limits.h usability... yes
checking limits.h presence... yes
checking for limits.h... yes
checking locale.h usability... yes
checking locale.h presence... yes
checking for locale.h... yes
checking malloc.h usability... no
checking malloc.h presence... no
checking for malloc.h... no
checking stddef.h usability... yes
checking stddef.h presence... yes
checking for stddef.h... yes
checking for stdlib.h... (cached) yes
checking for string.h... (cached) yes
checking for stdbool.h that conforms to C99... yes
checking for _Bool... yes
checking for an ANSI C-conforming const... yes
checking for inline... inline
checking for size_t... yes
checking whether struct tm is in sys/time.h or time.h... time.h
checking for working volatile... yes
checking for ptrdiff_t... yes
checking for error_at_line... no
checking for working memcmp... yes
checking whether time.h and sys/time.h may both be included... yes
checking for stdlib.h... (cached) yes
checking sys/time.h usability... yes
checking sys/time.h presence... yes
checking for sys/time.h... yes
checking for unistd.h... (cached) yes
checking for alarm... yes
checking for working mktime... yes
checking for working strcoll... yes
checking for strftime... yes
checking for atexit... yes
checking for floor... yes
checking for memchr... yes
checking for memmove... yes
checking for memset... yes
checking for pow... yes
checking for regcomp... yes
checking for setlocale... yes
checking for sqrt... yes
checking for strchr... yes
checking for strcspn... yes
checking for strerror... yes
checking for strpbrk... yes
checking for strtoul... yes
checking for X... libraries /usr/X11R6/lib, headers /usr/X11R6/include
checking for gethostbyname... yes
checking for connect... yes
checking for remove... yes
checking for shmat... yes
checking for IceConnectionNumber in -lICE... yes
checking for library containing glInterleavedArrays... -lGL
checking for library containing gluOrtho2D... -lGLU
checking for library containing glutInit... no
configure: OpenGL renderer enabled
configure: Image loading via DevIL by OpenGL renderer disabled
checking for library containing FreeImage_GetVersion... no
checking FreeImage.h usability... no
checking FreeImage.h presence... no
checking for FreeImage.h... no
configure: Image loading via FreeImage by OpenGL renderer disabled
checking for SILLY_CFLAGS... 
checking for SILLY_LIBS... 
configure: Image loading via SILLY by OpenGL renderer disabled
checking for corona-config... no
checking for corona - version >= 1.2.0... no
configure: Use of OpenGL in Samples is disabled - Did not find GLUT library.
checking for CEGUIOGRE_CFLAGS... 
checking for CEGUIOGRE_LIBS... 
checking for CEGUI_NULL_CFLAGS... -I/Users/malcolm/TTO/output/include -I/Users/malcolm/TTO/output/include/CEGUI  
checking for CEGUI_NULL_LIBS... -L/Users/malcolm/TTO/output/lib -lCEGUIBase  
configure: Use of Ogre3D in Samples is disabled
checking for main in -lIrrlicht... no
checking for XF86VidModeQueryVersion in -lXxf86vm... no
configure: Irrlicht renderer disabled
checking for GTK_CFLAGS... -I/sw/include/glib-2.0 -I/sw/lib/glib-2.0/include -I/sw/include/pango-1.0 -I/usr/X11R6/include -I/usr/X11R6/include/freetype2 -I/sw/include/gtk-2.0 -I/sw/include/atk-1.0 -I/sw/lib/gtk-2.0/include  
checking for GTK_LIBS... -L/sw/lib -L/usr/X11R6/lib -lgtk-x11-2.0 -lgdk-x11-2.0 -lXrandr -lXinerama -lXext -lXcursor -latk-1.0 -lgdk_pixbuf-2.0 -lpangoxft-1.0 -lXft -lXrender -lpangox-1.0 -lX11 -lpangoft2-1.0 -lfontconfig -lfreetype -lpango-1.0 -lm -lgobject-2.0 -lgmodule-2.0 -lglib-2.0 -lintl -liconv  
configure: GTK2 renderer selection dialog in samples is disabled
configure: No renderers available.  Building of samples framework and applications has been disabled.
configure: creating ./config.status
config.status: creating Makefile
config.status: creating Samples/Demo4/Makefile
config.status: creating Samples/Demo4/src/Makefile
config.status: creating Samples/Demo6/Makefile
config.status: creating Samples/Demo6/src/Makefile
config.status: creating Samples/Demo7/Makefile
config.status: creating Samples/Demo7/src/Makefile
config.status: creating Samples/Demo8/Makefile
config.status: creating Samples/Demo8/src/Makefile
config.status: creating Samples/FalagardDemo1/Makefile
config.status: creating Samples/FalagardDemo1/include/Makefile
config.status: creating Samples/FalagardDemo1/src/Makefile
config.status: creating Samples/FirstWindow/Makefile
config.status: creating Samples/FirstWindow/include/Makefile
config.status: creating Samples/FirstWindow/src/Makefile
config.status: creating Samples/FontDemo/Makefile
config.status: creating Samples/FontDemo/src/Makefile
config.status: creating Samples/Makefile
config.status: creating Samples/common/Makefile
config.status: creating Samples/common/include/Makefile
config.status: creating Samples/common/src/Makefile
config.status: creating ScriptingModules/CEGUILua/LuaScriptModule/Makefile
config.status: creating ScriptingModules/CEGUILua/LuaScriptModule/include/Makefile
config.status: creating ScriptingModules/CEGUILua/LuaScriptModule/package/Makefile
config.status: creating ScriptingModules/CEGUILua/LuaScriptModule/src/Makefile
config.status: creating ScriptingModules/CEGUILua/Makefile
config.status: creating ScriptingModules/CEGUILua/lua_and_tolua++/Makefile
config.status: creating ScriptingModules/CEGUILua/lua_and_tolua++/include/Makefile
config.status: creating ScriptingModules/CEGUILua/lua_and_tolua++/src/Makefile
config.status: creating ScriptingModules/Makefile
config.status: creating WindowRendererSets/Makefile
config.status: creating WindowRendererSets/Falagard/Makefile
config.status: creating WindowRendererSets/Falagard/include/Makefile
config.status: creating WindowRendererSets/Falagard/src/Makefile
config.status: creating XMLParserModules/Makefile
config.status: creating XMLParserModules/TinyXMLParser/Makefile
config.status: creating XMLParserModules/XercesParser/Makefile
config.status: creating XMLParserModules/expatParser/Makefile
config.status: creating XMLParserModules/libxmlParser/Makefile
config.status: creating ImageCodecModules/Makefile
config.status: creating ImageCodecModules/CoronaImageCodec/Makefile
config.status: creating ImageCodecModules/DevILImageCodec/Makefile
config.status: creating ImageCodecModules/FreeImageImageCodec/Makefile
config.status: creating ImageCodecModules/SILLYImageCodec/Makefile
config.status: creating ImageCodecModules/TGAImageCodec/Makefile
config.status: creating include/Makefile
config.status: creating include/elements/Makefile
config.status: creating include/falagard/Makefile
config.status: creating src/Makefile
config.status: creating RendererModules/IrrlichtRenderer/Makefile
config.status: creating RendererModules/Makefile
config.status: creating RendererModules/OpenGLGUIRenderer/Makefile
config.status: creating CEGUI.pc
config.status: creating CEGUI-OPENGL.pc
config.status: creating CEGUI.spec
config.status: creating include/config.h
config.status: include/config.h is unchanged
config.status: executing depfiles commands

********************************************************************************
* Crazy Eddie's GUI System - Configuration Results Summary
********************************************************************************
* Library Release Version:                              0.5.0
*
* Renderer Modules:
*         Building OpenGL Renderer:                     yes
*         Building Irrlict Renderer:                    no
*
* Image Loading Codec Modules (currently for OpenGL Renderer only):
*         Building Corona Image Codec:                  no
*         Building DevIL Image Codec:                   no
*         Building FreeImage Image Codec:               no
*         Building SILLY Image Codec:                   no
*
* XML Parser Modules:
*         Building TinyXMLParser:                       yes
*         Building ExpatParser:                         yes
*         Building LibXMLParser:                        yes
*         Building XercesParser:                        yes
*
*         Default XML Parser is:                        XercesParser
*
* Samples Framework:
*         Building Samples:                             no
*         GTK2 based dialog for renderer selection:     no
*         OpenGL Renderer available in samples:         no
*         Irrlict Renderer available in samples:        no
*         Ogre3D Renderer available in samples:         no
********************************************************************************

Now you can do make && make install.  Good Luck!

Fuzzles-JR:~/TTO/cegui_mk2 malcolm$ make
Making all in .
make[1]: Nothing to be done for `all-am'.
Making all in XMLParserModules
Making all in .
make[2]: Nothing to be done for `all-am'.
Making all in XercesParser
make[2]: Nothing to be done for `all'.
Making all in expatParser
make[2]: Nothing to be done for `all'.
Making all in libxmlParser
make[2]: Nothing to be done for `all'.
Making all in TinyXMLParser
make[2]: Nothing to be done for `all'.
Making all in ImageCodecModules
Making all in TGAImageCodec
make[2]: Nothing to be done for `all'.
make[2]: Nothing to be done for `all-am'.
Making all in RendererModules
Making all in .
make[2]: Nothing to be done for `all-am'.
Making all in OpenGLGUIRenderer
make[2]: Nothing to be done for `all'.
Making all in IrrlichtRenderer
if /bin/sh ../../libtool --tag=CXX --mode=compile g++ -DHAVE_CONFIG_H -I. -I. -I../../include -I../../include     -g -O2 -MT irrlichtrenderer.lo -MD -MP -MF ".deps/irrlichtrenderer.Tpo" -c -o irrlichtrenderer.lo irrlichtrenderer.cpp; \
then mv -f ".deps/irrlichtrenderer.Tpo" ".deps/irrlichtrenderer.Plo"; else rm -f ".deps/irrlichtrenderer.Tpo"; exit 1; fi
 g++ -DHAVE_CONFIG_H -I. -I. -I../../include -I../../include -g -O2 -MT irrlichtrenderer.lo -MD -MP -MF .deps/irrlichtrenderer.Tpo -c irrlichtrenderer.cpp  -fno-common -DPIC -o .libs/irrlichtrenderer.o
In file included from irrlichtrenderer.h:32,
                 from irrlichtrenderer.cpp:28:
irrlichttexture.h:37:22: error: irrlicht.h: No such file or directory
In file included from irrlichtrenderer.h:33,
                 from irrlichtrenderer.cpp:28:
IrrlichtResourceProvider.h:35:25: error: IFileSystem.h: No such file or directory
irrlichttexture.h:46: error: 'irr' has not been declared
irrlichttexture.h:46: error: 'IrrlichtDevice' has not been declared
irrlichttexture.h:52: error: 'irr' has not been declared
irrlichttexture.h:52: error: ISO C++ forbids declaration of 'ITexture' with no type
irrlichttexture.h:52: error: expected ';' before '*' token
irrlichttexture.h:55: error: 'irr' has not been declared
irrlichttexture.h:55: error: 'ITexture' has not been declared
irrlichttexture.h:121: error: 'irr' has not been declared
irrlichttexture.h:121: error: 'stringc' does not name a type
irrlichttexture.h:127: error: 'irr' has not been declared
irrlichttexture.h:127: error: ISO C++ forbids declaration of 'ITexture' with no type
irrlichttexture.h:127: error: expected ';' before '*' token
irrlichttexture.h:130: error: 'irr' has not been declared
irrlichttexture.h:130: error: ISO C++ forbids declaration of 'IVideoDriver' with no type
irrlichttexture.h:130: error: expected ';' before '*' token
irrlichttexture.h:133: error: 'irr' has not been declared
irrlichttexture.h:133: error: ISO C++ forbids declaration of 'IrrlichtDevice' with no type
irrlichttexture.h:133: error: expected ';' before '*' token
IrrlichtResourceProvider.h:42: error: 'irr' has not been declared
IrrlichtResourceProvider.h:42: error: ISO C++ forbids declaration of 'IFileSystem' with no type
IrrlichtResourceProvider.h:42: error: expected ';' before '*' token
IrrlichtResourceProvider.h:47: error: 'irr' has not been declared
IrrlichtResourceProvider.h:47: error: expected `)' before '*' token
irrlichtrenderer.h:72: error: 'irr' has not been declared
irrlichtrenderer.h:72: error: expected `)' before '*' token
irrlichtrenderer.h:84: error: 'irr' has not been declared
irrlichtrenderer.h:84: error: 'SEvent' has not been declared
irrlichtrenderer.h:316: error: 'irr' has not been declared
irrlichtrenderer.h:316: error: ISO C++ forbids declaration of 'IrrlichtDevice' with no type
irrlichtrenderer.h:316: error: expected ';' before '*' token
irrlichtrenderer.h:318: error: 'irr' has not been declared
irrlichtrenderer.h:318: error: ISO C++ forbids declaration of 'IVideoDriver' with no type
irrlichtrenderer.h:318: error: expected ';' before '*' token
irrlichtrenderer.h:320: error: 'irr' has not been declared
irrlichtrenderer.h:320: error: ISO C++ forbids declaration of 'dimension2d' with no type
irrlichtrenderer.h:320: error: expected ';' before '<' token
irrlichtrenderer.h:322: error: 'irr' has not been declared
irrlichtrenderer.h:322: error: ISO C++ forbids declaration of 'dimension2d' with no type
irrlichtrenderer.h:322: error: expected ';' before '<' token
irrlichtrenderer.h:337: error: 'irr' has not been declared
irrlichtrenderer.h:337: error: expected ',' or '...' before '<' token
irrlichtrenderer.h:339: error: ISO C++ forbids declaration of 'rect' with no type
irrlichtrenderer.h:345: error: 'irr' has not been declared
irrlichtrenderer.h:345: error: ISO C++ forbids declaration of 'rect' with no type
irrlichtrenderer.h:345: error: expected ';' before '<' token
irrlichtrenderer.h:346: error: 'irr' has not been declared
irrlichtrenderer.h:346: error: ISO C++ forbids declaration of 'rect' with no type
irrlichtrenderer.h:346: error: expected ';' before '<' token
irrlichtrenderer.h:377: error: 'irr' has not been declared
irrlichtrenderer.h:377: error: 'SColor' does not name a type
irrlichtrenderer.h:378: error: 'irr' has not been declared
irrlichtrenderer.h:378: error: 'SColor' does not name a type
irrlichtrenderer.h: In constructor 'CEGUI::IrrlichtRenderer::RenderQuad::RenderQuad(float, int)':
irrlichtrenderer.h:340: error: class 'CEGUI::IrrlichtRenderer::RenderQuad' does not have any field named 'dst'
irrlichtrenderer.h:340: error: 'target' was not declared in this scope
irrlichtrenderer.h:340: error: class 'CEGUI::IrrlichtRenderer::RenderQuad' does not have any field named 'src'
irrlichtrenderer.h:340: error: 'source' was not declared in this scope
irrlichtrenderer.h:340: error: 'col' was not declared in this scope
irrlichtrenderer.h:341: error: 't' was not declared in this scope
IrrlichtEventPusher.h: At global scope:
IrrlichtEventPusher.h:36: error: expected namespace-name before ';' token
IrrlichtEventPusher.h:36: error: '<type error>' is not a namespace
IrrlichtEventPusher.h:40: error: 'gui' has not been declared
IrrlichtEventPusher.h:40: error: ISO C++ forbids declaration of 'ICursorControl' with no type
IrrlichtEventPusher.h:40: error: expected ';' before '*' token
IrrlichtEventPusher.h:42: error: 'core' has not been declared
IrrlichtEventPusher.h:42: error: ISO C++ forbids declaration of 'position2d' with no type
IrrlichtEventPusher.h:42: error: expected ';' before '<' token
IrrlichtEventPusher.h:43: error: 'core' has not been declared
IrrlichtEventPusher.h:43: error: ISO C++ forbids declaration of 'position2d' with no type
IrrlichtEventPusher.h:43: error: expected ';' before '<' token
IrrlichtEventPusher.h:47: error: 'irr' has not been declared
IrrlichtEventPusher.h:47: error: expected `)' before '*' token
IrrlichtEventPusher.h:59: error: 'SEvent' has not been declared
IrrlichtEventPusher.h:80: error: 'EKEY_CODE' has not been declared
IrrlichtEventPusher.h:89: error: 'EKEY_CODE' has not been declared
IrrlichtEventPusher.h:97: error: 's32' has not been declared
IrrlichtEventPusher.h:97: error: 's32' has not been declared
IrrlichtEventPusher.h:97: error: 'f32' has not been declared
IrrlichtEventPusher.h:97: error: 'EMOUSE_INPUT_EVENT' has not been declared
IrrlichtEventPusher.h:152: error: 'irr' has not been declared
IrrlichtEventPusher.h:152: error: 'KEY_KEY_CODES_COUNT' was not declared in this scope
IrrlichtEventPusher.h:311: error: 'irr' has not been declared
IrrlichtEventPusher.h:311: error: 'EKEY_CODE' has not been declared
IrrlichtEventPusher.h: In member function 'bool CEGUI::EventPusher::OnEvent(int&)':
IrrlichtEventPusher.h:61: error: request for member 'EventType' in 'event', which is of non-class type 'int'
IrrlichtEventPusher.h:63: error: 'EET_KEY_INPUT_EVENT' was not declared in this scope
IrrlichtEventPusher.h:64: error: request for member 'KeyInput' in 'event', which is of non-class type 'int'
IrrlichtEventPusher.h:65: error: request for member 'KeyInput' in 'event', which is of non-class type 'int'
IrrlichtEventPusher.h:65: error: request for member 'KeyInput' in 'event', which is of non-class type 'int'
IrrlichtEventPusher.h:65: error: request for member 'KeyInput' in 'event', which is of non-class type 'int'
IrrlichtEventPusher.h:65: error: request for member 'KeyInput' in 'event', which is of non-class type 'int'
IrrlichtEventPusher.h:67: error: request for member 'KeyInput' in 'event', which is of non-class type 'int'
IrrlichtEventPusher.h:67: error: request for member 'KeyInput' in 'event', which is of non-class type 'int'
IrrlichtEventPusher.h:67: error: request for member 'KeyInput' in 'event', which is of non-class type 'int'
IrrlichtEventPusher.h:67: error: request for member 'KeyInput' in 'event', which is of non-class type 'int'
IrrlichtEventPusher.h:70: error: 'EET_MOUSE_INPUT_EVENT' was not declared in this scope
IrrlichtEventPusher.h:71: error: request for member 'MouseInput' in 'event', which is of non-class type 'int'
IrrlichtEventPusher.h:71: error: request for member 'MouseInput' in 'event', which is of non-class type 'int'
IrrlichtEventPusher.h:71: error: request for member 'MouseInput' in 'event', which is of non-class type 'int'
IrrlichtEventPusher.h:71: error: request for member 'MouseInput' in 'event', which is of non-class type 'int'
IrrlichtEventPusher.h: In member function 'bool CEGUI::EventPusher::OnMouse(int, int, int, int)':
IrrlichtEventPusher.h:99: error: expected namespace-name before ';' token
IrrlichtEventPusher.h:99: error: '<type error>' is not a namespace
IrrlichtEventPusher.h:105: error: 'EMIE_LMOUSE_PRESSED_DOWN' was not declared in this scope
IrrlichtEventPusher.h:108: error: 'EMIE_RMOUSE_PRESSED_DOWN' was not declared in this scope
IrrlichtEventPusher.h:112: error: 'EMIE_MMOUSE_PRESSED_DOWN' was not declared in this scope
IrrlichtEventPusher.h:116: error: 'EMIE_LMOUSE_LEFT_UP' was not declared in this scope
IrrlichtEventPusher.h:120: error: 'EMIE_RMOUSE_LEFT_UP' was not declared in this scope
IrrlichtEventPusher.h:124: error: 'EMIE_MMOUSE_LEFT_UP' was not declared in this scope
IrrlichtEventPusher.h:128: error: 'EMIE_MOUSE_MOVED' was not declared in this scope
IrrlichtEventPusher.h:129: error: 'dpos' was not declared in this scope
IrrlichtEventPusher.h:129: error: 'pos' was not declared in this scope
IrrlichtEventPusher.h:139: error: 'EMIE_MOUSE_WHEEL' was not declared in this scope
IrrlichtEventPusher.h: In member function 'void CEGUI::EventPusher::initCodes()':
IrrlichtEventPusher.h:156: error: expected namespace-name before ';' token
IrrlichtEventPusher.h:156: error: '<type error>' is not a namespace
IrrlichtEventPusher.h:157: error: 'irr2ceCODE' was not declared in this scope
IrrlichtEventPusher.h:157: error: 'KEY_KEY_CODES_COUNT' was not declared in this scope
IrrlichtEventPusher.h:159: error: 'KEY_LBUTTON' was not declared in this scope
IrrlichtEventPusher.h:160: error: 'KEY_RBUTTON' was not declared in this scope
IrrlichtEventPusher.h:161: error: 'KEY_CANCEL' was not declared in this scope
IrrlichtEventPusher.h:162: error: 'KEY_MBUTTON' was not declared in this scope
IrrlichtEventPusher.h:163: error: 'KEY_XBUTTON1' was not declared in this scope
IrrlichtEventPusher.h:164: error: 'KEY_XBUTTON2' was not declared in this scope
IrrlichtEventPusher.h:165: error: 'KEY_BACK' was not declared in this scope
IrrlichtEventPusher.h:166: error: 'KEY_TAB' was not declared in this scope
IrrlichtEventPusher.h:167: error: 'KEY_CLEAR' was not declared in this scope
IrrlichtEventPusher.h:168: error: 'KEY_RETURN' was not declared in this scope
IrrlichtEventPusher.h:169: error: 'KEY_SHIFT' was not declared in this scope
IrrlichtEventPusher.h:170: error: 'KEY_CONTROL' was not declared in this scope
IrrlichtEventPusher.h:171: error: 'KEY_MENU' was not declared in this scope
IrrlichtEventPusher.h:172: error: 'KEY_PAUSE' was not declared in this scope
IrrlichtEventPusher.h:173: error: 'KEY_CAPITAL' was not declared in this scope
IrrlichtEventPusher.h:174: error: 'KEY_KANA' was not declared in this scope
IrrlichtEventPusher.h:175: error: 'KEY_HANGUEL' was not declared in this scope
IrrlichtEventPusher.h:176: error: 'KEY_HANGUL' was not declared in this scope
IrrlichtEventPusher.h:177: error: 'KEY_JUNJA' was not declared in this scope
IrrlichtEventPusher.h:178: error: 'KEY_FINAL' was not declared in this scope
IrrlichtEventPusher.h:179: error: 'KEY_HANJA' was not declared in this scope
IrrlichtEventPusher.h:180: error: 'KEY_KANJI' was not declared in this scope
IrrlichtEventPusher.h:181: error: 'KEY_ESCAPE' was not declared in this scope
IrrlichtEventPusher.h:182: error: 'KEY_CONVERT' was not declared in this scope
IrrlichtEventPusher.h:183: error: 'KEY_NONCONVERT' was not declared in this scope
IrrlichtEventPusher.h:184: error: 'KEY_ACCEPT' was not declared in this scope
IrrlichtEventPusher.h:185: error: 'KEY_MODECHANGE' was not declared in this scope
IrrlichtEventPusher.h:186: error: 'KEY_SPACE' was not declared in this scope
IrrlichtEventPusher.h:187: error: 'KEY_PRIOR' was not declared in this scope
IrrlichtEventPusher.h:188: error: 'KEY_NEXT' was not declared in this scope
IrrlichtEventPusher.h:189: error: 'KEY_END' was not declared in this scope
IrrlichtEventPusher.h:190: error: 'KEY_HOME' was not declared in this scope
IrrlichtEventPusher.h:191: error: 'KEY_LEFT' was not declared in this scope
IrrlichtEventPusher.h:192: error: 'KEY_UP' was not declared in this scope
IrrlichtEventPusher.h:193: error: 'KEY_RIGHT' was not declared in this scope
IrrlichtEventPusher.h:194: error: 'KEY_DOWN' was not declared in this scope
IrrlichtEventPusher.h:195: error: 'KEY_SELECT' was not declared in this scope
IrrlichtEventPusher.h:196: error: 'KEY_PRINT' was not declared in this scope
IrrlichtEventPusher.h:197: error: 'KEY_EXECUT' was not declared in this scope
IrrlichtEventPusher.h:198: error: 'KEY_SNAPSHOT' was not declared in this scope
IrrlichtEventPusher.h:199: error: 'KEY_INSERT' was not declared in this scope
IrrlichtEventPusher.h:200: error: 'KEY_DELETE' was not declared in this scope
IrrlichtEventPusher.h:201: error: 'KEY_HELP' was not declared in this scope
IrrlichtEventPusher.h:202: error: 'KEY_KEY_0' was not declared in this scope
IrrlichtEventPusher.h:203: error: 'KEY_KEY_1' was not declared in this scope
IrrlichtEventPusher.h:204: error: 'KEY_KEY_2' was not declared in this scope
IrrlichtEventPusher.h:205: error: 'KEY_KEY_3' was not declared in this scope
IrrlichtEventPusher.h:206: error: 'KEY_KEY_4' was not declared in this scope
IrrlichtEventPusher.h:207: error: 'KEY_KEY_5' was not declared in this scope
IrrlichtEventPusher.h:208: error: 'KEY_KEY_6' was not declared in this scope
IrrlichtEventPusher.h:209: error: 'KEY_KEY_7' was not declared in this scope
IrrlichtEventPusher.h:210: error: 'KEY_KEY_8' was not declared in this scope
IrrlichtEventPusher.h:211: error: 'KEY_KEY_9' was not declared in this scope
IrrlichtEventPusher.h:212: error: 'KEY_KEY_A' was not declared in this scope
IrrlichtEventPusher.h:213: error: 'KEY_KEY_B' was not declared in this scope
IrrlichtEventPusher.h:214: error: 'KEY_KEY_C' was not declared in this scope
IrrlichtEventPusher.h:215: error: 'KEY_KEY_D' was not declared in this scope
IrrlichtEventPusher.h:216: error: 'KEY_KEY_E' was not declared in this scope
IrrlichtEventPusher.h:217: error: 'KEY_KEY_F' was not declared in this scope
IrrlichtEventPusher.h:218: error: 'KEY_KEY_G' was not declared in this scope
IrrlichtEventPusher.h:219: error: 'KEY_KEY_H' was not declared in this scope
IrrlichtEventPusher.h:220: error: 'KEY_KEY_I' was not declared in this scope
IrrlichtEventPusher.h:221: error: 'KEY_KEY_J' was not declared in this scope
IrrlichtEventPusher.h:222: error: 'KEY_KEY_K' was not declared in this scope
IrrlichtEventPusher.h:223: error: 'KEY_KEY_L' was not declared in this scope
IrrlichtEventPusher.h:224: error: 'KEY_KEY_M' was not declared in this scope
IrrlichtEventPusher.h:225: error: 'KEY_KEY_N' was not declared in this scope
IrrlichtEventPusher.h:226: error: 'KEY_KEY_O' was not declared in this scope
IrrlichtEventPusher.h:227: error: 'KEY_KEY_P' was not declared in this scope
IrrlichtEventPusher.h:228: error: 'KEY_KEY_Q' was not declared in this scope
IrrlichtEventPusher.h:229: error: 'KEY_KEY_R' was not declared in this scope
IrrlichtEventPusher.h:230: error: 'KEY_KEY_S' was not declared in this scope
IrrlichtEventPusher.h:231: error: 'KEY_KEY_T' was not declared in this scope
IrrlichtEventPusher.h:232: error: 'KEY_KEY_U' was not declared in this scope
IrrlichtEventPusher.h:233: error: 'KEY_KEY_V' was not declared in this scope
IrrlichtEventPusher.h:234: error: 'KEY_KEY_W' was not declared in this scope
IrrlichtEventPusher.h:235: error: 'KEY_KEY_X' was not declared in this scope
IrrlichtEventPusher.h:236: error: 'KEY_KEY_Y' was not declared in this scope
IrrlichtEventPusher.h:237: error: 'KEY_KEY_Z' was not declared in this scope
IrrlichtEventPusher.h:238: error: 'KEY_LWIN' was not declared in this scope
IrrlichtEventPusher.h:239: error: 'KEY_RWIN' was not declared in this scope
IrrlichtEventPusher.h:240: error: 'KEY_APPS' was not declared in this scope
IrrlichtEventPusher.h:241: error: 'KEY_SLEEP' was not declared in this scope
IrrlichtEventPusher.h:242: error: 'KEY_NUMPAD0' was not declared in this scope
IrrlichtEventPusher.h:243: error: 'KEY_NUMPAD1' was not declared in this scope
IrrlichtEventPusher.h:244: error: 'KEY_NUMPAD2' was not declared in this scope
IrrlichtEventPusher.h:245: error: 'KEY_NUMPAD3' was not declared in this scope
IrrlichtEventPusher.h:246: error: 'KEY_NUMPAD4' was not declared in this scope
IrrlichtEventPusher.h:247: error: 'KEY_NUMPAD5' was not declared in this scope
IrrlichtEventPusher.h:248: error: 'KEY_NUMPAD6' was not declared in this scope
IrrlichtEventPusher.h:249: error: 'KEY_NUMPAD7' was not declared in this scope
IrrlichtEventPusher.h:250: error: 'KEY_NUMPAD8' was not declared in this scope
IrrlichtEventPusher.h:251: error: 'KEY_NUMPAD9' was not declared in this scope
IrrlichtEventPusher.h:252: error: 'KEY_MULTIPLY' was not declared in this scope
IrrlichtEventPusher.h:253: error: 'KEY_ADD' was not declared in this scope
IrrlichtEventPusher.h:254: error: 'KEY_SEPARATOR' was not declared in this scope
IrrlichtEventPusher.h:255: error: 'KEY_SUBTRACT' was not declared in this scope
IrrlichtEventPusher.h:256: error: 'KEY_DECIMAL' was not declared in this scope
IrrlichtEventPusher.h:257: error: 'KEY_DIVIDE' was not declared in this scope
IrrlichtEventPusher.h:258: error: 'KEY_F1' was not declared in this scope
IrrlichtEventPusher.h:259: error: 'KEY_F2' was not declared in this scope
IrrlichtEventPusher.h:260: error: 'KEY_F3' was not declared in this scope
IrrlichtEventPusher.h:261: error: 'KEY_F4' was not declared in this scope
IrrlichtEventPusher.h:262: error: 'KEY_F5' was not declared in this scope
IrrlichtEventPusher.h:263: error: 'KEY_F6' was not declared in this scope
IrrlichtEventPusher.h:264: error: 'KEY_F7' was not declared in this scope
IrrlichtEventPusher.h:265: error: 'KEY_F8' was not declared in this scope
IrrlichtEventPusher.h:266: error: 'KEY_F9' was not declared in this scope
IrrlichtEventPusher.h:267: error: 'KEY_F10' was not declared in this scope
IrrlichtEventPusher.h:268: error: 'KEY_F11' was not declared in this scope
IrrlichtEventPusher.h:269: error: 'KEY_F12' was not declared in this scope
IrrlichtEventPusher.h:270: error: 'KEY_F13' was not declared in this scope
IrrlichtEventPusher.h:271: error: 'KEY_F14' was not declared in this scope
IrrlichtEventPusher.h:272: error: 'KEY_F15' was not declared in this scope
IrrlichtEventPusher.h:273: error: 'KEY_F16' was not declared in this scope
IrrlichtEventPusher.h:274: error: 'KEY_F17' was not declared in this scope
IrrlichtEventPusher.h:275: error: 'KEY_F18' was not declared in this scope
IrrlichtEventPusher.h:276: error: 'KEY_F19' was not declared in this scope
IrrlichtEventPusher.h:277: error: 'KEY_F20' was not declared in this scope
IrrlichtEventPusher.h:278: error: 'KEY_F21' was not declared in this scope
IrrlichtEventPusher.h:279: error: 'KEY_F22' was not declared in this scope
IrrlichtEventPusher.h:280: error: 'KEY_F23' was not declared in this scope
IrrlichtEventPusher.h:281: error: 'KEY_F24' was not declared in this scope
IrrlichtEventPusher.h:282: error: 'KEY_NUMLOCK' was not declared in this scope
IrrlichtEventPusher.h:283: error: 'KEY_SCROLL' was not declared in this scope
IrrlichtEventPusher.h:284: error: 'KEY_LSHIFT' was not declared in this scope
IrrlichtEventPusher.h:285: error: 'KEY_RSHIFT' was not declared in this scope
IrrlichtEventPusher.h:286: error: 'KEY_LCONTROL' was not declared in this scope
IrrlichtEventPusher.h:287: error: 'KEY_RCONTROL' was not declared in this scope
IrrlichtEventPusher.h:288: error: 'KEY_LMENU' was not declared in this scope
IrrlichtEventPusher.h:289: error: 'KEY_RMENU' was not declared in this scope
IrrlichtEventPusher.h:290: error: 'KEY_COMMA' was not declared in this scope
IrrlichtEventPusher.h:291: error: 'KEY_PLUS' was not declared in this scope
IrrlichtEventPusher.h:292: error: 'KEY_MINUS' was not declared in this scope
IrrlichtEventPusher.h:293: error: 'KEY_PERIOD' was not declared in this scope
IrrlichtEventPusher.h:294: error: 'KEY_ATTN' was not declared in this scope
IrrlichtEventPusher.h:295: error: 'KEY_CRSEL' was not declared in this scope
IrrlichtEventPusher.h:296: error: 'KEY_EXSEL' was not declared in this scope
IrrlichtEventPusher.h:297: error: 'KEY_EREOF' was not declared in this scope
IrrlichtEventPusher.h:298: error: 'KEY_PLAY' was not declared in this scope
IrrlichtEventPusher.h:299: error: 'KEY_ZOOM' was not declared in this scope
IrrlichtEventPusher.h:300: error: 'KEY_PA1' was not declared in this scope
IrrlichtEventPusher.h:301: error: 'KEY_OEM_CLEAR' was not declared in this scope
IrrlichtEventPusher.h: In member function 'CEGUI::uchar CEGUI::EventPusher::getKeyCode(int)':
IrrlichtEventPusher.h:313: error: 'irr2ceCODE' was not declared in this scope
irrlichtrenderer.cpp: At global scope:
irrlichtrenderer.cpp:36: error: 'irr' has not been declared
irrlichtrenderer.cpp:36: error: expected `)' before '*' token
irrlichtrenderer.cpp: In member function 'virtual void CEGUI::IrrlichtRenderer::addQuad(const CEGUI::Rect&, float, const CEGUI::Texture*, const CEGUI::Rect&, const CEGUI::ColourRect&, CEGUI::QuadSplitMode)':
irrlichtrenderer.cpp:65: error: 'irr' has not been declared
irrlichtrenderer.cpp:65: error: 'u32' was not declared in this scope
irrlichtrenderer.cpp:65: error: expected `;' before 'tex_height'
irrlichtrenderer.cpp:66: error: 'irr' has not been declared
irrlichtrenderer.cpp:66: error: expected `;' before 'tex_width'
irrlichtrenderer.cpp:68: error: 'struct CEGUI::IrrlichtRenderer::RenderQuad' has no member named 'src'
irrlichtrenderer.cpp:68: error: 'tex_width' was not declared in this scope
irrlichtrenderer.cpp:69: error: 'struct CEGUI::IrrlichtRenderer::RenderQuad' has no member named 'src'
irrlichtrenderer.cpp:69: error: 'tex_height' was not declared in this scope
irrlichtrenderer.cpp:70: error: 'struct CEGUI::IrrlichtRenderer::RenderQuad' has no member named 'src'
irrlichtrenderer.cpp:71: error: 'struct CEGUI::IrrlichtRenderer::RenderQuad' has no member named 'src'
irrlichtrenderer.cpp:73: error: 'struct CEGUI::IrrlichtRenderer::RenderQuad' has no member named 'dst'
irrlichtrenderer.cpp:74: error: 'struct CEGUI::IrrlichtRenderer::RenderQuad' has no member named 'dst'
irrlichtrenderer.cpp:75: error: 'struct CEGUI::IrrlichtRenderer::RenderQuad' has no member named 'dst'
irrlichtrenderer.cpp:76: error: 'struct CEGUI::IrrlichtRenderer::RenderQuad' has no member named 'dst'
irrlichtrenderer.cpp: In member function 'void CEGUI::IrrlichtRenderer::doRender(CEGUI::IrrlichtRenderer::RenderQuad&)':
irrlichtrenderer.cpp:124: error: 'irr' has not been declared
irrlichtrenderer.cpp:124: error: 'ITexture' was not declared in this scope
irrlichtrenderer.cpp:124: error: 'texture' was not declared in this scope
irrlichtrenderer.cpp:124: error: 'class CEGUI::IrrlichtTexture' has no member named 'getTexture'
irrlichtrenderer.cpp:125: error: 'colors' was not declared in this scope
irrlichtrenderer.cpp:129: error: 'driver' was not declared in this scope
irrlichtrenderer.cpp:129: error: 'struct CEGUI::IrrlichtRenderer::RenderQuad' has no member named 'dst'
irrlichtrenderer.cpp:129: error: 'struct CEGUI::IrrlichtRenderer::RenderQuad' has no member named 'src'
irrlichtrenderer.cpp: At global scope:
irrlichtrenderer.cpp:132: error: 'irr' has not been declared
irrlichtrenderer.cpp:132: error: 'SColor' does not name a type
irrlichtrenderer.cpp: In member function 'virtual CEGUI::Texture* CEGUI::IrrlichtRenderer::createTexture()':
irrlichtrenderer.cpp:154: error: 'device' was not declared in this scope
irrlichtrenderer.cpp: In member function 'virtual float CEGUI::IrrlichtRenderer::getWidth() const':
irrlichtrenderer.cpp:205: error: 'resolution' was not declared in this scope
irrlichtrenderer.cpp: In member function 'virtual float CEGUI::IrrlichtRenderer::getHeight() const':
irrlichtrenderer.cpp:210: error: 'resolution' was not declared in this scope
irrlichtrenderer.cpp: In member function 'virtual CEGUI::Size CEGUI::IrrlichtRenderer::getSize() const':
irrlichtrenderer.cpp:215: error: 'resolution' was not declared in this scope
irrlichtrenderer.cpp: In member function 'virtual CEGUI::Rect CEGUI::IrrlichtRenderer::getRect() const':
irrlichtrenderer.cpp:220: error: 'resolution' was not declared in this scope
irrlichtrenderer.cpp: In member function 'virtual CEGUI::ResourceProvider* CEGUI::IrrlichtRenderer::createResourceProvider()':
irrlichtrenderer.cpp:247: error: 'device' was not declared in this scope
irrlichtrenderer.cpp: At global scope:
irrlichtrenderer.cpp:258: error: 'irr' has not been declared
irrlichtrenderer.cpp:258: error: 'bool CEGUI::IrrlichtRenderer::OnEvent' is not a static member of 'class CEGUI::IrrlichtRenderer'
irrlichtrenderer.cpp:258: error: 'SEvent' was not declared in this scope
irrlichtrenderer.cpp:258: error: 'event' was not declared in this scope
irrlichtrenderer.cpp:259: error: expected ',' or ';' before '{' token
make[2]: *** [irrlichtrenderer.lo] Error 1
make[1]: *** [all-recursive] Error 1
make: *** [all-recursive] Error 1
Fuzzles-JR:~/TTO/cegui_mk2 malcolm$