rendered paste bodynal/./gcc/ -B/usr/arm-linux-uclibc/bin/ -B/usr/arm-linux-uclibc/lib/ -isystem /usr/arm-linux-uclibc/include -isystem /usr/arm-linux-uclibc/sys-include -O2 -g -Os -DIN_GCC -DCROSS_COMPILE -W -Wall -Wwrite-strings -Wstrict-prototypes -Wmissing-prototypes -Wold-style-definition -isystem ./include -fomit-frame-pointer -fPIC -g0 -DHAVE_GTHR_DEFAULT -DIN_LIBGCC2 -D__GCC_FLOAT_NOT_NEEDED -I. -I. -I/src/hammer/buildroot/toolchain_build_arm/gcc-4.2.1/gcc -I/src/hammer/buildroot/toolchain_build_arm/gcc-4.2.1/gcc/. -I/src/hammer/buildroot/toolchain_build_arm/gcc-4.2.1/gcc/../include -I/src/hammer/buildroot/toolchain_build_arm/gcc-4.2.1/gcc/../libcpp/include -I/src/hammer/buildroot/toolchain_build_arm/gmp/include -I/src/hammer/buildroot/toolchain_build_arm/mpfr/include -I/src/hammer/buildroot/toolchain_build_arm/gcc-4.2.1/gcc/../libdecnumber -I../libdecnumber -DL_udivdi3 -fvisibility=hidden -DHIDE_EXPORTS -fexceptions -fnon-call-exceptions -c /src/hammer/buildroot/toolchain_build_arm/gcc-4.2.1/gcc/libgcc2.c -o libgcc/./_udivdi3.o
In file included from /usr/include/linux/errno.h:4,
from /usr/include/bits/errno.h:25,
from /usr/include/errno.h:36,
from /src/hammer/buildroot/toolchain_build_arm/gcc-4.2.1/gcc/tsystem.h:96,
from /src/hammer/buildroot/toolchain_build_arm/gcc-4.2.1/gcc/libgcc2.c:33:
/usr/include/asm/errno.h:9:4: warning: #warning This machine appears to be neither x86_64 nor i386.
/src/hammer/buildroot/toolchain_build_arm/gcc-4.2.1-final/./gcc/xgcc -B/src/hammer/buildroot/toolchain_build_arm/gcc-4.2.1-final/./gcc/ -B/usr/arm-linux-uclibc/bin/ -B/usr/arm-linux-uclibc/lib/ -isystem /usr/arm-linux-uclibc/include -isystem /usr/arm-linux-uclibc/sys-include -O2 -g -Os -DIN_GCC -DCROSS_COMPILE -W -Wall -Wwrite-strings -Wstrict-prototypes -Wmissing-prototypes -Wold-style-definition -isystem ./include -fomit-frame-pointer -fPIC -g0 -DHAVE_GTHR_DEFAULT -DIN_LIBGCC2 -D__GCC_FLOAT_NOT_NEEDED -I. -I. -I/src/hammer/buildroot/toolchain_build_arm/gcc-4.2.1/gcc -I/src/hammer/buildroot/toolchain_build_arm/gcc-4.2.1/gcc/. -I/src/hammer/buildroot/toolchain_build_arm/gcc-4.2.1/gcc/../include -I/src/hammer/buildroot/toolchain_build_arm/gcc-4.2.1/gcc/../libcpp/include -I/src/hammer/buildroot/toolchain_build_arm/gmp/include -I/src/hammer/buildroot/toolchain_build_arm/mpfr/include -I/src/hammer/buildroot/toolchain_build_arm/gcc-4.2.1/gcc/../libdecnumber -I../libdecnumber -DL_umoddi3 -fvisibility=hidden -DHIDE_EXPORTS -fexceptions -fnon-call-exceptions -c /src/hammer/buildroot/toolchain_build_arm/gcc-4.2.1/gcc/libgcc2.c -o libgcc/./_umoddi3.o
In file included from /usr/include/linux/errno.h:4,
from /usr/include/bits/errno.h:25,
from /usr/include/errno.h:36,
from /src/hammer/buildroot/toolchain_build_arm/gcc-4.2.1/gcc/tsystem.h:96,
from /src/hammer/buildroot/toolchain_build_arm/gcc-4.2.1/gcc/libgcc2.c:33:
/usr/include/asm/errno.h:9:4: warning: #warning This machine appears to be neither x86_64 nor i386.
/src/hammer/buildroot/toolchain_build_arm/gcc-4.2.1-final/./gcc/xgcc -B/src/hammer/buildroot/toolchain_build_arm/gcc-4.2.1-final/./gcc/ -B/usr/arm-linux-uclibc/bin/ -B/usr/arm-linux-uclibc/lib/ -isystem /usr/arm-linux-uclibc/include -isystem /usr/arm-linux-uclibc/sys-include -O2 -g -Os -DIN_GCC -DCROSS_COMPILE -W -Wall -Wwrite-strings -Wstrict-prototypes -Wmissing-prototypes -Wold-style-definition -isystem ./include -fomit-frame-pointer -fPIC -g0 -DHAVE_GTHR_DEFAULT -DIN_LIBGCC2 -D__GCC_FLOAT_NOT_NEEDED -I. -I. -I/src/hammer/buildroot/toolchain_build_arm/gcc-4.2.1/gcc -I/src/hammer/buildroot/toolchain_build_arm/gcc-4.2.1/gcc/. -I/src/hammer/buildroot/toolchain_build_arm/gcc-4.2.1/gcc/../include -I/src/hammer/buildroot/toolchain_build_arm/gcc-4.2.1/gcc/../libcpp/include -I/src/hammer/buildroot/toolchain_build_arm/gmp/include -I/src/hammer/buildroot/toolchain_build_arm/mpfr/include -I/src/hammer/buildroot/toolchain_build_arm/gcc-4.2.1/gcc/../libdecnumber -I../libdecnumber -DL_udiv_w_sdiv -fvisibility=hidden -DHIDE_EXPORTS -fexceptions -fnon-call-exceptions -c /src/hammer/buildroot/toolchain_build_arm/gcc-4.2.1/gcc/libgcc2.c -o libgcc/./_udiv_w_sdiv.o
In file included from /usr/include/linux/errno.h:4,
from /usr/include/bits/errno.h:25,
from /usr/include/errno.h:36,
from /src/hammer/buildroot/toolchain_build_arm/gcc-4.2.1/gcc/tsystem.h:96,
from /src/hammer/buildroot/toolchain_build_arm/gcc-4.2.1/gcc/libgcc2.c:33:
/usr/include/asm/errno.h:9:4: warning: #warning This machine appears to be neither x86_64 nor i386.
/src/hammer/buildroot/toolchain_build_arm/gcc-4.2.1-final/./gcc/xgcc -B/src/hammer/buildroot/toolchain_build_arm/gcc-4.2.1-final/./gcc/ -B/usr/arm-linux-uclibc/bin/ -B/usr/arm-linux-uclibc/lib/ -isystem /usr/arm-linux-uclibc/include -isystem /usr/arm-linux-uclibc/sys-include -O2 -g -Os -DIN_GCC -DCROSS_COMPILE -W -Wall -Wwrite-strings -Wstrict-prototypes -Wmissing-prototypes -Wold-style-definition -isystem ./include -fomit-frame-pointer -fPIC -g0 -DHAVE_GTHR_DEFAULT -DIN_LIBGCC2 -D__GCC_FLOAT_NOT_NEEDED -I. -I. -I/src/hammer/buildroot/toolchain_build_arm/gcc-4.2.1/gcc -I/src/hammer/buildroot/toolchain_build_arm/gcc-4.2.1/gcc/. -I/src/hammer/buildroot/toolchain_build_arm/gcc-4.2.1/gcc/../include -I/src/hammer/buildroot/toolchain_build_arm/gcc-4.2.1/gcc/../libcpp/include -I/src/hammer/buildroot/toolchain_build_arm/gmp/include -I/src/hammer/buildroot/toolchain_build_arm/mpfr/include -I/src/hammer/buildroot/toolchain_build_arm/gcc-4.2.1/gcc/../libdecnumber -I../libdecnumber -DL_udivmoddi4 -fvisibility=hidden -DHIDE_EXPORTS -fexceptions -fnon-call-exceptions -c /src/hammer/buildroot/toolchain_build_arm/gcc-4.2.1/gcc/libgcc2.c -o libgcc/./_udivmoddi4.o
In file included from /usr/include/linux/errno.h:4,
from /usr/include/bits/errno.h:25,
from /usr/include/errno.h:36,
from /src/hammer/buildroot/toolchain_build_arm/gcc-4.2.1/gcc/tsystem.h:96,
from /src/hammer/buildroot/toolchain_build_arm/gcc-4.2.1/gcc/libgcc2.c:33:
/usr/include/asm/errno.h:9:4: warning: #warning This machine appears to be neither x86_64 nor i386.
rm -f ./libgcc.a
/src/hammer/buildroot/build_arm/staging_dir/usr/arm-linux-uclibc/bin/ar rc ./libgcc.a libgcc/./_udivsi3.o libgcc/./_divsi3.o libgcc/./_umodsi3.o libgcc/./_modsi3.o libgcc/./_dvmd_lnx.o libgcc/./_muldi3.o libgcc/./_negdi2.o libgcc/./_lshrdi3.o libgcc/./_ashldi3.o libgcc/./_ashrdi3.o libgcc/./_cmpdi2.o libgcc/./_ucmpdi2.o libgcc/./_clear_cache.o libgcc/./_enable_execute_stack.o libgcc/./_trampoline.o libgcc/./__main.o libgcc/./_absvsi2.o libgcc/./_absvdi2.o libgcc/./_addvsi3.o libgcc/./_addvdi3.o libgcc/./_subvsi3.o libgcc/./_subvdi3.o libgcc/./_mulvsi3.o libgcc/./_mulvdi3.o libgcc/./_negvsi2.o libgcc/./_negvdi2.o libgcc/./_ctors.o libgcc/./_ffssi2.o libgcc/./_ffsdi2.o libgcc/./_clz.o libgcc/./_clzsi2.o libgcc/./_clzdi2.o libgcc/./_ctzsi2.o libgcc/./_ctzdi2.o libgcc/./_popcount_tab.o libgcc/./_popcountsi2.o libgcc/./_popcountdi2.o libgcc/./_paritysi2.o libgcc/./_paritydi2.o libgcc/./_powisf2.o libgcc/./_powidf2.o libgcc/./_powixf2.o libgcc/./_powitf2.o libgcc/./_mulsc3.o libgcc/./_muldc3.o libgcc/./_mulxc3.o libgcc/./_multc3.o libgcc/./_divsc3.o libgcc/./_divdc3.o libgcc/./_divxc3.o libgcc/./_divtc3.o libgcc/./_fixunssfsi.o libgcc/./_fixunsdfsi.o libgcc/./_fixunsxfsi.o libgcc/./_fixsfdi.o libgcc/./_fixunssfdi.o libgcc/./_floatdisf.o libgcc/./_floatundisf.o libgcc/./_fixdfdi.o libgcc/./_fixunsdfdi.o libgcc/./_floatdidf.o libgcc/./_floatundidf.o libgcc/./_fixxfdi.o libgcc/./_fixunsxfdi.o libgcc/./_floatdixf.o libgcc/./_floatundixf.o libgcc/./_fixtfdi.o libgcc/./_fixunstfdi.o libgcc/./_floatditf.o libgcc/./_floatunditf.o libgcc/./_eprintf.o libgcc/./__gcc_bcmp.o libgcc/./_divdi3.o libgcc/./_moddi3.o libgcc/./_udivdi3.o libgcc/./_umoddi3.o libgcc/./_udiv_w_sdiv.o libgcc/./_udivmoddi4.o
/src/hammer/buildroot/build_arm/staging_dir/usr/arm-linux-uclibc/bin/ranlib ./libgcc.a
/src/hammer/buildroot/toolchain_build_arm/gcc-4.2.1-final/./gcc/xgcc -B/src/hammer/buildroot/toolchain_build_arm/gcc-4.2.1-final/./gcc/ -B/usr/arm-linux-uclibc/bin/ -B/usr/arm-linux-uclibc/lib/ -isystem /usr/arm-linux-uclibc/include -isystem /usr/arm-linux-uclibc/sys-include -O2 -g -Os -DIN_GCC -DCROSS_COMPILE -W -Wall -Wwrite-strings -Wstrict-prototypes -Wmissing-prototypes -Wold-style-definition -isystem ./include -fomit-frame-pointer -fPIC -g0 -DHAVE_GTHR_DEFAULT -DIN_LIBGCC2 -D__GCC_FLOAT_NOT_NEEDED -I. -I. -I/src/hammer/buildroot/toolchain_build_arm/gcc-4.2.1/gcc -I/src/hammer/buildroot/toolchain_build_arm/gcc-4.2.1/gcc/. -I/src/hammer/buildroot/toolchain_build_arm/gcc-4.2.1/gcc/../include -I/src/hammer/buildroot/toolchain_build_arm/gcc-4.2.1/gcc/../libcpp/include -I/src/hammer/buildroot/toolchain_build_arm/gmp/include -I/src/hammer/buildroot/toolchain_build_arm/mpfr/include -I/src/hammer/buildroot/toolchain_build_arm/gcc-4.2.1/gcc/../libdecnumber -I../libdecnumber -DL_gcov -c /src/hammer/buildroot/toolchain_build_arm/gcc-4.2.1/gcc/libgcov.c -o libgcc/./_gcov.o
In file included from /usr/include/linux/errno.h:4,
from /usr/include/bits/errno.h:25,
from /usr/include/errno.h:36,
from /src/hammer/buildroot/toolchain_build_arm/gcc-4.2.1/gcc/tsystem.h:96,
from /src/hammer/buildroot/toolchain_build_arm/gcc-4.2.1/gcc/libgcov.c:33:
/usr/include/asm/errno.h:9:4: warning: #warning This machine appears to be neither x86_64 nor i386.
In file included from /src/hammer/buildroot/toolchain_build_arm/gcc-4.2.1/gcc/libgcov.c:82:
/src/hammer/buildroot/toolchain_build_arm/gcc-4.2.1/gcc/gcov-io.c: In function '__gcov_open':
/src/hammer/buildroot/toolchain_build_arm/gcc-4.2.1/gcc/gcov-io.c:93: error: 'EINTR' undeclared (first use in this function)
/src/hammer/buildroot/toolchain_build_arm/gcc-4.2.1/gcc/gcov-io.c:93: error: (Each undeclared identifier is reported only once
/src/hammer/buildroot/toolchain_build_arm/gcc-4.2.1/gcc/gcov-io.c:93: error: for each function it appears in.)
/src/hammer/buildroot/toolchain_build_arm/gcc-4.2.1/gcc/libgcov.c: In function 'create_file_directory':
/src/hammer/buildroot/toolchain_build_arm/gcc-4.2.1/gcc/libgcov.c:114: error: 'EEXIST' undeclared (first use in this function)
make[4]: *** [libgcc/./_gcov.o] Error 1
make[4]: Leaving directory `/src/hammer/buildroot/toolchain_build_arm/gcc-4.2.1-final/gcc'
make[3]: *** [libgcc.a] Error 2
make[3]: Leaving directory `/src/hammer/buildroot/toolchain_build_arm/gcc-4.2.1-final/gcc'
make[2]: *** [all-gcc] Error 2
make[2]: Leaving directory `/src/hammer/buildroot/toolchain_build_arm/gcc-4.2.1-final'
make[1]: *** [all] Error 2
make[1]: Leaving directory `/src/hammer/buildroot/toolchain_build_arm/gcc-4.2.1-final'
make: *** [/src/hammer/buildroot/toolchain_build_arm/gcc-4.2.1-final/.compiled] Error 2
linuxguy@intrepid </src/hammer/buildroot>