All pastes #877154 Raw Edit

Etwas

public text v1 · immutable
#877154 ·published 2008-01-29 09:28 UTC
rendered paste body
# emerge -av x11-drivers/nvidia-drivers

These are the packages that would be merged, in order:

Calculating dependencies... done!
[ebuild     UD] x11-drivers/nvidia-drivers-1.0.9639-r90 [100.14.19-r10] USE="distribution dlloader%* -no-ko% (-gtk%) (-multilib%)" 0 kB [1]

Total: 1 package (1 downgrade), Size of downloads: 0 kB
Portage tree and overlays:
 [0] /usr/portage
 [1] /usr/portage/local/layman/sabayon

Would you like to merge these packages? [Yes/No] yes
>>> Verifying ebuild Manifests...

>>> Emerging (1 of 1) x11-drivers/nvidia-drivers-1.0.9639-r90 to /
 * NVIDIA-Linux-x86-1.0-9639-pkg0.run MD5 ;-) ...                         [ ok ]
 * NVIDIA-Linux-x86-1.0-9639-pkg0.run RMD160 ;-) ...                      [ ok ]
 * NVIDIA-Linux-x86-1.0-9639-pkg0.run SHA1 ;-) ...                        [ ok ]
 * NVIDIA-Linux-x86-1.0-9639-pkg0.run SHA256 ;-) ...                      [ ok ]
 * NVIDIA-Linux-x86-1.0-9639-pkg0.run size ;-) ...                        [ ok ]
 * checking ebuild checksums ;-) ...                                      [ ok ]
 * checking auxfile checksums ;-) ...                                     [ ok ]
 * checking miscfile checksums ;-) ...                                    [ ok ]
 * checking NVIDIA-Linux-x86-1.0-9639-pkg0.run ;-) ...                    [ ok ]
 * Determining the location of the kernel source code
 * Found kernel source directory:
 *     /usr/src/linux
 * Found kernel object directory:
 *     /lib/modules/2.6.23-sabayon-r1/build
 * Found sources for kernel version:
 *     2.6.23-sabayon-r1
 * Checking for MTRR support ...                                          [ ok ]
>>> Unpacking source...
Creating directory NVIDIA-Linux-x86-1.0-9639-pkg0
Verifying archive integrity... OK
Uncompressing NVIDIA Accelerated Graphics Driver for Linux-x86 1.0-9639..............................................................................................................................
 * Applying NVIDIA_glx-defines.patch ...                                  [ ok ]
 * Applying NVIDIA_glx-glheader.patch ...                                 [ ok ]
 * Converting Makefile.kbuild to use M= instead of SUBDIRS= ...           [ ok ]
>>> Source unpacked.
>>> Compiling source in /var/tmp/portage/x11-drivers/nvidia-drivers-1.0.9639-r90/work/NVIDIA-Linux-x86-1.0-9639-pkg0/usr/src/nv ...
 * Preparing nvidia module

NVIDIA: calling KBUILD...
make CC=i586-pc-linux-gnu-gcc KBUILD_OUTPUT=/lib/modules/2.6.23-sabayon-r1/build KBUILD_VERBOSE=1 -C /usr/src/linux M=/var/tmp/portage/x11-drivers/nvidia-drivers-1.0.9639-r90/work/NVIDIA-Linux-x86-1.0-9639-pkg0/usr/src/nv modules
make[2]: warning: jobserver unavailable: using -j1.  Add `+' to parent make rule.
/var/tmp/portage/x11-drivers/nvidia-drivers-1.0.9639-r90/work/NVIDIA-Linux-x86-1.0-9639-pkg0/usr/src/nv/nv.c:110: error: expected â=â, â,â, â;â, âasmâ or â__attribute__â before â*â token
/var/tmp/portage/x11-drivers/nvidia-drivers-1.0.9639-r90/work/NVIDIA-Linux-x86-1.0-9639-pkg0/usr/src/nv/nv.c: In function ânvos_create_allocâ:
/var/tmp/portage/x11-drivers/nvidia-drivers-1.0.9639-r90/work/NVIDIA-Linux-x86-1.0-9639-pkg0/usr/src/nv/nv.c:332: error: ânv_pte_t_cacheâ undeclared (first use in this function)
/var/tmp/portage/x11-drivers/nvidia-drivers-1.0.9639-r90/work/NVIDIA-Linux-x86-1.0-9639-pkg0/usr/src/nv/nv.c:332: error: (Each undeclared identifier is reported only once
/var/tmp/portage/x11-drivers/nvidia-drivers-1.0.9639-r90/work/NVIDIA-Linux-x86-1.0-9639-pkg0/usr/src/nv/nv.c:332: error: for each function it appears in.)
/var/tmp/portage/x11-drivers/nvidia-drivers-1.0.9639-r90/work/NVIDIA-Linux-x86-1.0-9639-pkg0/usr/src/nv/nv.c: In function ânvos_free_allocâ:
/var/tmp/portage/x11-drivers/nvidia-drivers-1.0.9639-r90/work/NVIDIA-Linux-x86-1.0-9639-pkg0/usr/src/nv/nv.c:364: error: ânv_pte_t_cacheâ undeclared (first use in this function)
/var/tmp/portage/x11-drivers/nvidia-drivers-1.0.9639-r90/work/NVIDIA-Linux-x86-1.0-9639-pkg0/usr/src/nv/nv.c: In function ânvidia_init_moduleâ:
/var/tmp/portage/x11-drivers/nvidia-drivers-1.0.9639-r90/work/NVIDIA-Linux-x86-1.0-9639-pkg0/usr/src/nv/nv.c:1292: error: ânv_pte_t_cacheâ undeclared (first use in this function)
/var/tmp/portage/x11-drivers/nvidia-drivers-1.0.9639-r90/work/NVIDIA-Linux-x86-1.0-9639-pkg0/usr/src/nv/nv.c:1292: error: too many arguments to function âkmem_cache_createâ
/var/tmp/portage/x11-drivers/nvidia-drivers-1.0.9639-r90/work/NVIDIA-Linux-x86-1.0-9639-pkg0/usr/src/nv/nv.c:1426: error: void value not ignored as it ought to be
/var/tmp/portage/x11-drivers/nvidia-drivers-1.0.9639-r90/work/NVIDIA-Linux-x86-1.0-9639-pkg0/usr/src/nv/nv.c: In function ânvidia_exit_moduleâ:
/var/tmp/portage/x11-drivers/nvidia-drivers-1.0.9639-r90/work/NVIDIA-Linux-x86-1.0-9639-pkg0/usr/src/nv/nv.c:1453: error: void value not ignored as it ought to be
/var/tmp/portage/x11-drivers/nvidia-drivers-1.0.9639-r90/work/NVIDIA-Linux-x86-1.0-9639-pkg0/usr/src/nv/nv.c:1557: error: ânv_pte_t_cacheâ undeclared (first use in this function)
make[4]: *** [/var/tmp/portage/x11-drivers/nvidia-drivers-1.0.9639-r90/work/NVIDIA-Linux-x86-1.0-9639-pkg0/usr/src/nv/nv.o] Error 1
make[3]: *** [_module_/var/tmp/portage/x11-drivers/nvidia-drivers-1.0.9639-r90/work/NVIDIA-Linux-x86-1.0-9639-pkg0/usr/src/nv] Error 2
make[2]: *** [modules] Error 2
NVIDIA: left KBUILD.
nvidia.ko failed to build!
make[1]: *** [module] Error 1
make: *** [module] Error 2
 *
 * ERROR: x11-drivers/nvidia-drivers-1.0.9639-r90 failed.
 * Call stack:
 *   ebuild.sh, line 1648:   Called dyn_compile
 *   ebuild.sh, line 988:   Called qa_call 'src_compile'
 *   ebuild.sh, line 44:   Called src_compile
 *   nvidia-drivers-1.0.9639-r90.ebuild, line 181:   Called linux-mod_src_compile
 *   linux-mod.eclass, line 519:   Called die
 *
 * Unable to make  IGNORE_CC_MISMATCH=yes V=1 SYSSRC=/usr/src/linux SYSOUT=/lib/modules/2.6.23-sabayon-r1/build clean module.
 * If you need support, post the topmost build error, and the call stack if relevant.
 * A complete build log is located at '/var/tmp/portage/x11-drivers/nvidia-drivers-1.0.9639-r90/temp/build.log'.
 *

 * Messages for package x11-drivers/nvidia-drivers-1.0.9639-r90:

 *
 * ERROR: x11-drivers/nvidia-drivers-1.0.9639-r90 failed.
 * Call stack:
 *   ebuild.sh, line 1648:   Called dyn_compile
 *   ebuild.sh, line 988:   Called qa_call 'src_compile'
 *   ebuild.sh, line 44:   Called src_compile
 *   nvidia-drivers-1.0.9639-r90.ebuild, line 181:   Called linux-mod_src_compile
 *   linux-mod.eclass, line 519:   Called die
 *
 * Unable to make  IGNORE_CC_MISMATCH=yes V=1 SYSSRC=/usr/src/linux SYSOUT=/lib/modules/2.6.23-sabayon-r1/build clean module.
 * If you need support, post the topmost build error, and the call stack if relevant.
 * A complete build log is located at '/var/tmp/portage/x11-drivers/nvidia-drivers-1.0.9639-r90/temp/build.log'.
 *
palme ta #