All pastes #876822 Raw Edit

Phantom error

public text v1 · immutable
#876822 ·published 2008-01-29 02:41 UTC
rendered paste body
cc -I libfdt -MM -MG -MT "tests/notfound.o tests/notfound.d" tests/notfound.c > tests/notfound.d
cc -I libfdt -MM -MG -MT "tests/node_offset_by_compatible.o tests/node_offset_by_compatible.d" tests/node_offset_by_compatible.c > tests/node_offset_by_compatible.d
cc -I libfdt -MM -MG -MT "tests/node_check_compatible.o tests/node_check_compatible.d" tests/node_check_compatible.c > tests/node_check_compatible.d
cc -I libfdt -MM -MG -MT "tests/node_offset_by_phandle.o tests/node_offset_by_phandle.d" tests/node_offset_by_phandle.c > tests/node_offset_by_phandle.d
cc -I libfdt -MM -MG -MT "tests/node_offset_by_prop_value.o tests/node_offset_by_prop_value.d" tests/node_offset_by_prop_value.c > tests/node_offset_by_prop_value.d
cc -I libfdt -MM -MG -MT "tests/parent_offset.o tests/parent_offset.d" tests/parent_offset.c > tests/parent_offset.d
cc -I libfdt -MM -MG -MT "tests/supernode_atdepth_offset.o tests/supernode_atdepth_offset.d" tests/supernode_atdepth_offset.c > tests/supernode_atdepth_offset.d
cc -I libfdt -MM -MG -MT "tests/get_path.o tests/get_path.d" tests/get_path.c > tests/get_path.d
cc -I libfdt -MM -MG -MT "tests/get_phandle.o tests/get_phandle.d" tests/get_phandle.c > tests/get_phandle.d
cc -I libfdt -MM -MG -MT "tests/getprop.o tests/getprop.d" tests/getprop.c > tests/getprop.d
cc -I libfdt -MM -MG -MT "tests/get_name.o tests/get_name.d" tests/get_name.c > tests/get_name.d
cc -I libfdt -MM -MG -MT "tests/path_offset.o tests/path_offset.d" tests/path_offset.c > tests/path_offset.d
cc -I libfdt -MM -MG -MT "tests/subnode_offset.o tests/subnode_offset.d" tests/subnode_offset.c > tests/subnode_offset.d
cc -I libfdt -MM -MG -MT "tests/find_property.o tests/find_property.d" tests/find_property.c > tests/find_property.d
cc -I libfdt -MM -MG -MT "tests/root_node.o tests/root_node.d" tests/root_node.c > tests/root_node.d
cc -I libfdt -MM -MG -MT "tests/get_mem_rsv.o tests/get_mem_rsv.d" tests/get_mem_rsv.c > tests/get_mem_rsv.d
cc -I libfdt -MM -MG -MT "libfdt/fdt_strerror.o libfdt/fdt_strerror.d" libfdt/fdt_strerror.c > libfdt/fdt_strerror.d
cc -I libfdt -MM -MG -MT "libfdt/fdt_rw.o libfdt/fdt_rw.d" libfdt/fdt_rw.c > libfdt/fdt_rw.d
cc -I libfdt -MM -MG -MT "libfdt/fdt_sw.o libfdt/fdt_sw.d" libfdt/fdt_sw.c > libfdt/fdt_sw.d
cc -I libfdt -MM -MG -MT "libfdt/fdt_wip.o libfdt/fdt_wip.d" libfdt/fdt_wip.c > libfdt/fdt_wip.d
cc -I libfdt -MM -MG -MT "libfdt/fdt_ro.o libfdt/fdt_ro.d" libfdt/fdt_ro.c > libfdt/fdt_ro.d
cc -I libfdt -MM -MG -MT "libfdt/fdt.o libfdt/fdt.d" libfdt/fdt.c > libfdt/fdt.d
cc -I libfdt -MM -MG -MT "ftdump.o ftdump.d" ftdump.c > ftdump.d
bison -d dtc-parser.y
cc -I libfdt -MM -MG -MT "dtc-parser.tab.o dtc-parser.tab.d" dtc-parser.tab.c > dtc-parser.tab.d
flex -odtc-lexer.lex.c dtc-lexer.l
cc -I libfdt -MM -MG -MT "dtc-lexer.lex.o dtc-lexer.lex.d" dtc-lexer.lex.c > dtc-lexer.lex.d
cc -I libfdt -MM -MG -MT "checks.o checks.d" checks.c > checks.d
cc -I libfdt -MM -MG -MT "srcpos.o srcpos.d" srcpos.c > srcpos.d
cc -I libfdt -MM -MG -MT "treesource.o treesource.d" treesource.c > treesource.d
cc -I libfdt -MM -MG -MT "livetree.o livetree.d" livetree.c > livetree.d
cc -I libfdt -MM -MG -MT "data.o data.d" data.c > data.d
cc -I libfdt -MM -MG -MT "fstree.o fstree.d" fstree.c > fstree.d
cc -I libfdt -MM -MG -MT "flattree.o flattree.d" flattree.c > flattree.d
cc -I libfdt -MM -MG -MT "dtc.o dtc.d" dtc.c > dtc.d
make[2]: *** [/Users/andy/openwrt/openwrt-uclibctest/build_dir/mipsel/dtc/.built] Error 2
make[1]: *** [tools/dtc/compile] Error 2
make: *** [tools/dtc-compile] Error 2