rendered paste bodyThis file contains any messages produced by compilers while
running configure, to aid debugging if configure makes a mistake.
It was created by configure, which was
generated by GNU Autoconf 2.59. Invocation command line was
$ ./configure
## --------- ##
## Platform. ##
## --------- ##
hostname = linux-it9r
uname -m = x86_64
uname -r = 2.6.16.13-4-default
uname -s = Linux
uname -v = #1 Wed May 3 04:53:23 UTC 2006
/usr/bin/uname -p = unknown
/bin/uname -X = unknown
/bin/arch = x86_64
/usr/bin/arch -k = unknown
/usr/convex/getsysinfo = unknown
hostinfo = unknown
/bin/machine = unknown
/usr/bin/oslevel = unknown
/bin/universe = unknown
PATH: /usr/local/bin
PATH: /usr/bin
PATH: /usr/X11R6/bin
PATH: /bin
PATH: /usr/games
PATH: /opt/gnome/bin
PATH: /opt/kde3/bin
PATH: /usr/lib64/jvm/jre/bin
PATH: /usr/lib/mit/bin
PATH: /usr/lib/mit/sbin
PATH: /usr/lib/qt3/bin
## ----------- ##
## Core tests. ##
## ----------- ##
configure:1590: checking build system type
configure:1608: result: x86_64-unknown-linux-gnu
configure:1616: checking host system type
configure:1630: result: x86_64-unknown-linux-gnu
configure:1638: checking target system type
configure:1652: result: x86_64-unknown-linux-gnu
configure:1699: checking for a BSD-compatible install
configure:1754: result: /usr/bin/install -c
configure:1769: checking for -p flag to install
configure:1782: result: yes
configure:1793: checking whether build environment is sane
configure:1836: result: yes
configure:1856: checking for gawk
configure:1872: found /usr/bin/gawk
configure:1882: result: gawk
configure:1892: checking whether make sets $(MAKE)
configure:1912: result: yes
configure:2094: checking for kde-config
configure:2156: result: /opt/kde3/bin/kde-config
configure:2252: checking where to install
configure:2256: result: /opt/kde3 (as returned by kde-config)
configure:2311: checking for style of include used by make
configure:2339: result: GNU
configure:2487: checking for gcc
configure:2503: found /usr/local/bin/gcc
configure:2513: result: gcc
configure:2757: checking for C compiler version
configure:2760: gcc --version </dev/null >&5
gcc (GCC) 4.1.0 (SUSE Linux)
Copyright (C) 2006 Free Software Foundation, Inc.
This is free software; see the source for copying conditions. There is NO
warranty; not even for MERCHANTABILITY or FITNESS FOR A PARTICULAR PURPOSE.
configure:2763: $? = 0
configure:2765: gcc -v </dev/null >&5
Using built-in specs.
Target: x86_64-suse-linux
Configured with: ../configure --enable-threads=posix --prefix=/usr --with-local-prefix=/usr/local --infodir=/usr/share/info --mandir=/usr/share/man --libdir=/usr/lib64 --libexecdir=/usr/lib64 --enable-languages=c,c++,objc,fortran,java,ada --enable-checking=release --with-gxx-include-dir=/usr/include/c++/4.1.0 --enable-ssp --disable-libssp --enable-java-awt=gtk --enable-gtk-cairo --disable-libjava-multilib --with-slibdir=/lib64 --with-system-zlib --enable-shared --enable-__cxa_atexit --enable-libstdcxx-allocator=new --without-system-libunwind --with-cpu=generic --host=x86_64-suse-linux
Thread model: posix
gcc version 4.1.0 (SUSE Linux)
configure:2768: $? = 0
configure:2770: gcc -V </dev/null >&5
gcc: '-V' option must have argument
configure:2773: $? = 1
configure:2796: checking for C compiler default output file name
configure:2799: gcc conftest.c >&5
configure:2802: $? = 0
configure:2848: result: a.out
configure:2853: checking whether the C compiler works
configure:2859: ./a.out
configure:2862: $? = 0
configure:2879: result: yes
configure:2886: checking whether we are cross compiling
configure:2888: result: no
configure:2891: checking for suffix of executables
configure:2893: gcc -o conftest conftest.c >&5
configure:2896: $? = 0
configure:2921: result:
configure:2927: checking for suffix of object files
configure:2948: gcc -c conftest.c >&5
configure:2951: $? = 0
configure:2973: result: o
configure:2977: checking whether we are using the GNU C compiler
configure:3001: gcc -c conftest.c >&5
configure:3007: $? = 0
configure:3010: test -z || test ! -s conftest.err
configure:3013: $? = 0
configure:3016: test -s conftest.o
configure:3019: $? = 0
configure:3032: result: yes
configure:3038: checking whether gcc accepts -g
configure:3059: gcc -c -g conftest.c >&5
configure:3065: $? = 0
configure:3068: test -z || test ! -s conftest.err
configure:3071: $? = 0
configure:3074: test -s conftest.o
configure:3077: $? = 0
configure:3088: result: yes
configure:3105: checking for gcc option to accept ANSI C
configure:3175: gcc -c conftest.c >&5
configure:3181: $? = 0
configure:3184: test -z || test ! -s conftest.err
configure:3187: $? = 0
configure:3190: test -s conftest.o
configure:3193: $? = 0
configure:3211: result: none needed
configure:3229: gcc -c conftest.c >&5
conftest.c:2: error: expected '=', ',', ';', 'asm' or '__attribute__' before 'me'
configure:3235: $? = 1
configure: failed program was:
| #ifndef __cplusplus
| choke me
| #endif
configure:3367: checking dependency style of gcc
configure:3450: result: gcc3
configure:3473: checking how to run the C preprocessor
configure:3508: gcc -E conftest.c
configure:3514: $? = 0
configure:3546: gcc -E conftest.c
conftest.c:11:28: error: ac_nonexistent.h: No such file or directory
configure:3552: $? = 1
configure: failed program was:
| /* confdefs.h. */
|
| #define PACKAGE_NAME ""
| #define PACKAGE_TARNAME ""
| #define PACKAGE_VERSION ""
| #define PACKAGE_STRING ""
| #define PACKAGE_BUGREPORT ""
| #define PACKAGE "amarok-1.4.1"
| #define VERSION "3.5.3"
| /* end confdefs.h. */
| #include <ac_nonexistent.h>
configure:3591: result: gcc -E
configure:3615: gcc -E conftest.c
configure:3621: $? = 0
configure:3653: gcc -E conftest.c
conftest.c:11:28: error: ac_nonexistent.h: No such file or directory
configure:3659: $? = 1
configure: failed program was:
| /* confdefs.h. */
|
| #define PACKAGE_NAME ""
| #define PACKAGE_TARNAME ""
| #define PACKAGE_VERSION ""
| #define PACKAGE_STRING ""
| #define PACKAGE_BUGREPORT ""
| #define PACKAGE "amarok-1.4.1"
| #define VERSION "3.5.3"
| /* end confdefs.h. */
| #include <ac_nonexistent.h>
configure:3783: checking for g++
configure:3799: found /usr/local/bin/g++
configure:3809: result: g++
configure:3825: checking for C++ compiler version
configure:3828: g++ --version </dev/null >&5
g++ (GCC) 4.1.0 (SUSE Linux)
Copyright (C) 2006 Free Software Foundation, Inc.
This is free software; see the source for copying conditions. There is NO
warranty; not even for MERCHANTABILITY or FITNESS FOR A PARTICULAR PURPOSE.
configure:3831: $? = 0
configure:3833: g++ -v </dev/null >&5
Using built-in specs.
Target: i586-suse-linux
Configured with: ../configure --enable-threads=posix --prefix=/usr --with-local-prefix=/usr/local --infodir=/usr/share/info --mandir=/usr/share/man --libdir=/usr/lib --libexecdir=/usr/lib --enable-languages=c,c++,objc,fortran,java,ada --enable-checking=release --with-gxx-include-dir=/usr/include/c++/4.1.0 --enable-ssp --disable-libssp --enable-java-awt=gtk --enable-gtk-cairo --disable-libjava-multilib --with-slibdir=/lib --with-system-zlib --enable-shared --enable-__cxa_atexit --enable-libstdcxx-allocator=new --without-system-libunwind --with-cpu=generic --host=i586-suse-linux
Thread model: posix
gcc version 4.1.0 (SUSE Linux)
configure:3836: $? = 0
configure:3838: g++ -V </dev/null >&5
g++: '-V' option must have argument
configure:3841: $? = 1
configure:3844: checking whether we are using the GNU C++ compiler
configure:3868: g++ -c conftest.cc >&5
g++: error trying to exec 'cc1plus': execvp: No such file or directory
configure:3874: $? = 1
configure: failed program was:
| /* confdefs.h. */
|
| #define PACKAGE_NAME ""
| #define PACKAGE_TARNAME ""
| #define PACKAGE_VERSION ""
| #define PACKAGE_STRING ""
| #define PACKAGE_BUGREPORT ""
| #define PACKAGE "amarok-1.4.1"
| #define VERSION "3.5.3"
| /* end confdefs.h. */
|
| int
| main ()
| {
| #ifndef __GNUC__
| choke me
| #endif
|
| ;
| return 0;
| }
configure:3899: result: no
configure:3905: checking whether g++ accepts -g
configure:3926: g++ -c -g conftest.cc >&5
g++: error trying to exec 'cc1plus': execvp: No such file or directory
configure:3932: $? = 1
configure: failed program was:
| /* confdefs.h. */
|
| #define PACKAGE_NAME ""
| #define PACKAGE_TARNAME ""
| #define PACKAGE_VERSION ""
| #define PACKAGE_STRING ""
| #define PACKAGE_BUGREPORT ""
| #define PACKAGE "amarok-1.4.1"
| #define VERSION "3.5.3"
| /* end confdefs.h. */
|
| int
| main ()
| {
|
| ;
| return 0;
| }
configure:3955: result: no
configure:3997: g++ -c conftest.cc >&5
g++: error trying to exec 'cc1plus': execvp: No such file or directory
configure:4003: $? = 1
configure: failed program was:
| /* confdefs.h. */
|
| #define PACKAGE_NAME ""
| #define PACKAGE_TARNAME ""
| #define PACKAGE_VERSION ""
| #define PACKAGE_STRING ""
| #define PACKAGE_BUGREPORT ""
| #define PACKAGE "amarok-1.4.1"
| #define VERSION "3.5.3"
| /* end confdefs.h. */
|
| #include <stdlib.h>
| int
| main ()
| {
| exit (42);
| ;
| return 0;
| }
configure:3997: g++ -c conftest.cc >&5
g++: error trying to exec 'cc1plus': execvp: No such file or directory
configure:4003: $? = 1
configure: failed program was:
| /* confdefs.h. */
|
| #define PACKAGE_NAME ""
| #define PACKAGE_TARNAME ""
| #define PACKAGE_VERSION ""
| #define PACKAGE_STRING ""
| #define PACKAGE_BUGREPORT ""
| #define PACKAGE "amarok-1.4.1"
| #define VERSION "3.5.3"
| /* end confdefs.h. */
| extern "C" void std::exit (int) throw (); using std::exit;
| #include <stdlib.h>
| int
| main ()
| {
| exit (42);
| ;
| return 0;
| }
configure:3997: g++ -c conftest.cc >&5
g++: error trying to exec 'cc1plus': execvp: No such file or directory
configure:4003: $? = 1
configure: failed program was:
| /* confdefs.h. */
|
| #define PACKAGE_NAME ""
| #define PACKAGE_TARNAME ""
| #define PACKAGE_VERSION ""
| #define PACKAGE_STRING ""
| #define PACKAGE_BUGREPORT ""
| #define PACKAGE "amarok-1.4.1"
| #define VERSION "3.5.3"
| /* end confdefs.h. */
| extern "C" void std::exit (int); using std::exit;
| #include <stdlib.h>
| int
| main ()
| {
| exit (42);
| ;
| return 0;
| }
configure:3997: g++ -c conftest.cc >&5
g++: error trying to exec 'cc1plus': execvp: No such file or directory
configure:4003: $? = 1
configure: failed program was:
| /* confdefs.h. */
|
| #define PACKAGE_NAME ""
| #define PACKAGE_TARNAME ""
| #define PACKAGE_VERSION ""
| #define PACKAGE_STRING ""
| #define PACKAGE_BUGREPORT ""
| #define PACKAGE "amarok-1.4.1"
| #define VERSION "3.5.3"
| /* end confdefs.h. */
| extern "C" void exit (int) throw ();
| #include <stdlib.h>
| int
| main ()
| {
| exit (42);
| ;
| return 0;
| }
configure:3997: g++ -c conftest.cc >&5
g++: error trying to exec 'cc1plus': execvp: No such file or directory
configure:4003: $? = 1
configure: failed program was:
| /* confdefs.h. */
|
| #define PACKAGE_NAME ""
| #define PACKAGE_TARNAME ""
| #define PACKAGE_VERSION ""
| #define PACKAGE_STRING ""
| #define PACKAGE_BUGREPORT ""
| #define PACKAGE "amarok-1.4.1"
| #define VERSION "3.5.3"
| /* end confdefs.h. */
| extern "C" void exit (int);
| #include <stdlib.h>
| int
| main ()
| {
| exit (42);
| ;
| return 0;
| }
configure:3997: g++ -c conftest.cc >&5
g++: error trying to exec 'cc1plus': execvp: No such file or directory
configure:4003: $? = 1
configure: failed program was:
| /* confdefs.h. */
|
| #define PACKAGE_NAME ""
| #define PACKAGE_TARNAME ""
| #define PACKAGE_VERSION ""
| #define PACKAGE_STRING ""
| #define PACKAGE_BUGREPORT ""
| #define PACKAGE "amarok-1.4.1"
| #define VERSION "3.5.3"
| /* end confdefs.h. */
| void exit (int);
| #include <stdlib.h>
| int
| main ()
| {
| exit (42);
| ;
| return 0;
| }
configure:4084: checking dependency style of g++
configure:4167: result: none
configure:4186: checking whether gcc is blacklisted
configure:4212: gcc -c -O2 conftest.c >&5
configure:4218: $? = 0
configure:4221: test -z || test ! -s conftest.err
configure:4224: $? = 0
configure:4227: test -s conftest.o
configure:4230: $? = 0
configure:4242: result: no
configure:4576: checking whether g++ supports -Wmissing-format-attribute
configure:4612: rm -rf SunWS_cache; g++ -o conftest -ansi -D_XOPEN_SOURCE=500 -D_BSD_SOURCE -Wcast-align -Wconversion -Wchar-subscripts -Wall -W -Wpointer-arith -Wmissing-format-attribute conftest.cc 1>&5
g++: error trying to exec 'cc1plus': execvp: No such file or directory
configure:4618: $? = 1
configure: failed program was:
| /* confdefs.h. */
|
| #define PACKAGE_NAME ""
| #define PACKAGE_TARNAME ""
| #define PACKAGE_VERSION ""
| #define PACKAGE_STRING ""
| #define PACKAGE_BUGREPORT ""
| #define PACKAGE "amarok-1.4.1"
| #define VERSION "3.5.3"
| #ifdef __cplusplus
| void exit (int);
| #endif
| /* end confdefs.h. */
|
| int
| main ()
| {
| return 0;
| ;
| return 0;
| }
configure:4656: result: no
configure:4663: checking whether gcc supports -Wmissing-format-attribute
configure:4696: gcc -o conftest -std=iso9899:1990 -W -Wall -Wchar-subscripts -Wshadow -Wpointer-arith -Wmissing-prototypes -Wwrite-strings -D_XOPEN_SOURCE=500 -D_BSD_SOURCE -O2 -Wmissing-format-attribute conftest.c >&5
configure:4702: $? = 0
configure:4705: test -z || test ! -s conftest.err
configure:4708: $? = 0
configure:4711: test -s conftest
configure:4714: $? = 0
configure:4735: result: yes
configure:4749: checking whether g++ supports -Wundef
configure:4785: rm -rf SunWS_cache; g++ -o conftest -ansi -D_XOPEN_SOURCE=500 -D_BSD_SOURCE -Wcast-align -Wconversion -Wchar-subscripts -Wall -W -Wpointer-arith -Wundef conftest.cc 1>&5
g++: error trying to exec 'cc1plus': execvp: No such file or directory
configure:4791: $? = 1
configure: failed program was:
| /* confdefs.h. */
|
| #define PACKAGE_NAME ""
| #define PACKAGE_TARNAME ""
| #define PACKAGE_VERSION ""
| #define PACKAGE_STRING ""
| #define PACKAGE_BUGREPORT ""
| #define PACKAGE "amarok-1.4.1"
| #define VERSION "3.5.3"
| #ifdef __cplusplus
| void exit (int);
| #endif
| /* end confdefs.h. */
|
| int
| main ()
| {
| return 0;
| ;
| return 0;
| }
configure:4829: result: no
configure:4836: checking whether g++ supports -Wno-long-long
configure:4872: rm -rf SunWS_cache; g++ -o conftest -ansi -D_XOPEN_SOURCE=500 -D_BSD_SOURCE -Wcast-align -Wconversion -Wchar-subscripts -Wall -W -Wpointer-arith -Wno-long-long conftest.cc 1>&5
g++: error trying to exec 'cc1plus': execvp: No such file or directory
configure:4878: $? = 1
configure: failed program was:
| /* confdefs.h. */
|
| #define PACKAGE_NAME ""
| #define PACKAGE_TARNAME ""
| #define PACKAGE_VERSION ""
| #define PACKAGE_STRING ""
| #define PACKAGE_BUGREPORT ""
| #define PACKAGE "amarok-1.4.1"
| #define VERSION "3.5.3"
| #ifdef __cplusplus
| void exit (int);
| #endif
| /* end confdefs.h. */
|
| int
| main ()
| {
| return 0;
| ;
| return 0;
| }
configure:4916: result: no
configure:4923: checking whether g++ supports -Wno-non-virtual-dtor
configure:4959: rm -rf SunWS_cache; g++ -o conftest -ansi -D_XOPEN_SOURCE=500 -D_BSD_SOURCE -Wcast-align -Wconversion -Wchar-subscripts -Wall -W -Wpointer-arith -Wno-non-virtual-dtor conftest.cc 1>&5
g++: error trying to exec 'cc1plus': execvp: No such file or directory
configure:4965: $? = 1
configure: failed program was:
| /* confdefs.h. */
|
| #define PACKAGE_NAME ""
| #define PACKAGE_TARNAME ""
| #define PACKAGE_VERSION ""
| #define PACKAGE_STRING ""
| #define PACKAGE_BUGREPORT ""
| #define PACKAGE "amarok-1.4.1"
| #define VERSION "3.5.3"
| #ifdef __cplusplus
| void exit (int);
| #endif
| /* end confdefs.h. */
|
| int
| main ()
| {
| return 0;
| ;
| return 0;
| }
configure:5003: result: no
configure:6220: checking how to run the C++ preprocessor
configure:6251: g++ -E conftest.cc
g++: error trying to exec 'cc1plus': execvp: No such file or directory
configure:6257: $? = 1
configure: failed program was:
| /* confdefs.h. */
|
| #define PACKAGE_NAME ""
| #define PACKAGE_TARNAME ""
| #define PACKAGE_VERSION ""
| #define PACKAGE_STRING ""
| #define PACKAGE_BUGREPORT ""
| #define PACKAGE "amarok-1.4.1"
| #define VERSION "3.5.3"
| #ifdef __cplusplus
| void exit (int);
| #endif
| /* end confdefs.h. */
| #ifdef __STDC__
| # include <limits.h>
| #else
| # include <assert.h>
| #endif
| Syntax error
configure:6251: g++ -E conftest.cc
g++: error trying to exec 'cc1plus': execvp: No such file or directory
configure:6257: $? = 1
configure: failed program was:
| /* confdefs.h. */
|
| #define PACKAGE_NAME ""
| #define PACKAGE_TARNAME ""
| #define PACKAGE_VERSION ""
| #define PACKAGE_STRING ""
| #define PACKAGE_BUGREPORT ""
| #define PACKAGE "amarok-1.4.1"
| #define VERSION "3.5.3"
| #ifdef __cplusplus
| void exit (int);
| #endif
| /* end confdefs.h. */
| #ifdef __STDC__
| # include <limits.h>
| #else
| # include <assert.h>
| #endif
| Syntax error
configure:6251: /lib/cpp conftest.cc
configure:6257: $? = 0
configure:6289: /lib/cpp conftest.cc
conftest.cc:14:28: error: ac_nonexistent.h: No such file or directory
configure:6295: $? = 1
configure: failed program was:
| /* confdefs.h. */
|
| #define PACKAGE_NAME ""
| #define PACKAGE_TARNAME ""
| #define PACKAGE_VERSION ""
| #define PACKAGE_STRING ""
| #define PACKAGE_BUGREPORT ""
| #define PACKAGE "amarok-1.4.1"
| #define VERSION "3.5.3"
| #ifdef __cplusplus
| void exit (int);
| #endif
| /* end confdefs.h. */
| #include <ac_nonexistent.h>
configure:6334: result: /lib/cpp
configure:6358: /lib/cpp conftest.cc
configure:6364: $? = 0
configure:6396: /lib/cpp conftest.cc
conftest.cc:14:28: error: ac_nonexistent.h: No such file or directory
configure:6402: $? = 1
configure: failed program was:
| /* confdefs.h. */
|
| #define PACKAGE_NAME ""
| #define PACKAGE_TARNAME ""
| #define PACKAGE_VERSION ""
| #define PACKAGE_STRING ""
| #define PACKAGE_BUGREPORT ""
| #define PACKAGE "amarok-1.4.1"
| #define VERSION "3.5.3"
| #ifdef __cplusplus
| void exit (int);
| #endif
| /* end confdefs.h. */
| #include <ac_nonexistent.h>
configure:6450: checking whether g++ supports -O0
configure:6486: rm -rf SunWS_cache; g++ -o conftest -ansi -D_XOPEN_SOURCE=500 -D_BSD_SOURCE -Wcast-align -Wconversion -Wchar-subscripts -Wall -W -Wpointer-arith -O0 conftest.cc 1>&5
g++: error trying to exec 'cc1plus': execvp: No such file or directory
configure:6492: $? = 1
configure: failed program was:
| /* confdefs.h. */
|
| #define PACKAGE_NAME ""
| #define PACKAGE_TARNAME ""
| #define PACKAGE_VERSION ""
| #define PACKAGE_STRING ""
| #define PACKAGE_BUGREPORT ""
| #define PACKAGE "amarok-1.4.1"
| #define VERSION "3.5.3"
| #ifdef __cplusplus
| void exit (int);
| #endif
| /* end confdefs.h. */
|
| int
| main ()
| {
| return 0;
| ;
| return 0;
| }
configure:6530: result: no
configure:6794: checking whether g++ supports -Wl,--no-undefined
configure:6830: rm -rf SunWS_cache; g++ -o conftest -ansi -D_XOPEN_SOURCE=500 -D_BSD_SOURCE -Wcast-align -Wconversion -Wchar-subscripts -Wall -W -Wpointer-arith -Wl,--no-undefined conftest.cc 1>&5
g++: error trying to exec 'cc1plus': execvp: No such file or directory
configure:6836: $? = 1
configure: failed program was:
| /* confdefs.h. */
|
| #define PACKAGE_NAME ""
| #define PACKAGE_TARNAME ""
| #define PACKAGE_VERSION ""
| #define PACKAGE_STRING ""
| #define PACKAGE_BUGREPORT ""
| #define PACKAGE "amarok-1.4.1"
| #define VERSION "3.5.3"
| #ifdef __cplusplus
| void exit (int);
| #endif
| /* end confdefs.h. */
|
| int
| main ()
| {
| return 0;
| ;
| return 0;
| }
configure:6960: result: no
configure:7092: result: using lib directory suffix 64
configure:7120: checking for a sed that does not truncate output
configure:7174: result: /usr/bin/sed
configure:7177: checking for egrep
configure:7187: result: grep -E
configure:7203: checking for ld used by gcc
configure:7270: result: /usr/x86_64-suse-linux/bin/ld
configure:7279: checking if the linker (/usr/x86_64-suse-linux/bin/ld) is GNU ld
configure:7294: result: yes
configure:7299: checking for /usr/x86_64-suse-linux/bin/ld option to reload object files
configure:7306: result: -r
configure:7315: checking for BSD-compatible nm
configure:7357: result: /usr/bin/nm -B
configure:7361: checking whether ln -s works
configure:7365: result: yes
configure:7372: checking how to recognise dependent libraries
configure:7579: result: pass_all
configure:7661: gcc -c -std=iso9899:1990 -W -Wall -Wchar-subscripts -Wshadow -Wpointer-arith -Wmissing-prototypes -Wwrite-strings -D_XOPEN_SOURCE=500 -D_BSD_SOURCE -O2 -Wformat-security -Wmissing-format-attribute conftest.c >&5
configure:7664: $? = 0
configure:7787: checking for ANSI C header files
configure:7812: gcc -c -std=iso9899:1990 -W -Wall -Wchar-subscripts -Wshadow -Wpointer-arith -Wmissing-prototypes -Wwrite-strings -D_XOPEN_SOURCE=500 -D_BSD_SOURCE -O2 -Wformat-security -Wmissing-format-attribute conftest.c >&5
configure:7818: $? = 0
configure:7821: test -z || test ! -s conftest.err
configure:7824: $? = 0
configure:7827: test -s conftest.o
configure:7830: $? = 0
configure:7919: gcc -o conftest -std=iso9899:1990 -W -Wall -Wchar-subscripts -Wshadow -Wpointer-arith -Wmissing-prototypes -Wwrite-strings -D_XOPEN_SOURCE=500 -D_BSD_SOURCE -O2 -Wformat-security -Wmissing-format-attribute conftest.c >&5
conftest.c: In function 'main':
conftest.c:32: warning: implicit declaration of function 'exit'
conftest.c:32: warning: incompatible implicit declaration of built-in function 'exit'
configure:7922: $? = 0
configure:7924: ./conftest
configure:7927: $? = 0
configure:7942: result: yes
configure:7966: checking for sys/types.h
configure:7982: gcc -c -std=iso9899:1990 -W -Wall -Wchar-subscripts -Wshadow -Wpointer-arith -Wmissing-prototypes -Wwrite-strings -D_XOPEN_SOURCE=500 -D_BSD_SOURCE -O2 -Wformat-security -Wmissing-format-attribute conftest.c >&5
configure:7988: $? = 0
configure:7991: test -z || test ! -s conftest.err
configure:7994: $? = 0
configure:7997: test -s conftest.o
configure:8000: $? = 0
configure:8011: result: yes
configure:7966: checking for sys/stat.h
configure:7982: gcc -c -std=iso9899:1990 -W -Wall -Wchar-subscripts -Wshadow -Wpointer-arith -Wmissing-prototypes -Wwrite-strings -D_XOPEN_SOURCE=500 -D_BSD_SOURCE -O2 -Wformat-security -Wmissing-format-attribute conftest.c >&5
configure:7988: $? = 0
configure:7991: test -z || test ! -s conftest.err
configure:7994: $? = 0
configure:7997: test -s conftest.o
configure:8000: $? = 0
configure:8011: result: yes
configure:7966: checking for stdlib.h
configure:7982: gcc -c -std=iso9899:1990 -W -Wall -Wchar-subscripts -Wshadow -Wpointer-arith -Wmissing-prototypes -Wwrite-strings -D_XOPEN_SOURCE=500 -D_BSD_SOURCE -O2 -Wformat-security -Wmissing-format-attribute conftest.c >&5
configure:7988: $? = 0
configure:7991: test -z || test ! -s conftest.err
configure:7994: $? = 0
configure:7997: test -s conftest.o
configure:8000: $? = 0
configure:8011: result: yes
configure:7966: checking for string.h
configure:7982: gcc -c -std=iso9899:1990 -W -Wall -Wchar-subscripts -Wshadow -Wpointer-arith -Wmissing-prototypes -Wwrite-strings -D_XOPEN_SOURCE=500 -D_BSD_SOURCE -O2 -Wformat-security -Wmissing-format-attribute conftest.c >&5
configure:7988: $? = 0
configure:7991: test -z || test ! -s conftest.err
configure:7994: $? = 0
configure:7997: test -s conftest.o
configure:8000: $? = 0
configure:8011: result: yes
configure:7966: checking for memory.h
configure:7982: gcc -c -std=iso9899:1990 -W -Wall -Wchar-subscripts -Wshadow -Wpointer-arith -Wmissing-prototypes -Wwrite-strings -D_XOPEN_SOURCE=500 -D_BSD_SOURCE -O2 -Wformat-security -Wmissing-format-attribute conftest.c >&5
configure:7988: $? = 0
configure:7991: test -z || test ! -s conftest.err
configure:7994: $? = 0
configure:7997: test -s conftest.o
configure:8000: $? = 0
configure:8011: result: yes
configure:7966: checking for strings.h
configure:7982: gcc -c -std=iso9899:1990 -W -Wall -Wchar-subscripts -Wshadow -Wpointer-arith -Wmissing-prototypes -Wwrite-strings -D_XOPEN_SOURCE=500 -D_BSD_SOURCE -O2 -Wformat-security -Wmissing-format-attribute conftest.c >&5
configure:7988: $? = 0
configure:7991: test -z || test ! -s conftest.err
configure:7994: $? = 0
configure:7997: test -s conftest.o
configure:8000: $? = 0
configure:8011: result: yes
configure:7966: checking for inttypes.h
configure:7982: gcc -c -std=iso9899:1990 -W -Wall -Wchar-subscripts -Wshadow -Wpointer-arith -Wmissing-prototypes -Wwrite-strings -D_XOPEN_SOURCE=500 -D_BSD_SOURCE -O2 -Wformat-security -Wmissing-format-attribute conftest.c >&5
configure:7988: $? = 0
configure:7991: test -z || test ! -s conftest.err
configure:7994: $? = 0
configure:7997: test -s conftest.o
configure:8000: $? = 0
configure:8011: result: yes
configure:7966: checking for stdint.h
configure:7982: gcc -c -std=iso9899:1990 -W -Wall -Wchar-subscripts -Wshadow -Wpointer-arith -Wmissing-prototypes -Wwrite-strings -D_XOPEN_SOURCE=500 -D_BSD_SOURCE -O2 -Wformat-security -Wmissing-format-attribute conftest.c >&5
configure:7988: $? = 0
configure:7991: test -z || test ! -s conftest.err
configure:7994: $? = 0
configure:7997: test -s conftest.o
configure:8000: $? = 0
configure:8011: result: yes
configure:7966: checking for unistd.h
configure:7982: gcc -c -std=iso9899:1990 -W -Wall -Wchar-subscripts -Wshadow -Wpointer-arith -Wmissing-prototypes -Wwrite-strings -D_XOPEN_SOURCE=500 -D_BSD_SOURCE -O2 -Wformat-security -Wmissing-format-attribute conftest.c >&5
configure:7988: $? = 0
configure:7991: test -z || test ! -s conftest.err
configure:7994: $? = 0
configure:7997: test -s conftest.o
configure:8000: $? = 0
configure:8011: result: yes
configure:8037: checking dlfcn.h usability
configure:8049: gcc -c -std=iso9899:1990 -W -Wall -Wchar-subscripts -Wshadow -Wpointer-arith -Wmissing-prototypes -Wwrite-strings -D_XOPEN_SOURCE=500 -D_BSD_SOURCE -O2 -Wformat-security -Wmissing-format-attribute conftest.c >&5
configure:8055: $? = 0
configure:8058: test -z || test ! -s conftest.err
configure:8061: $? = 0
configure:8064: test -s conftest.o
configure:8067: $? = 0
configure:8077: result: yes
configure:8081: checking dlfcn.h presence
configure:8091: gcc -E conftest.c
configure:8097: $? = 0
configure:8117: result: yes
configure:8152: checking for dlfcn.h
configure:8159: result: yes
configure:8223: checking for g77
configure:8252: result: no
configure:8223: checking for f77
configure:8252: result: no
configure:8223: checking for xlf
configure:8252: result: no
configure:8223: checking for frt
configure:8252: result: no
configure:8223: checking for pgf77
configure:8252: result: no
configure:8223: checking for fort77
configure:8252: result: no
configure:8223: checking for fl32
configure:8252: result: no
configure:8223: checking for af77
configure:8252: result: no
configure:8223: checking for f90
configure:8252: result: no
configure:8223: checking for xlf90
configure:8252: result: no
configure:8223: checking for pgf90
configure:8252: result: no
configure:8223: checking for epcf90
configure:8252: result: no
configure:8223: checking for f95
configure:8252: result: no
configure:8223: checking for fort
configure:8252: result: no
configure:8223: checking for xlf95
configure:8252: result: no
configure:8223: checking for ifc
configure:8252: result: no
configure:8223: checking for efc
configure:8252: result: no
configure:8223: checking for pgf95
configure:8252: result: no
configure:8223: checking for lf95
configure:8252: result: no
configure:8223: checking for gfortran
configure:8252: result: no
configure:8264: checking for Fortran 77 compiler version
configure:8267: --version </dev/null >&5
./configure: line 8268: --version: command not found
configure:8270: $? = 127
configure:8272: -v </dev/null >&5
./configure: line 8273: -v: command not found
configure:8275: $? = 127
configure:8277: -V </dev/null >&5
./configure: line 8278: -V: command not found
configure:8280: $? = 127
configure:8288: checking whether we are using the GNU Fortran 77 compiler
configure:8302: -c conftest.F >&5
./configure: line 8303: -c: command not found
configure:8308: $? = 127
configure: failed program was:
| program main
| #ifndef __GNUC__
| choke me
| #endif
|
| end
configure:8333: result: no
configure:8339: checking whether accepts -g
configure:8351: -c -g conftest.f >&5
./configure: line 8352: -c: command not found
configure:8357: $? = 127
configure: failed program was:
| program main
|
| end
configure:8381: result: no
configure:8411: checking the maximum length of command line arguments
configure:8470: result: 32768
configure:8481: checking command to parse /usr/bin/nm -B output from gcc object
configure:8570: gcc -c -std=iso9899:1990 -W -Wall -Wchar-subscripts -Wshadow -Wpointer-arith -Wmissing-prototypes -Wwrite-strings -D_XOPEN_SOURCE=500 -D_BSD_SOURCE -O2 -Wformat-security -Wmissing-format-attribute conftest.c >&5
conftest.c:5: warning: no previous prototype for 'nm_test_func'
configure:8573: $? = 0
configure:8577: /usr/bin/nm -B conftest.o \| sed -n -e 's/^.*[ ]\([ABCDGISTW][ABCDGISTW]*\)[ ][ ]*\(\)\([_A-Za-z][_A-Za-z0-9]*\)$/\1 \2\3 \3/p' \> conftest.nm
configure:8580: $? = 0
configure:8632: gcc -o conftest -std=iso9899:1990 -W -Wall -Wchar-subscripts -Wshadow -Wpointer-arith -Wmissing-prototypes -Wwrite-strings -D_XOPEN_SOURCE=500 -D_BSD_SOURCE -O2 -Wformat-security -Wmissing-format-attribute conftest.c conftstm.o >&5
configure:8635: $? = 0
configure:8673: result: ok
configure:8677: checking for objdir
configure:8692: result: .libs
configure:8782: checking for ar
configure:8798: found /usr/bin/ar
configure:8809: result: ar
configure:8862: checking for ranlib
configure:8878: found /usr/bin/ranlib
configure:8889: result: ranlib
configure:8942: checking for strip
configure:8958: found /usr/bin/strip
configure:8969: result: strip
configure:9231: checking if gcc static flag works
configure:9254: result: yes
configure:9272: checking if gcc supports -fno-rtti -fno-exceptions
configure:9290: gcc -c -std=iso9899:1990 -W -Wall -Wchar-subscripts -Wshadow -Wpointer-arith -Wmissing-prototypes -Wwrite-strings -D_XOPEN_SOURCE=500 -D_BSD_SOURCE -O2 -Wformat-security -Wmissing-format-attribute -fno-rtti -fno-exceptions conftest.c >&5
cc1: warning: command line option "-fno-rtti" is valid for C++/ObjC++ but not for C
configure:9294: $? = 0
configure:9305: result: no
configure:9320: checking for gcc option to produce PIC
configure:9497: result: -fPIC
configure:9505: checking if gcc PIC flag -fPIC works
configure:9523: gcc -c -std=iso9899:1990 -W -Wall -Wchar-subscripts -Wshadow -Wpointer-arith -Wmissing-prototypes -Wwrite-strings -D_XOPEN_SOURCE=500 -D_BSD_SOURCE -O2 -Wformat-security -Wmissing-format-attribute -fPIC -DPIC conftest.c >&5
configure:9527: $? = 0
configure:9538: result: yes
configure:9562: checking if gcc supports -c -o file.o
configure:9590: gcc -c -std=iso9899:1990 -W -Wall -Wchar-subscripts -Wshadow -Wpointer-arith -Wmissing-prototypes -Wwrite-strings -D_XOPEN_SOURCE=500 -D_BSD_SOURCE -O2 -Wformat-security -Wmissing-format-attribute -o out/conftest2.o conftest.c >&5
configure:9594: $? = 0
configure:9611: result: yes
configure:9637: checking whether the gcc linker (/usr/x86_64-suse-linux/bin/ld -m elf_x86_64) supports shared libraries
configure:10447: result: yes
configure:10473: checking whether -lc should be explicitly linked in
configure:10478: gcc -c -std=iso9899:1990 -W -Wall -Wchar-subscripts -Wshadow -Wpointer-arith -Wmissing-prototypes -Wwrite-strings -D_XOPEN_SOURCE=500 -D_BSD_SOURCE -O2 -Wformat-security -Wmissing-format-attribute conftest.c >&5
configure:10481: $? = 0
configure:10495: gcc -shared -v conftest.o -Wl,-soname -Wl,conftest -o conftest 2\>\&1 \| grep -lc \>/dev/null 2\>\&1
configure:10498: $? = 0
configure:10510: result: no
configure:10518: checking dynamic linker characteristics
configure:11036: result: GNU/Linux ld.so
configure:11040: checking how to hardcode library paths into programs
configure:11065: result: immediate
configure:11079: checking whether stripping libraries is possible
configure:11084: result: yes
configure:11209: checking for shl_load
configure:11266: gcc -o conftest -std=iso9899:1990 -W -Wall -Wchar-subscripts -Wshadow -Wpointer-arith -Wmissing-prototypes -Wwrite-strings -D_XOPEN_SOURCE=500 -D_BSD_SOURCE -O2 -Wformat-security -Wmissing-format-attribute conftest.c >&5
/tmp/ccspCHN2.o: In function `main':
conftest.c:(.text+0x9): undefined reference to `shl_load'
/tmp/ccspCHN2.o:(.data+0x0): undefined reference to `shl_load'
collect2: ld returned 1 exit status
configure:11272: $? = 1
configure: failed program was:
| /* confdefs.h. */
|
| #define PACKAGE_NAME ""
| #define PACKAGE_TARNAME ""
| #define PACKAGE_VERSION ""
| #define PACKAGE_STRING ""
| #define PACKAGE_BUGREPORT ""
| #define PACKAGE "amarok-1.4.1"
| #define VERSION "3.5.3"
| #ifdef __cplusplus
| void exit (int);
| #endif
| #define KDELIBSUFF "64"
| #define STDC_HEADERS 1
| #define HAVE_SYS_TYPES_H 1
| #define HAVE_SYS_STAT_H 1
| #define HAVE_STDLIB_H 1
| #define HAVE_STRING_H 1
| #define HAVE_MEMORY_H 1
| #define HAVE_STRINGS_H 1
| #define HAVE_INTTYPES_H 1
| #define HAVE_STDINT_H 1
| #define HAVE_UNISTD_H 1
| #define HAVE_DLFCN_H 1
| /* end confdefs.h. */
| /* Define shl_load to an innocuous variant, in case <limits.h> declares shl_load.
| For example, HP-UX 11i <limits.h> declares gettimeofday. */
| #define shl_load innocuous_shl_load
|
| /* System header to define __stub macros and hopefully few prototypes,
| which can conflict with char shl_load (); below.
| Prefer <limits.h> to <assert.h> if __STDC__ is defined, since
| <limits.h> exists even on freestanding compilers. */
|
| #ifdef __STDC__
| # include <limits.h>
| #else
| # include <assert.h>
| #endif
|
| #undef shl_load
|
| /* Override any gcc2 internal prototype to avoid an error. */
| #ifdef __cplusplus
| extern "C"
| {
| #endif
| /* We use char because int might match the return type of a gcc2
| builtin and then its argument prototype would still apply. */
| char shl_load ();
| /* The GNU C library defines this for functions which it implements
| to always fail with ENOSYS. Some functions are actually named
| something starting with __ and the normal name is an alias. */
| #if defined (__stub_shl_load) || defined (__stub___shl_load)
| choke me
| #else
| char (*f) () = shl_load;
| #endif
| #ifdef __cplusplus
| }
| #endif
|
| int
| main ()
| {
| return f != shl_load;
| ;
| return 0;
| }
configure:11296: result: no
configure:11301: checking for shl_load in -ldld
configure:11331: gcc -o conftest -std=iso9899:1990 -W -Wall -Wchar-subscripts -Wshadow -Wpointer-arith -Wmissing-prototypes -Wwrite-strings -D_XOPEN_SOURCE=500 -D_BSD_SOURCE -O2 -Wformat-security -Wmissing-format-attribute conftest.c -ldld >&5
/usr/lib64/gcc/x86_64-suse-linux/4.1.0/../../../../x86_64-suse-linux/bin/ld: cannot find -ldld
collect2: ld returned 1 exit status
configure:11337: $? = 1
configure: failed program was:
| /* confdefs.h. */
|
| #define PACKAGE_NAME ""
| #define PACKAGE_TARNAME ""
| #define PACKAGE_VERSION ""
| #define PACKAGE_STRING ""
| #define PACKAGE_BUGREPORT ""
| #define PACKAGE "amarok-1.4.1"
| #define VERSION "3.5.3"
| #ifdef __cplusplus
| void exit (int);
| #endif
| #define KDELIBSUFF "64"
| #define STDC_HEADERS 1
| #define HAVE_SYS_TYPES_H 1
| #define HAVE_SYS_STAT_H 1
| #define HAVE_STDLIB_H 1
| #define HAVE_STRING_H 1
| #define HAVE_MEMORY_H 1
| #define HAVE_STRINGS_H 1
| #define HAVE_INTTYPES_H 1
| #define HAVE_STDINT_H 1
| #define HAVE_UNISTD_H 1
| #define HAVE_DLFCN_H 1
| /* end confdefs.h. */
|
| /* Override any gcc2 internal prototype to avoid an error. */
| #ifdef __cplusplus
| extern "C"
| #endif
| /* We use char because int might match the return type of a gcc2
| builtin and then its argument prototype would still apply. */
| char shl_load ();
| int
| main ()
| {
| shl_load ();
| ;
| return 0;
| }
configure:11362: result: no
configure:11367: checking for dlopen
configure:11424: gcc -o conftest -std=iso9899:1990 -W -Wall -Wchar-subscripts -Wshadow -Wpointer-arith -Wmissing-prototypes -Wwrite-strings -D_XOPEN_SOURCE=500 -D_BSD_SOURCE -O2 -Wformat-security -Wmissing-format-attribute conftest.c >&5
/tmp/cc6tpulh.o: In function `main':
conftest.c:(.text+0x9): undefined reference to `dlopen'
/tmp/cc6tpulh.o:(.data+0x0): undefined reference to `dlopen'
collect2: ld returned 1 exit status
configure:11430: $? = 1
configure: failed program was:
| /* confdefs.h. */
|
| #define PACKAGE_NAME ""
| #define PACKAGE_TARNAME ""
| #define PACKAGE_VERSION ""
| #define PACKAGE_STRING ""
| #define PACKAGE_BUGREPORT ""
| #define PACKAGE "amarok-1.4.1"
| #define VERSION "3.5.3"
| #ifdef __cplusplus
| void exit (int);
| #endif
| #define KDELIBSUFF "64"
| #define STDC_HEADERS 1
| #define HAVE_SYS_TYPES_H 1
| #define HAVE_SYS_STAT_H 1
| #define HAVE_STDLIB_H 1
| #define HAVE_STRING_H 1
| #define HAVE_MEMORY_H 1
| #define HAVE_STRINGS_H 1
| #define HAVE_INTTYPES_H 1
| #define HAVE_STDINT_H 1
| #define HAVE_UNISTD_H 1
| #define HAVE_DLFCN_H 1
| /* end confdefs.h. */
| /* Define dlopen to an innocuous variant, in case <limits.h> declares dlopen.
| For example, HP-UX 11i <limits.h> declares gettimeofday. */
| #define dlopen innocuous_dlopen
|
| /* System header to define __stub macros and hopefully few prototypes,
| which can conflict with char dlopen (); below.
| Prefer <limits.h> to <assert.h> if __STDC__ is defined, since
| <limits.h> exists even on freestanding compilers. */
|
| #ifdef __STDC__
| # include <limits.h>
| #else
| # include <assert.h>
| #endif
|
| #undef dlopen
|
| /* Override any gcc2 internal prototype to avoid an error. */
| #ifdef __cplusplus
| extern "C"
| {
| #endif
| /* We use char because int might match the return type of a gcc2
| builtin and then its argument prototype would still apply. */
| char dlopen ();
| /* The GNU C library defines this for functions which it implements
| to always fail with ENOSYS. Some functions are actually named
| something starting with __ and the normal name is an alias. */
| #if defined (__stub_dlopen) || defined (__stub___dlopen)
| choke me
| #else
| char (*f) () = dlopen;
| #endif
| #ifdef __cplusplus
| }
| #endif
|
| int
| main ()
| {
| return f != dlopen;
| ;
| return 0;
| }
configure:11454: result: no
configure:11459: checking for dlopen in -ldl
configure:11489: gcc -o conftest -std=iso9899:1990 -W -Wall -Wchar-subscripts -Wshadow -Wpointer-arith -Wmissing-prototypes -Wwrite-strings -D_XOPEN_SOURCE=500 -D_BSD_SOURCE -O2 -Wformat-security -Wmissing-format-attribute conftest.c -ldl >&5
configure:11495: $? = 0
configure:11498: test -z || test ! -s conftest.err
configure:11501: $? = 0
configure:11504: test -s conftest
configure:11507: $? = 0
configure:11520: result: yes
configure:11693: checking whether a program can dlopen itself
configure:11765: gcc -o conftest -std=iso9899:1990 -W -Wall -Wchar-subscripts -Wshadow -Wpointer-arith -Wmissing-prototypes -Wwrite-strings -D_XOPEN_SOURCE=500 -D_BSD_SOURCE -O2 -Wformat-security -Wmissing-format-attribute -DHAVE_DLFCN_H -Wl,--export-dynamic conftest.c -ldl >&5
configure:11748: warning: no previous prototype for 'fnord'
configure: In function 'fnord':
configure:11748: warning: unused variable 'i'
configure: In function 'main':
configure:11761: warning: implicit declaration of function 'exit'
configure:11761: warning: incompatible implicit declaration of built-in function 'exit'
configure:11768: $? = 0
configure:11786: result: yes
configure:11791: checking whether a statically linked program can dlopen itself
configure:11863: gcc -o conftest -std=iso9899:1990 -W -Wall -Wchar-subscripts -Wshadow -Wpointer-arith -Wmissing-prototypes -Wwrite-strings -D_XOPEN_SOURCE=500 -D_BSD_SOURCE -O2 -Wformat-security -Wmissing-format-attribute -DHAVE_DLFCN_H -Wl,--export-dynamic conftest.c -ldl >&5
configure:11846: warning: no previous prototype for 'fnord'
configure: In function 'fnord':
configure:11846: warning: unused variable 'i'
configure: In function 'main':
configure:11859: warning: implicit declaration of function 'exit'
configure:11859: warning: incompatible implicit declaration of built-in function 'exit'
configure:11866: $? = 0
configure:11884: result: yes
configure:11907: checking if libtool supports shared libraries
configure:11909: result: yes
configure:11912: checking whether to build shared libraries
configure:11970: result: yes
configure:11973: checking whether to build static libraries
configure:11977: result: no
configure:12068: creating libtool
configure:12754: checking whether the g++ linker (/usr/x86_64-suse-linux/bin/ld -m elf_x86_64) supports shared libraries
configure:13566: result: yes
configure:13584: g++ -c -ansi -D_XOPEN_SOURCE=500 -D_BSD_SOURCE -Wcast-align -Wconversion -Wchar-subscripts -Wall -W -Wpointer-arith conftest.cc >&5
g++: error trying to exec 'cc1plus': execvp: No such file or directory
configure:13587: $? = 1
configure:13683: checking for g++ option to produce PIC
configure:13935: result:
configure:14000: checking if g++ supports -c -o file.o
configure:14028: g++ -c -ansi -D_XOPEN_SOURCE=500 -D_BSD_SOURCE -Wcast-align -Wconversion -Wchar-subscripts -Wall -W -Wpointer-arith -o out/conftest2.o conftest.cc >&5
g++: error trying to exec 'cc1plus': execvp: No such file or directory
configure:14032: $? = 1
configure:14049: result: no
configure:14075: checking whether the g++ linker (/usr/x86_64-suse-linux/bin/ld -m elf_x86_64) supports shared libraries
configure:14100: result: yes
configure:14171: checking dynamic linker characteristics
configure:14689: result: GNU/Linux ld.so
configure:14693: checking how to hardcode library paths into programs
configure:14718: result: immediate
configure:14732: checking whether stripping libraries is possible
configure:14737: result: yes
configure:14862: checking for shl_load
configure:14949: result: no
configure:14954: checking for shl_load in -ldld
configure:15015: result: no
configure:15020: checking for dlopen
configure:15107: result: no
configure:15112: checking for dlopen in -ldl
configure:15173: result: yes
configure:15346: checking whether a program can dlopen itself
configure:15439: result: yes
configure:15444: checking whether a statically linked program can dlopen itself
configure:15537: result: yes
configure:21862: checking for msgfmt
configure:21889: result: /usr/bin/msgfmt
configure:21898: checking for gmsgfmt
configure:21929: result: /usr/bin/msgfmt
configure:21948: checking for xgettext
configure:21975: result: :
configure:22095: checking if C++ programs can be compiled
configure:22124: g++ -c -ansi -D_XOPEN_SOURCE=500 -D_BSD_SOURCE -Wcast-align -Wconversion -Wchar-subscripts -Wall -W -Wpointer-arith conftest.cc >&5
g++: error trying to exec 'cc1plus': execvp: No such file or directory
configure:22130: $? = 1
configure: failed program was:
| /* confdefs.h. */
|
| #define PACKAGE_NAME ""
| #define PACKAGE_TARNAME ""
| #define PACKAGE_VERSION ""
| #define PACKAGE_STRING ""
| #define PACKAGE_BUGREPORT ""
| #define PACKAGE "amarok-1.4.1"
| #define VERSION "3.5.3"
| #ifdef __cplusplus
| void exit (int);
| #endif
| #define KDELIBSUFF "64"
| #define STDC_HEADERS 1
| #define HAVE_SYS_TYPES_H 1
| #define HAVE_SYS_STAT_H 1
| #define HAVE_STDLIB_H 1
| #define HAVE_STRING_H 1
| #define HAVE_MEMORY_H 1
| #define HAVE_STRINGS_H 1
| #define HAVE_INTTYPES_H 1
| #define HAVE_STDINT_H 1
| #define HAVE_UNISTD_H 1
| #define HAVE_DLFCN_H 1
| /* end confdefs.h. */
|
| #include <string>
| using namespace std;
|
| int
| main ()
| {
|
| string astring="Hallo Welt.";
| astring.erase(0, 6); // now astring is "Welt"
| return 0;
|
| ;
| return 0;
| }
configure:22156: result: no
configure:22169: error: Your Installation isn't able to compile simple C++ programs.
Check config.log for details - if you're using a Linux distribution you might miss
a package named similar to libstdc++-dev.
## ---------------- ##
## Cache variables. ##
## ---------------- ##
ac_cv_build=x86_64-unknown-linux-gnu
ac_cv_build_alias=x86_64-unknown-linux-gnu
ac_cv_c_compiler_gnu=yes
ac_cv_cxx_compiler_gnu=no
ac_cv_env_CC_set=
ac_cv_env_CC_value=
ac_cv_env_CFLAGS_set=
ac_cv_env_CFLAGS_value=
ac_cv_env_CPPFLAGS_set=
ac_cv_env_CPPFLAGS_value=
ac_cv_env_CPP_set=
ac_cv_env_CPP_value=
ac_cv_env_CXXCPP_set=
ac_cv_env_CXXCPP_value=
ac_cv_env_CXXFLAGS_set=
ac_cv_env_CXXFLAGS_value=
ac_cv_env_CXX_set=
ac_cv_env_CXX_value=
ac_cv_env_F77_set=
ac_cv_env_F77_value=
ac_cv_env_FFLAGS_set=
ac_cv_env_FFLAGS_value=
ac_cv_env_LDFLAGS_set=
ac_cv_env_LDFLAGS_value=
ac_cv_env_PKGCONFIGFOUND_set=
ac_cv_env_PKGCONFIGFOUND_value=
ac_cv_env_build_alias_set=
ac_cv_env_build_alias_value=
ac_cv_env_host_alias_set=
ac_cv_env_host_alias_value=
ac_cv_env_target_alias_set=
ac_cv_env_target_alias_value=
ac_cv_exeext=
ac_cv_f77_compiler_gnu=no
ac_cv_func_dlopen=no
ac_cv_func_shl_load=no
ac_cv_header_dlfcn_h=yes
ac_cv_header_inttypes_h=yes
ac_cv_header_memory_h=yes
ac_cv_header_stdc=yes
ac_cv_header_stdint_h=yes
ac_cv_header_stdlib_h=yes
ac_cv_header_string_h=yes
ac_cv_header_strings_h=yes
ac_cv_header_sys_stat_h=yes
ac_cv_header_sys_types_h=yes
ac_cv_header_unistd_h=yes
ac_cv_host=x86_64-unknown-linux-gnu
ac_cv_host_alias=x86_64-unknown-linux-gnu
ac_cv_lib_dl_dlopen=yes
ac_cv_lib_dld_shl_load=no
ac_cv_objext=o
ac_cv_path_GMSGFMT=/usr/bin/msgfmt
ac_cv_path_MSGFMT=/usr/bin/msgfmt
ac_cv_path_XGETTEXT=:
ac_cv_path_install='/usr/bin/install -c'
ac_cv_prog_AWK=gawk
ac_cv_prog_CPP='gcc -E'
ac_cv_prog_CXXCPP=/lib/cpp
ac_cv_prog_ac_ct_AR=ar
ac_cv_prog_ac_ct_CC=gcc
ac_cv_prog_ac_ct_CXX=g++
ac_cv_prog_ac_ct_RANLIB=ranlib
ac_cv_prog_ac_ct_STRIP=strip
ac_cv_prog_cc_g=yes
ac_cv_prog_cc_stdc=
ac_cv_prog_cxx_g=no
ac_cv_prog_egrep='grep -E'
ac_cv_prog_f77_g=no
ac_cv_prog_make_make_set=yes
ac_cv_target=x86_64-unknown-linux-gnu
ac_cv_target_alias=x86_64-unknown-linux-gnu
am_cv_CC_dependencies_compiler_type=gcc3
am_cv_CXX_dependencies_compiler_type=none
kde_cv_path=/opt/kde3/bin/kde-config
kde_cv_path_kde_config=/opt/kde3/bin/kde-config
kde_cv_prog_cc_Wmissing_format_attribute=yes
kde_cv_stl_works=no
lt_cv_deplibs_check_method=pass_all
lt_cv_dlopen=dlopen
lt_cv_dlopen_libs=-ldl
lt_cv_dlopen_self=yes
lt_cv_dlopen_self_static=yes
lt_cv_file_magic_cmd='$MAGIC_CMD'
lt_cv_file_magic_test_file='/lib/libc.so.6 /lib/libc-2.4.so'
lt_cv_ld_reload_flag=-r
lt_cv_objdir=.libs
lt_cv_path_LD=/usr/x86_64-suse-linux/bin/ld
lt_cv_path_LDCXX=
lt_cv_path_NM='/usr/bin/nm -B'
lt_cv_path_SED=/usr/bin/sed
lt_cv_prog_compiler_c_o=yes
lt_cv_prog_compiler_c_o_CXX=no
lt_cv_prog_compiler_rtti_exceptions=no
lt_cv_prog_gnu_ld=yes
lt_cv_prog_gnu_ldcxx=
lt_cv_sys_global_symbol_pipe='sed -n -e '\''s/^.*[ ]\([ABCDGISTW][ABCDGISTW]*\)[ ][ ]*\(\)\([_A-Za-z][_A-Za-z0-9]*\)$/\1 \2\3 \3/p'\'''
lt_cv_sys_global_symbol_to_c_name_address='sed -n -e '\''s/^: \([^ ]*\) $/ {\"\1\", (lt_ptr) 0},/p'\'' -e '\''s/^[BCDEGRST] \([^ ]*\) \([^ ]*\)$/ {"\2", (lt_ptr) \&\2},/p'\'''
lt_cv_sys_global_symbol_to_cdecl='sed -n -e '\''s/^. .* \(.*\)$/extern int \1;/p'\'''
lt_cv_sys_max_cmd_len=32768
lt_lt_cv_prog_compiler_c_o='"yes"'
lt_lt_cv_prog_compiler_c_o_CXX='"no"'
lt_lt_cv_sys_global_symbol_pipe='"sed -n -e '\''s/^.*[ ]\\([ABCDGISTW][ABCDGISTW]*\\)[ ][ ]*\\(\\)\\([_A-Za-z][_A-Za-z0-9]*\\)\$/\\1 \\2\\3 \\3/p'\''"'
lt_lt_cv_sys_global_symbol_to_c_name_address='"sed -n -e '\''s/^: \\([^ ]*\\) \$/ {\\\"\\1\\\", (lt_ptr) 0},/p'\'' -e '\''s/^[BCDEGRST] \\([^ ]*\\) \\([^ ]*\\)\$/ {\"\\2\", (lt_ptr) \\&\\2},/p'\''"'
lt_lt_cv_sys_global_symbol_to_cdecl='"sed -n -e '\''s/^. .* \\(.*\\)\$/extern int \\1;/p'\''"'
## ----------------- ##
## Output variables. ##
## ----------------- ##
ACLOCAL='${SHELL} /home/beavis/Temp/amarok-1.4.1/admin/missing --run aclocal-1.7'
ALSALIB_CFLAGS=''
ALSALIB_LIBS=''
AMDEPBACKSLASH='\'
AMDEP_FALSE='#'
AMDEP_TRUE=''
AMTAR='${SHELL} /home/beavis/Temp/amarok-1.4.1/admin/missing --run tar'
AR='ar'
ARTSCCONFIG=''
AUTOCONF='$(SHELL) $(top_srcdir)/admin/cvs.sh configure || touch configure'
AUTODIRS=''
AUTOHEADER='${SHELL} /home/beavis/Temp/amarok-1.4.1/admin/missing --run autoheader'
AUTOMAKE='${SHELL} /home/beavis/Temp/amarok-1.4.1/admin/missing --run automake-1.7'
AWK='gawk'
CC='gcc'
CCDEPMODE='depmode=gcc3'
CFLAGS='-std=iso9899:1990 -W -Wall -Wchar-subscripts -Wshadow -Wpointer-arith -Wmissing-prototypes -Wwrite-strings -D_XOPEN_SOURCE=500 -D_BSD_SOURCE -O2 -Wformat-security -Wmissing-format-attribute'
CFLAGS_NMM=''
CFLAGS_XINE=''
CONF_FILES=' $(top_srcdir)/./admin/configure.in.min $(top_srcdir)/configure.in.in $(top_srcdir)/./amarok/configure.in.bot $(top_srcdir)/./amarok/configure.in.in $(top_srcdir)/configure.in.bot'
CPP='gcc -E'
CPPFLAGS=''
CXX='g++'
CXXCPP='/lib/cpp'
CXXDEPMODE='depmode=none'
CXXFLAGS='-ansi -D_XOPEN_SOURCE=500 -D_BSD_SOURCE -Wcast-align -Wconversion -Wchar-subscripts -Wall -W -Wpointer-arith'
CYGPATH_W='echo'
DCOPIDL2CPP=''
DCOPIDL=''
DCOPIDLNG=''
DCOP_DEPENDENCIES=''
DEFS=''
DEPDIR='.deps'
DOXYGEN=''
DOXYGEN_PROJECT_NAME=''
DOXYGEN_PROJECT_NUMBER=''
ECHO='echo'
ECHO_C=''
ECHO_N='-n'
ECHO_T=''
EGREP='grep -E'
ENABLE_PERMISSIVE_FLAG=''
EXEEXT=''
F77=''
FFLAGS=''
FRAMEWORK_COREAUDIO=''
GMSGFMT='/usr/bin/msgfmt'
GTK_CONFIG=''
HAVE_GCC_VISIBILITY='0'
IFP_INCLUDES=''
IFP_LIBS=''
INSTALL_DATA='${INSTALL} -m 644'
INSTALL_PROGRAM='${INSTALL} $(INSTALL_STRIP_FLAG)'
INSTALL_SCRIPT='${INSTALL}'
INSTALL_STRIP_PROGRAM='${SHELL} $(install_sh) -c -s'
KCFG_DEPENDENCIES=''
KCONFIG_COMPILER=''
KDECONFIG='/opt/kde3/bin/kde-config'
KDE_CHECK_PLUGIN='$(KDE_PLUGIN) -rpath $(libdir)'
KDE_EXTRA_RPATH=''
KDE_HAS_DOXYGEN=''
KDE_HAVE_DOT=''
KDE_INCLUDES=''
KDE_LDFLAGS=''
KDE_MT_LDFLAGS=''
KDE_MT_LIBS=''
KDE_NO_UNDEFINED=''
KDE_PLUGIN='-avoid-version -module -no-undefined $(KDE_NO_UNDEFINED) $(KDE_RPATH) $(KDE_MT_LDFLAGS)'
KDE_RPATH=''
KDE_USE_CLOSURE_FALSE=''
KDE_USE_CLOSURE_TRUE='#'
KDE_USE_FINAL_FALSE=''
KDE_USE_FINAL_TRUE='#'
KDE_USE_FPIE=''
KDE_USE_NMCHECK_FALSE=''
KDE_USE_NMCHECK_TRUE='#'
KDE_USE_PIE=''
KDE_XSL_STYLESHEET=''
LDFLAGS=''
LDFLAGS_AS_NEEDED=''
LDFLAGS_NEW_DTAGS=''
LDFLAGS_NMM=''
LIBCOMPAT=''
LIBCRYPT=''
LIBDL=''
LIBGPOD_CFLAGS=''
LIBGPOD_LIBS=''
LIBJPEG=''
LIBNJB_CFLAGS=''
LIBNJB_LIBS=''
LIBOBJS=''
LIBPNG=''
LIBPTHREAD=''
LIBRESOLV=''
LIBS=''
LIBSM=''
LIBSOCKET=''
LIBS_XINE=''
LIBTOOL='$(SHELL) $(top_builddir)/libtool --silent'
LIBUCB=''
LIBUTIL=''
LIBVISUAL_CFLAGS=''
LIBVISUAL_LIBS=''
LIBZ=''
LIB_ARTS=''
LIB_KAB=''
LIB_KABC=''
LIB_KDECORE=''
LIB_KDED=''
LIB_KDEPIM=''
LIB_KDEPRINT=''
LIB_KDEUI=''
LIB_KDNSSD=''
LIB_KFILE=''
LIB_KFM=''
LIB_KHTML=''
LIB_KIMPROXY=''
LIB_KIO=''
LIB_KJS=''
LIB_KNEWSTUFF=''
LIB_KPARTS=''
LIB_KSPELL=''
LIB_KSYCOCA=''
LIB_KUNITTEST=''
LIB_KUTILS=''
LIB_POLL=''
LIB_QPE=''
LIB_QT=''
LIB_SMB=''
LIB_SQLITE=''
LIB_TUNEPIMP=''
LIB_X11=''
LIB_XEXT=''
LIB_XRENDER=''
LN_S='ln -s'
LTLIBOBJS=''
MAKEINFO='${SHELL} /home/beavis/Temp/amarok-1.4.1/admin/missing --run makeinfo'
MAKEKDEWIDGETS=''
MCOPIDL=''
MEINPROC=''
MOC=''
MP4V2_INCLUDES=''
MP4V2_LIBS=''
MSGFMT='/usr/bin/msgfmt'
MYSQL_CONFIG=''
NOOPT_CFLAGS='-O0'
NOOPT_CXXFLAGS=''
OBJEXT='o'
PACKAGE='amarok-1.4.1'
PACKAGE_BUGREPORT=''
PACKAGE_NAME=''
PACKAGE_STRING=''
PACKAGE_TARNAME=''
PACKAGE_VERSION=''
PATH_SEPARATOR=':'
PERL=''
PKGCONFIGFOUND=''
PKG_CONFIG=''
POSTGRESQL_CONFIG=''
QTDOCDIR=''
QTE_NORTTI=''
QT_INCLUDES=''
QT_LDFLAGS=''
RANLIB='ranlib'
RUBY=''
SDL_CONFIG=''
SET_MAKE=''
SHELL='/bin/sh'
SQLITE_CFLAGS=''
SQLITE_LIBS=''
STRIP='strip'
TAGLIB_CONFIG=''
TOPSUBDIRS=''
UIC=''
UIC_TR=''
USER_INCLUDES=''
USER_LDFLAGS=''
USE_EXCEPTIONS=''
USE_RTTI=''
USE_THREADS=''
VERSION='3.5.3'
WOVERLOADED_VIRTUAL=''
XGETTEXT=':'
XINE_CONFIG=''
XMLLINT=''
XMMS_CONFIG=''
X_EXTRA_LIBS=''
X_INCLUDES=''
X_LDFLAGS=''
X_PRE_LIBS=''
X_RPATH=''
ac_ct_AR='ar'
ac_ct_CC='gcc'
ac_ct_CXX='g++'
ac_ct_F77=''
ac_ct_RANLIB='ranlib'
ac_ct_STRIP='strip'
all_includes=''
all_libraries=''
am__fastdepCC_FALSE='#'
am__fastdepCC_TRUE=''
am__fastdepCXX_FALSE=''
am__fastdepCXX_TRUE='#'
am__include='include'
am__leading_dot='.'
am__quote=''
amarok_SUBDIR_included_FALSE=''
amarok_SUBDIR_included_TRUE=''
bindir='${exec_prefix}/bin'
build='x86_64-unknown-linux-gnu'
build_alias=''
build_cpu='x86_64'
build_os='linux-gnu'
build_vendor='unknown'
datadir='${prefix}/share'
doc_SUBDIR_included_FALSE=''
doc_SUBDIR_included_TRUE=''
enable_mysql_FALSE=''
enable_mysql_TRUE=''
enable_postgresql_FALSE=''
enable_postgresql_TRUE=''
exec_prefix='NONE'
gl_libs=''
gtk_cflags=''
gtk_libs=''
host='x86_64-unknown-linux-gnu'
host_alias=''
host_cpu='x86_64'
host_os='linux-gnu'
host_vendor='unknown'
include_ARTS_FALSE=''
include_ARTS_TRUE=''
include_x11_FALSE=''
include_x11_TRUE=''
includedir='${prefix}/include'
infodir='${prefix}/info'
install_sh='/home/beavis/Temp/amarok-1.4.1/admin/install-sh'
kde_appsdir=''
kde_bindir=''
kde_confdir=''
kde_datadir=''
kde_htmldir=''
kde_icondir=''
kde_includes=''
kde_kcfgdir=''
kde_libraries=''
kde_libs_htmldir='/opt/kde3/share/doc/HTML'
kde_libs_prefix='/opt/kde3'
kde_locale=''
kde_mimedir=''
kde_moduledir=''
kde_qtver='3'
kde_servicesdir=''
kde_servicetypesdir=''
kde_sounddir=''
kde_styledir=''
kde_templatesdir=''
kde_wallpaperdir=''
kde_widgetdir=''
kdeinitdir=''
libdir='${exec_prefix}/lib64'
libexecdir='${exec_prefix}/libexec'
localstatedir='${prefix}/var'
mandir='${prefix}/man'
mysql_includes=''
mysql_libs=''
oldincludedir='/usr/include'
po_SUBDIR_included_FALSE=''
po_SUBDIR_included_TRUE=''
postgresql_includes=''
postgresql_libs=''
prefix='/opt/kde3'
program_transform_name='s,x,x,'
qt_includes=''
qt_libraries=''
sbindir='${exec_prefix}/sbin'
sdl_cflags=''
sdl_libs=''
sharedstatedir='${prefix}/com'
sysconfdir='${prefix}/etc'
taglib_includes=''
taglib_libs=''
target='x86_64-unknown-linux-gnu'
target_alias=''
target_cpu='x86_64'
target_os='linux-gnu'
target_vendor='unknown'
unsermake_enable_pch_FALSE=''
unsermake_enable_pch_TRUE='#'
with_helix_FALSE=''
with_helix_TRUE=''
with_ifp_FALSE=''
with_ifp_TRUE=''
with_included_sqlite_FALSE=''
with_included_sqlite_TRUE=''
with_konqsidebar_FALSE=''
with_konqsidebar_TRUE=''
with_libgpod_FALSE=''
with_libgpod_TRUE=''
with_libnjb_FALSE=''
with_libnjb_TRUE=''
with_libvisual_FALSE=''
with_libvisual_TRUE=''
with_mp4v2_FALSE=''
with_mp4v2_TRUE=''
with_nmm_FALSE=''
with_nmm_TRUE=''
with_xine_FALSE=''
with_xine_TRUE=''
with_xmmswrapper_FALSE=''
with_xmmswrapper_TRUE=''
x_includes='NONE'
x_libraries='NONE'
xdg_appsdir=''
xdg_directorydir=''
xdg_menudir=''
xmms_cflags=''
xmms_libs=''
## ----------- ##
## confdefs.h. ##
## ----------- ##
#define HAVE_DLFCN_H 1
#define HAVE_INTTYPES_H 1
#define HAVE_MEMORY_H 1
#define HAVE_STDINT_H 1
#define HAVE_STDLIB_H 1
#define HAVE_STRINGS_H 1
#define HAVE_STRING_H 1
#define HAVE_SYS_STAT_H 1
#define HAVE_SYS_TYPES_H 1
#define HAVE_UNISTD_H 1
#define KDELIBSUFF "64"
#define PACKAGE "amarok-1.4.1"
#define PACKAGE_BUGREPORT ""
#define PACKAGE_NAME ""
#define PACKAGE_STRING ""
#define PACKAGE_TARNAME ""
#define PACKAGE_VERSION ""
#define STDC_HEADERS 1
#define VERSION "3.5.3"
#endif
#ifdef __cplusplus
void exit (int);
configure: exit 1