All pastes #87481 Raw Edit

Someone

public text v1 · immutable
·published 2006-07-14 00:14 UTC
rendered paste body
Running install for module WWW::Mechanize
Running make for P/PE/PETDANCE/WWW-Mechanize-1.18.tar.gz
  Is already unwrapped into directory /root/.cpan/build/WWW-Mechanize-1.18
  Has already been processed within this session
Running make test
PERL_DL_NONLAZY=1 /usr/bin/perl "-MExtUtils::Command::MM" "-e" "test_harness(0, 'blib/lib', 'blib/arch')" t/00-load.t t/add_header.t t/aliases.t t/area_link.t t/autocheck.t t/clone.t t/die.t t/field.t t/find_image.t t/find_link-warnings.t t/find_link.t t/form-parsing.t t/frames.t t/image-new.t t/image-parse.t t/link-base.t t/link-relative.t t/link.t t/new.t t/pod-coverage.t t/pod.t t/regex-error.t t/select.t t/taint.t t/tick.t t/upload.t t/warn.t t/warnings.t t/live/back.t t/live/click.t t/live/follow.t t/live/follow_link.t t/live/form.t t/live/get.t t/live/reload.t t/live/submit.t t/local/back.t t/local/click.t t/local/click_button.t t/local/failure.t t/local/follow.t t/local/form.t t/local/get.t t/local/overload.t t/local/page_stack.t t/local/referer.t t/local/reload.t t/local/submit.t
t/00-load...............# Testing WWW::Mechanize 1.18
t/00-load...............ok
t/add_header............ok
t/aliases...............ok
t/area_link.............ok
t/autocheck.............ok
t/clone.................ok
t/die...................ok
t/field.................ok
t/find_image............ok
t/find_link-warnings....ok
t/find_link.............ok
t/form-parsing..........ok
t/frames................ok
t/image-new.............ok
t/image-parse...........ok
t/link-base.............ok
t/link-relative.........ok
t/link..................ok
t/live/back.............ok
t/live/click............ok
t/live/follow...........ok
t/live/follow_link......ok 3/7
#   Failed test 'Got the correct page'
#   in t/live/follow_link.t at line 21.
#          got: 'http://www.google.com/intl/en/ads/'
#     expected: 'http://www.google.com/ads/'
# Looks like you failed 1 test of 7.
t/live/follow_link......dubious
        Test returned status 1 (wstat 256, 0x100)
DIED. FAILED test 6
        Failed 1/7 tests, 85.71% okay
t/live/form.............ok
t/live/get..............ok 3/26
#   Failed test 'Got relative OK'
#   in t/live/get.t at line 24.
#          got: 'http://www.google.com/intl/en/ads/'
#     expected: 'http://www.google.com/ads/'
t/live/get..............NOK 9
#   Failed test 'Got the support page'
#   in t/live/get.t at line 28.

#   Failed test 'Got relative OK'
#   in t/live/get.t at line 29.
#          got: 'http://www.google.com/intl/en/ads/'
#     expected: 'http://www.google.com/support/'

#   Failed test 'Title matches'
#   in t/live/get.t at line 31.
#          got: '404 Not Found'
#     expected: 'Google: Help Center'
t/live/get..............NOK 15
#   Failed test 'Got relative OK'
#   in t/live/get.t at line 34.
#          got: 'http://www.google.com/intl/en/help/basics.html'
#     expected: 'http://www.google.com/help/basics.html'
t/live/get..............NOK 17
#   Failed test 'Got relative OK'
#   in t/live/get.t at line 40.
#          got: 'http://www.google.com/intl/en/help/refinesearch.html'
#     expected: 'http://www.google.com/help/refinesearch.html'
# Looks like you failed 6 tests of 26.
t/live/get..............dubious
        Test returned status 6 (wstat 1536, 0x600)
DIED. FAILED tests 9, 12-13, 15, 17, 22
        Failed 6/26 tests, 76.92% okay
t/live/reload...........ok
t/live/submit...........ok
t/local/back............ok 1/38# Started http://localhost:59755/
t/local/back............ok 5/38
#   Failed test '404 check'
#   in t/local/back.t at line 148.
#          got: '500'
#     expected: '404'
# Looks like you failed 1 test of 38.
t/local/back............dubious
        Test returned status 1 (wstat 256, 0x100)
DIED. FAILED test 28
        Failed 1/38 tests, 97.37% okay
t/local/click...........ok 1/10# Started http://localhost:59495/
t/local/click...........ok
t/local/click_button....ok 1/18# Started http://localhost:44384/
t/local/click_button....ok
t/local/failure.........ok 1/17# Started http://localhost:53456/
t/local/failure.........ok
t/local/follow..........ok 1/28# Started http://localhost:39724/
t/local/follow..........ok
t/local/form............ok 1/16# Started http://localhost:44183/
t/local/form............ok
t/local/get.............ok 1/37# Started http://localhost:47543/
t/local/get.............ok
t/local/overload........skipped
        all skipped: Mysteriously stopped passing, and I don't know why.
t/local/page_stack......ok 1/11# Started http://localhost:38839/
t/local/page_stack......ok
t/local/referer.........ok
t/local/reload..........ok 1/16# Started http://localhost:53212/
t/local/reload..........ok
t/local/submit..........ok 1/15# Started http://localhost:34569/
t/local/submit..........ok
t/new...................ok
t/pod-coverage..........ok
t/pod...................ok
t/regex-error...........ok
t/select................ok
t/taint.................ok
t/tick..................ok
t/upload................ok
t/warn..................ok
t/warnings..............ok
Failed Test          Stat Wstat Total Fail  Failed  List of Failed
-------------------------------------------------------------------------------
t/live/follow_link.t    1   256     7    1  14.29%  6
t/live/get.t            6  1536    26    6  23.08%  9 12-13 15 17 22
t/local/back.t          1   256    38    1   2.63%  28
1 test skipped.
Failed 3/48 test scripts, 93.75% okay. 8/619 subtests failed, 98.71% okay.
make: *** [test_dynamic] Error 255
  /usr/bin/make test -- NOT OK
Running make install
  make test had returned bad status, won't install without force
Failed during this command:
  PETDANCE/WWW-Mechanize-1.18.tar.gz           : make_test NO