All pastes #87290 Raw Edit

Untitled

public text v1 · immutable
·published 2006-07-13 20:57 UTC
rendered paste body
ning: (near initialization for `_XmStrings')
XmStrDefs.c:1370: warning: excess elements in scalar initializer
XmStrDefs.c:1370: warning: (near initialization for `_XmStrings')
XmStrDefs.c:1370: warning: excess elements in scalar initializer
XmStrDefs.c:1370: warning: (near initialization for `_XmStrings')
XmStrDefs.c:1370: warning: excess elements in scalar initializer
XmStrDefs.c:1370: warning: (near initialization for `_XmStrings')
XmStrDefs.c:1370: warning: excess elements in scalar initializer
XmStrDefs.c:1370: warning: (near initialization for `_XmStrings')
XmStrDefs.c:1370: warning: excess elements in scalar initializer
XmStrDefs.c:1370: warning: (near initialization for `_XmStrings')
XmStrDefs.c:1370: warning: excess elements in scalar initializer
XmStrDefs.c:1370: warning: (near initialization for `_XmStrings')
XmStrDefs.c:1370: warning: excess elements in scalar initializer
XmStrDefs.c:1370: warning: (near initialization for `_XmStrings')
XmStrDefs.c:1370: warning: excess elements in scalar initializer
XmStrDefs.c:1370: warning: (near initialization for `_XmStrings')
XmStrDefs.c:1370: warning: excess elements in scalar initializer
XmStrDefs.c:1370: warning: (near initialization for `_XmStrings')
XmStrDefs.c:1371: warning: excess elements in scalar initializer
XmStrDefs.c:1371: warning: (near initialization for `_XmStrings')
XmStrDefs.c:1371: warning: excess elements in scalar initializer
XmStrDefs.c:1371: warning: (near initialization for `_XmStrings')
XmStrDefs.c:1371: warning: excess elements in scalar initializer
XmStrDefs.c:1371: warning: (near initialization for `_XmStrings')
XmStrDefs.c:1371: warning: excess elements in scalar initializer
XmStrDefs.c:1371: warning: (near initialization for `_XmStrings')
XmStrDefs.c:1371: warning: excess elements in scalar initializer
XmStrDefs.c:1371: warning: (near initialization for `_XmStrings')
XmStrDefs.c:1371: warning: excess elements in scalar initializer
XmStrDefs.c:1371: warning: (near initialization for `_XmStrings')
XmStrDefs.c:1371: warning: excess elements in scalar initializer
XmStrDefs.c:1371: warning: (near initialization for `_XmStrings')
XmStrDefs.c:1371: warning: excess elements in scalar initializer
XmStrDefs.c:1371: warning: (near initialization for `_XmStrings')
XmStrDefs.c:1371: warning: excess elements in scalar initializer
XmStrDefs.c:1371: warning: (near initialization for `_XmStrings')
XmStrDefs.c:1371: warning: excess elements in scalar initializer
XmStrDefs.c:1371: warning: (near initialization for `_XmStrings')
XmStrDefs.c:1371: warning: excess elements in scalar initializer
XmStrDefs.c:1371: warning: (near initialization for `_XmStrings')
XmStrDefs.c:1371: warning: excess elements in scalar initializer
XmStrDefs.c:1371: warning: (near initialization for `_XmStrings')
XmStrDefs.c:1371: warning: excess elements in scalar initializer
XmStrDefs.c:1371: warning: (near initialization for `_XmStrings')
XmStrDefs.c:1371: warning: excess elements in scalar initializer
XmStrDefs.c:1371: warning: (near initialization for `_XmStrings')
XmStrDefs.c:1371: warning: excess elements in scalar initializer
XmStrDefs.c:1371: warning: (near initialization for `_XmStrings')
XmStrDefs.c:1371: warning: excess elements in scalar initializer
XmStrDefs.c:1371: warning: (near initialization for `_XmStrings')
XmStrDefs.c:1371: warning: excess elements in scalar initializer
XmStrDefs.c:1371: warning: (near initialization for `_XmStrings')
XmStrDefs.c:1371: warning: excess elements in scalar initializer
XmStrDefs.c:1371: warning: (near initialization for `_XmStrings')
XmStrDefs.c:1372: warning: excess elements in scalar initializer
XmStrDefs.c:1372: warning: (near initialization for `_XmStrings')
XmStrDefs.c:1374: error: syntax error before "externaldef"
../Xm/XmStrDefs.h:1373: warning: array '_XmStrings' assumed to have one element
../Xm/XmStrDefs22.h:311: warning: array '_XmStrings22' assumed to have one element
../Xm/Xm.h:107: warning: array '_XmSDEFAULT_FONT' assumed to have one element
../Xm/Xm.h:108: warning: array '_XmSDEFAULT_BACKGROUND' assumed to have one element
{standard input}: Assembler messages:
{standard input}:72: Warning: size of "operation" is already 1; not changing to 4
make[3]: *** [XmStrDefs.lo] Error 1
make[3]: Leaving directory `/var/tmp/portage/openmotif-2.2.3-r9/work/openMotif-2.2.3/lib/Xm'
make[2]: *** [all] Error 2
make[2]: Leaving directory `/var/tmp/portage/openmotif-2.2.3-r9/work/openMotif-2.2.3/lib/Xm'
make[1]: *** [all-recursive] Error 1
make[1]: Leaving directory `/var/tmp/portage/openmotif-2.2.3-r9/work/openMotif-2.2.3/lib'
make: *** [all-recursive] Error 1

!!! ERROR: x11-libs/openmotif-2.2.3-r9 failed.
Call stack:
  ebuild.sh, line 1539:   Called dyn_compile
  ebuild.sh, line 939:   Called src_compile
  openmotif-2.2.3-r9.ebuild, line 84:   Called die

!!! make failed, if you have lesstif installed removed it, compile openmotif and recompile lesstif
!!! If you need support, post the topmost build error, and the call stack if relevant.