All pastes #87279 Raw Edit

Unnamed

public text v1 · immutable
·published 2006-07-13 20:52 UTC
rendered paste body
root@Slackbox:/home/wescotte/ut_mod# make DRIVER_SRC_DIR=`pwd`
make -C /usr/src/linux SUBDIRS=`pwd` modules
make[1]: Entering directory `/usr/src/linux-2.6.17.4'
  CC [M]  /home/wescotte/ut_mod/pdc-ulsata2.o
/home/wescotte/ut_mod/pdc-ulsata2.c: In function `ulsata2_init_cam':
/home/wescotte/ut_mod/pdc-ulsata2.c:1044: warning: int format, pointer arg (arg 3)
/home/wescotte/ut_mod/pdc-ulsata2.c: At top level:
/home/wescotte/ut_mod/pdc-ulsata2.c:1195: error: syntax error before '*' token
/home/wescotte/ut_mod/pdc-ulsata2.c:1196: warning: function declaration isn't a prototype
/home/wescotte/ut_mod/pdc-ulsata2.c: In function `ulsata2_detect':
/home/wescotte/ut_mod/pdc-ulsata2.c:1210: error: `ulsata2_host' undeclared (first use in this function)
/home/wescotte/ut_mod/pdc-ulsata2.c:1210: error: (Each undeclared identifier is reported only once
/home/wescotte/ut_mod/pdc-ulsata2.c:1210: error: for each function it appears in.)
/home/wescotte/ut_mod/pdc-ulsata2.c:1282: warning: implicit declaration of function `scsi_set_device'
/home/wescotte/ut_mod/pdc-ulsata2.c: At top level:
/home/wescotte/ut_mod/pdc-ulsata2.c:1331: error: syntax error before '*' token
/home/wescotte/ut_mod/pdc-ulsata2.c:1332: warning: function declaration isn't a prototype
/home/wescotte/ut_mod/pdc-ulsata2.c: In function `ulsata2_ioctl':
/home/wescotte/ut_mod/pdc-ulsata2.c:1338: error: `device' undeclared (first use in this function)
/home/wescotte/ut_mod/pdc-ulsata2.c:1340: error: `arg' undeclared (first use in this function)
/home/wescotte/ut_mod/pdc-ulsata2.c:1357: error: `cmd' undeclared (first use in this function)
/home/wescotte/ut_mod/pdc-ulsata2.c: In function `ulsata2_cbk_atapi_pio':
/home/wescotte/ut_mod/pdc-ulsata2.c:1913: warning: unused variable `pada'
/home/wescotte/ut_mod/pdc-ulsata2.c: In function `camWriteRegByte':
/home/wescotte/ut_mod/pdc-ulsata2.c:2939: warning: passing arg 2 of `writeb' makes pointer from integer without a cast
/home/wescotte/ut_mod/pdc-ulsata2.c: In function `camReadRegByte':
/home/wescotte/ut_mod/pdc-ulsata2.c:2943: warning: passing arg 1 of `readb' makes pointer from integer without a cast
/home/wescotte/ut_mod/pdc-ulsata2.c: In function `camWriteRegWord':
/home/wescotte/ut_mod/pdc-ulsata2.c:2947: warning: passing arg 2 of `writew' makes pointer from integer without a cast
/home/wescotte/ut_mod/pdc-ulsata2.c: In function `camReadRegWord':
/home/wescotte/ut_mod/pdc-ulsata2.c:2951: warning: passing arg 1 of `readw' makes pointer from integer without a cast
/home/wescotte/ut_mod/pdc-ulsata2.c: In function `camWriteRegDword':
/home/wescotte/ut_mod/pdc-ulsata2.c:2955: warning: passing arg 2 of `writel' makes pointer from integer without a cast
/home/wescotte/ut_mod/pdc-ulsata2.c: In function `camReadRegDword':
/home/wescotte/ut_mod/pdc-ulsata2.c:2959: warning: passing arg 1 of `readl' makes pointer from integer without a cast
/home/wescotte/ut_mod/pdc-ulsata2.c:3187:16: warning: ISO C requires whitespace after the macro name
/home/wescotte/ut_mod/pdc-ulsata2.c: At top level:
/home/wescotte/ut_mod/pdc-ulsata2.c:3302: error: syntax error before "driver_template"
/home/wescotte/ut_mod/pdc-ulsata2.c:3302: warning: type defaults to `int' in declaration of `driver_template'
/home/wescotte/ut_mod/pdc-ulsata2.c:3302: error: field name not in record or union initializer
/home/wescotte/ut_mod/pdc-ulsata2.c:3302: error: (near initialization for `driver_template')
/home/wescotte/ut_mod/pdc-ulsata2.c:3302: warning: initialization makes integer from pointer without a cast
/home/wescotte/ut_mod/pdc-ulsata2.c:3302: error: field name not in record or union initializer
/home/wescotte/ut_mod/pdc-ulsata2.c:3302: error: (near initialization for `driver_template')
/home/wescotte/ut_mod/pdc-ulsata2.c:3302: warning: excess elements in scalar initializer
/home/wescotte/ut_mod/pdc-ulsata2.c:3302: warning: (near initialization for `driver_template')
/home/wescotte/ut_mod/pdc-ulsata2.c:3302: error: field name not in record or union initializer
/home/wescotte/ut_mod/pdc-ulsata2.c:3302: error: (near initialization for `driver_template')
/home/wescotte/ut_mod/pdc-ulsata2.c:3302: warning: excess elements in scalar initializer
/home/wescotte/ut_mod/pdc-ulsata2.c:3302: warning: (near initialization for `driver_template')
/home/wescotte/ut_mod/pdc-ulsata2.c:3302: error: field name not in record or union initializer
/home/wescotte/ut_mod/pdc-ulsata2.c:3302: error: (near initialization for `driver_template')
/home/wescotte/ut_mod/pdc-ulsata2.c:3302: warning: excess elements in scalar initializer
/home/wescotte/ut_mod/pdc-ulsata2.c:3302: warning: (near initialization for `driver_template')
/home/wescotte/ut_mod/pdc-ulsata2.c:3302: error: field name not in record or union initializer
/home/wescotte/ut_mod/pdc-ulsata2.c:3302: error: (near initialization for `driver_template')
/home/wescotte/ut_mod/pdc-ulsata2.c:3302: warning: excess elements in scalar initializer
/home/wescotte/ut_mod/pdc-ulsata2.c:3302: warning: (near initialization for `driver_template')
/home/wescotte/ut_mod/pdc-ulsata2.c:3302: error: field name not in record or union initializer
/home/wescotte/ut_mod/pdc-ulsata2.c:3302: error: (near initialization for `driver_template')
/home/wescotte/ut_mod/pdc-ulsata2.c:3302: warning: excess elements in scalar initializer
/home/wescotte/ut_mod/pdc-ulsata2.c:3302: warning: (near initialization for `driver_template')
/home/wescotte/ut_mod/pdc-ulsata2.c:3302: error: field name not in record or union initializer
/home/wescotte/ut_mod/pdc-ulsata2.c:3302: error: (near initialization for `driver_template')
/home/wescotte/ut_mod/pdc-ulsata2.c:3302: warning: excess elements in scalar initializer
/home/wescotte/ut_mod/pdc-ulsata2.c:3302: warning: (near initialization for `driver_template')
/home/wescotte/ut_mod/pdc-ulsata2.c:3302: error: field name not in record or union initializer
/home/wescotte/ut_mod/pdc-ulsata2.c:3302: error: (near initialization for `driver_template')
/home/wescotte/ut_mod/pdc-ulsata2.c:3302: warning: excess elements in scalar initializer
/home/wescotte/ut_mod/pdc-ulsata2.c:3302: warning: (near initialization for `driver_template')
/home/wescotte/ut_mod/pdc-ulsata2.c:3302: error: field name not in record or union initializer
/home/wescotte/ut_mod/pdc-ulsata2.c:3302: error: (near initialization for `driver_template')
/home/wescotte/ut_mod/pdc-ulsata2.c:3302: warning: excess elements in scalar initializer
/home/wescotte/ut_mod/pdc-ulsata2.c:3302: warning: (near initialization for `driver_template')
/home/wescotte/ut_mod/pdc-ulsata2.c:3302: error: field name not in record or union initializer
/home/wescotte/ut_mod/pdc-ulsata2.c:3302: error: (near initialization for `driver_template')
/home/wescotte/ut_mod/pdc-ulsata2.c:3302: warning: excess elements in scalar initializer
/home/wescotte/ut_mod/pdc-ulsata2.c:3302: warning: (near initialization for `driver_template')
/home/wescotte/ut_mod/pdc-ulsata2.c:3302: error: field name not in record or union initializer
/home/wescotte/ut_mod/pdc-ulsata2.c:3302: error: (near initialization for `driver_template')
/home/wescotte/ut_mod/pdc-ulsata2.c:3302: warning: excess elements in scalar initializer
/home/wescotte/ut_mod/pdc-ulsata2.c:3302: warning: (near initialization for `driver_template')
/home/wescotte/ut_mod/pdc-ulsata2.c:3302: error: field name not in record or union initializer
/home/wescotte/ut_mod/pdc-ulsata2.c:3302: error: (near initialization for `driver_template')
/home/wescotte/ut_mod/pdc-ulsata2.c:3302: warning: excess elements in scalar initializer
/home/wescotte/ut_mod/pdc-ulsata2.c:3302: warning: (near initialization for `driver_template')
/home/wescotte/ut_mod/pdc-ulsata2.c:3302: error: field name not in record or union initializer
/home/wescotte/ut_mod/pdc-ulsata2.c:3302: error: (near initialization for `driver_template')
/home/wescotte/ut_mod/pdc-ulsata2.c:3302: warning: excess elements in scalar initializer
/home/wescotte/ut_mod/pdc-ulsata2.c:3302: warning: (near initialization for `driver_template')
/home/wescotte/ut_mod/pdc-ulsata2.c:3302: error: field name not in record or union initializer
/home/wescotte/ut_mod/pdc-ulsata2.c:3302: error: (near initialization for `driver_template')
/home/wescotte/ut_mod/pdc-ulsata2.c:3302: warning: excess elements in scalar initializer
/home/wescotte/ut_mod/pdc-ulsata2.c:3302: warning: (near initialization for `driver_template')
/home/wescotte/ut_mod/pdc-ulsata2.c:3302: error: field name not in record or union initializer
/home/wescotte/ut_mod/pdc-ulsata2.c:3302: error: (near initialization for `driver_template')
/home/wescotte/ut_mod/pdc-ulsata2.c:3302: warning: excess elements in scalar initializer
/home/wescotte/ut_mod/pdc-ulsata2.c:3302: warning: (near initialization for `driver_template')
/home/wescotte/ut_mod/pdc-ulsata2.c:3302: error: field name not in record or union initializer
/home/wescotte/ut_mod/pdc-ulsata2.c:3302: error: (near initialization for `driver_template')
/home/wescotte/ut_mod/pdc-ulsata2.c:3302: warning: excess elements in scalar initializer
/home/wescotte/ut_mod/pdc-ulsata2.c:3302: warning: (near initialization for `driver_template')
/home/wescotte/ut_mod/pdc-ulsata2.c:3302: error: field name not in record or union initializer
/home/wescotte/ut_mod/pdc-ulsata2.c:3302: error: (near initialization for `driver_template')
/home/wescotte/ut_mod/pdc-ulsata2.c:3302: warning: excess elements in scalar initializer
/home/wescotte/ut_mod/pdc-ulsata2.c:3302: warning: (near initialization for `driver_template')
/home/wescotte/ut_mod/pdc-ulsata2.c:3302: error: field name not in record or union initializer
/home/wescotte/ut_mod/pdc-ulsata2.c:3302: error: (near initialization for `driver_template')
/home/wescotte/ut_mod/pdc-ulsata2.c:3302: warning: excess elements in scalar initializer
/home/wescotte/ut_mod/pdc-ulsata2.c:3302: warning: (near initialization for `driver_template')
/home/wescotte/ut_mod/pdc-ulsata2.c:3302: error: field name not in record or union initializer
/home/wescotte/ut_mod/pdc-ulsata2.c:3302: error: (near initialization for `driver_template')
/home/wescotte/ut_mod/pdc-ulsata2.c:3302: warning: excess elements in scalar initializer
/home/wescotte/ut_mod/pdc-ulsata2.c:3302: warning: (near initialization for `driver_template')
/home/wescotte/ut_mod/pdc-ulsata2.c:3302: error: field name not in record or union initializer
/home/wescotte/ut_mod/pdc-ulsata2.c:3302: error: (near initialization for `driver_template')
/home/wescotte/ut_mod/pdc-ulsata2.c:3302: warning: excess elements in scalar initializer
/home/wescotte/ut_mod/pdc-ulsata2.c:3302: warning: (near initialization for `driver_template')
/home/wescotte/ut_mod/pdc-ulsata2.c:3302: error: field name not in record or union initializer
/home/wescotte/ut_mod/pdc-ulsata2.c:3302: error: (near initialization for `driver_template')
/home/wescotte/ut_mod/pdc-ulsata2.c:3302: warning: excess elements in scalar initializer
/home/wescotte/ut_mod/pdc-ulsata2.c:3302: warning: (near initialization for `driver_template')
/home/wescotte/ut_mod/pdc-ulsata2.c:3302: warning: data definition has no type or storage class
In file included from /home/wescotte/ut_mod/pdc-ulsata2.c:3316:
/usr/src/linux/drivers/scsi/scsi_module.c: In function `init_this_scsi_driver':
/usr/src/linux/drivers/scsi/scsi_module.c:19: warning: initialization from incompatible pointer type
/usr/src/linux/drivers/scsi/scsi_module.c: In function `exit_this_scsi_driver':
/usr/src/linux/drivers/scsi/scsi_module.c:54: warning: initialization from incompatible pointer type
make[2]: *** [/home/wescotte/ut_mod/pdc-ulsata2.o] Error 1
make[1]: *** [_module_/home/wescotte/ut_mod] Error 2
make[1]: Leaving directory `/usr/src/linux-2.6.17.4'
make: *** [default] Error 2