All pastes #86991 Raw Edit

Unnamed

public text v1 · immutable
·published 2006-07-13 14:33 UTC
rendered paste body
config line:

./configure --host=arm-gp2x-linux --target=arm-gp2x-linux --build=i686 --prefix=/gp2xsdk/Tools


after runnning make:

...
checking for library containing gethostbyname... none required
checking for library containing socketpair... none required
checking for library containing waddstr... no
checking for library containing tgetent... no
configure: error: no termcap library found
make[1]: *** [configure-gdb] Error 1
make[1]: Leaving directory `/home/eurotalk/arse/gdb-6.4'
make: *** [all] Error 2

gdb/config.log:

root@eurotalk-laptop:~/arse/gdb-6.4# cat gdb/config.log 
This file contains any messages produced by compilers while
running configure, to aid debugging if configure makes a mistake.

It was created by configure, which was
generated by GNU Autoconf 2.59.  Invocation command line was

  $ /home/eurotalk/arse/gdb-6.4/gdb/configure --cache-file=./config.cache --build=i686 --host=arm-gp2x-linux --target=arm-gp2x-linux --prefix=/gp2xsdk/Tools --program-transform-name=s,y,y, --srcdir=.././gdb

## --------- ##
## Platform. ##
## --------- ##

hostname = eurotalk-laptop
uname -m = i686
uname -r = 2.6.15-25-386
uname -s = Linux
uname -v = #1 PREEMPT Wed Jun 14 11:25:49 UTC 2006

/usr/bin/uname -p = unknown
/bin/uname -X     = unknown

/bin/arch              = i686
/usr/bin/arch -k       = unknown
/usr/convex/getsysinfo = unknown
hostinfo               = unknown
/bin/machine           = unknown
/usr/bin/oslevel       = unknown
/bin/universe          = unknown

PATH: /usr/local/sbin
PATH: /usr/local/bin
PATH: /usr/sbin
PATH: /usr/bin
PATH: /sbin
PATH: /bin
PATH: /usr/X11R6/bin
PATH: /gp2xsdk/Tools/bin


## ----------- ##
## Core tests. ##
## ----------- ##

configure:1262: creating cache ./config.cache
configure:1344: checking whether to enable maintainer-specific portions of Makefiles
configure:1353: result: no
configure:1377: checking for arm-gp2x-linux-gcc
configure:1403: result: arm-gp2x-linux-gcc
configure:1685: checking for C compiler version
configure:1688: arm-gp2x-linux-gcc --version </dev/null >&5
arm-gp2x-linux-gcc (GCC) 3.4.6
Copyright (C) 2006 Free Software Foundation, Inc.
This is free software; see the source for copying conditions.  There is NO
warranty; not even for MERCHANTABILITY or FITNESS FOR A PARTICULAR PURPOSE.

configure:1691: $? = 0
configure:1693: arm-gp2x-linux-gcc -v </dev/null >&5
Reading specs from /gp2xsdk/Tools/lib/gcc/arm-gp2x-linux/3.4.6/specs
Configured with: /gp2xsdk/Tools/src/gcc-3.4.6/configure --prefix=/gp2xsdk/Tools --includedir=/gp2xsdk/Tools/arm-gp2x-linux/include --host=i386-linux --target=arm-gp2x-linux --build=i386-linux --program-prefix=arm-gp2x-linux- --with-cpu=arm9tdmi --with-headers=/gp2xsdk/Tools/kernel/linux-2.4.25-gp2x/include --enable-shared --disable-nls --disable-libstdcxx-pch --without-fp --with-softfloat-support=internal
Thread model: posix
gcc version 3.4.6
configure:1696: $? = 0
configure:1698: arm-gp2x-linux-gcc -V </dev/null >&5
arm-gp2x-linux-gcc: `-V' option must have argument
configure:1701: $? = 1
configure:1724: checking for C compiler default output file name
configure:1727: arm-gp2x-linux-gcc -g -O2    conftest.c  >&5
configure:1730: $? = 0
configure:1776: result: a.out
configure:1781: checking whether the C compiler works
configure:1807: result: yes
configure:1814: checking whether we are cross compiling
configure:1816: result: yes
configure:1819: checking for suffix of executables
configure:1821: arm-gp2x-linux-gcc -o conftest -g -O2    conftest.c  >&5
configure:1824: $? = 0
configure:1849: result: 
configure:1855: checking for suffix of object files
configure:1876: arm-gp2x-linux-gcc -c -g -O2   conftest.c >&5
configure:1879: $? = 0
configure:1901: result: o
configure:1905: checking whether we are using the GNU C compiler
configure:1929: arm-gp2x-linux-gcc -c -g -O2   conftest.c >&5
configure:1935: $? = 0
configure:1939: test -z 
                         || test ! -s conftest.err
configure:1942: $? = 0
configure:1945: test -s conftest.o
configure:1948: $? = 0
configure:1961: result: yes
configure:1967: checking whether arm-gp2x-linux-gcc accepts -g
configure:1988: arm-gp2x-linux-gcc -c -g  conftest.c >&5
configure:1994: $? = 0
configure:1998: test -z 
                         || test ! -s conftest.err
configure:2001: $? = 0
configure:2004: test -s conftest.o
configure:2007: $? = 0
configure:2018: result: yes
configure:2035: checking for arm-gp2x-linux-gcc option to accept ANSI C
configure:2105: arm-gp2x-linux-gcc  -c -g -O2   conftest.c >&5
configure:2111: $? = 0
configure:2115: test -z 
                         || test ! -s conftest.err
configure:2118: $? = 0
configure:2121: test -s conftest.o
configure:2124: $? = 0
configure:2142: result: none needed
configure:2160: arm-gp2x-linux-gcc -c -g -O2   conftest.c >&5
conftest.c:2: error: syntax error before "me"
configure:2166: $? = 1
configure: failed program was:
| #ifndef __cplusplus
|   choke me
| #endif
configure:2311: checking how to run the C preprocessor
configure:2346: arm-gp2x-linux-gcc -E  conftest.c
configure:2352: $? = 0
configure:2384: arm-gp2x-linux-gcc -E  conftest.c
conftest.c:10:28: ac_nonexistent.h: No such file or directory
configure:2390: $? = 1
configure: failed program was:
| /* confdefs.h.  */
| 
| #define PACKAGE_NAME ""
| #define PACKAGE_TARNAME ""
| #define PACKAGE_VERSION ""
| #define PACKAGE_STRING ""
| #define PACKAGE_BUGREPORT ""
| #define _GNU_SOURCE 1
| /* end confdefs.h.  */
| #include <ac_nonexistent.h>
configure:2429: result: arm-gp2x-linux-gcc -E
configure:2453: arm-gp2x-linux-gcc -E  conftest.c
configure:2459: $? = 0
configure:2491: arm-gp2x-linux-gcc -E  conftest.c
conftest.c:10:28: ac_nonexistent.h: No such file or directory
configure:2497: $? = 1
configure: failed program was:
| /* confdefs.h.  */
| 
| #define PACKAGE_NAME ""
| #define PACKAGE_TARNAME ""
| #define PACKAGE_VERSION ""
| #define PACKAGE_STRING ""
| #define PACKAGE_BUGREPORT ""
| #define _GNU_SOURCE 1
| /* end confdefs.h.  */
| #include <ac_nonexistent.h>
configure:2541: checking for egrep
configure:2551: result: grep -E
configure:2557: checking for AIX
configure:2579: result: no
configure:2585: checking for library containing strerror
configure:2615: arm-gp2x-linux-gcc -o conftest -g -O2    conftest.c  >&5
configure:2621: $? = 0
configure:2625: test -z 
                         || test ! -s conftest.err
configure:2628: $? = 0
configure:2631: test -s conftest
configure:2634: $? = 0
configure:2704: result: none required
configure:2714: checking for arm-gp2x-linux-gcc option to accept ANSI C
configure:2777: arm-gp2x-linux-gcc  -c -g -O2   conftest.c >&5
configure:2783: $? = 0
configure:2787: test -z 
                         || test ! -s conftest.err
configure:2790: $? = 0
configure:2793: test -s conftest.o
configure:2796: $? = 0
configure:2811: result: none needed
configure:2854: checking build system type
configure:2872: result: i686-pc-none
configure:2880: checking host system type
configure:2894: result: arm-gp2x-linux-gnu
configure:2902: checking target system type
configure:2916: result: arm-gp2x-linux-gnu
configure:2943: checking whether make sets $(MAKE)
configure:2963: result: yes
configure:2975: checking for arm-gp2x-linux-ranlib
configure:3001: result: arm-gp2x-linux-ranlib
configure:3052: checking for ANSI C header files
configure:3077: arm-gp2x-linux-gcc -c -g -O2   conftest.c >&5
configure:3083: $? = 0
configure:3087: test -z 
                         || test ! -s conftest.err
configure:3090: $? = 0
configure:3093: test -s conftest.o
configure:3096: $? = 0
configure:3208: result: yes
configure:3218: checking for an ANSI C-conforming const
configure:3285: arm-gp2x-linux-gcc -c -g -O2   conftest.c >&5
configure:3291: $? = 0
configure:3295: test -z 
                         || test ! -s conftest.err
configure:3298: $? = 0
configure:3301: test -s conftest.o
configure:3304: $? = 0
configure:3315: result: yes
configure:3325: checking for inline
configure:3346: arm-gp2x-linux-gcc -c -g -O2   conftest.c >&5
configure:3352: $? = 0
configure:3356: test -z 
                         || test ! -s conftest.err
configure:3359: $? = 0
configure:3362: test -s conftest.o
configure:3365: $? = 0
configure:3377: result: inline
configure:3410: checking for sys/types.h
configure:3426: arm-gp2x-linux-gcc -c -g -O2   conftest.c >&5
configure:3432: $? = 0
configure:3436: test -z 
                         || test ! -s conftest.err
configure:3439: $? = 0
configure:3442: test -s conftest.o
configure:3445: $? = 0
configure:3456: result: yes
configure:3410: checking for sys/stat.h
configure:3426: arm-gp2x-linux-gcc -c -g -O2   conftest.c >&5
configure:3432: $? = 0
configure:3436: test -z 
                         || test ! -s conftest.err
configure:3439: $? = 0
configure:3442: test -s conftest.o
configure:3445: $? = 0
configure:3456: result: yes
configure:3410: checking for stdlib.h
configure:3426: arm-gp2x-linux-gcc -c -g -O2   conftest.c >&5
configure:3432: $? = 0
configure:3436: test -z 
                         || test ! -s conftest.err
configure:3439: $? = 0
configure:3442: test -s conftest.o
configure:3445: $? = 0
configure:3456: result: yes
configure:3410: checking for string.h
configure:3426: arm-gp2x-linux-gcc -c -g -O2   conftest.c >&5
configure:3432: $? = 0
configure:3436: test -z 
                         || test ! -s conftest.err
configure:3439: $? = 0
configure:3442: test -s conftest.o
configure:3445: $? = 0
configure:3456: result: yes
configure:3410: checking for memory.h
configure:3426: arm-gp2x-linux-gcc -c -g -O2   conftest.c >&5
configure:3432: $? = 0
configure:3436: test -z 
                         || test ! -s conftest.err
configure:3439: $? = 0
configure:3442: test -s conftest.o
configure:3445: $? = 0
configure:3456: result: yes
configure:3410: checking for strings.h
configure:3426: arm-gp2x-linux-gcc -c -g -O2   conftest.c >&5
configure:3432: $? = 0
configure:3436: test -z 
                         || test ! -s conftest.err
configure:3439: $? = 0
configure:3442: test -s conftest.o
configure:3445: $? = 0
configure:3456: result: yes
configure:3410: checking for inttypes.h
configure:3426: arm-gp2x-linux-gcc -c -g -O2   conftest.c >&5
configure:3432: $? = 0
configure:3436: test -z 
                         || test ! -s conftest.err
configure:3439: $? = 0
configure:3442: test -s conftest.o
configure:3445: $? = 0
configure:3456: result: yes
configure:3410: checking for stdint.h
configure:3426: arm-gp2x-linux-gcc -c -g -O2   conftest.c >&5
configure:3432: $? = 0
configure:3436: test -z 
                         || test ! -s conftest.err
configure:3439: $? = 0
configure:3442: test -s conftest.o
configure:3445: $? = 0
configure:3456: result: yes
configure:3410: checking for unistd.h
configure:3426: arm-gp2x-linux-gcc -c -g -O2   conftest.c >&5
configure:3432: $? = 0
configure:3436: test -z 
                         || test ! -s conftest.err
configure:3439: $? = 0
configure:3442: test -s conftest.o
configure:3445: $? = 0
configure:3456: result: yes
configure:3468: checking for off_t
configure:3492: arm-gp2x-linux-gcc -c -g -O2   conftest.c >&5
configure:3498: $? = 0
configure:3502: test -z 
                         || test ! -s conftest.err
configure:3505: $? = 0
configure:3508: test -s conftest.o
configure:3511: $? = 0
configure:3522: result: yes
configure:3534: checking for size_t
configure:3558: arm-gp2x-linux-gcc -c -g -O2   conftest.c >&5
configure:3564: $? = 0
configure:3568: test -z 
                         || test ! -s conftest.err
configure:3571: $? = 0
configure:3574: test -s conftest.o
configure:3577: $? = 0
configure:3588: result: yes
configure:3602: checking for working alloca.h
configure:3623: arm-gp2x-linux-gcc -o conftest -g -O2    conftest.c  >&5
configure:3629: $? = 0
configure:3633: test -z 
                         || test ! -s conftest.err
configure:3636: $? = 0
configure:3639: test -s conftest
configure:3642: $? = 0
configure:3654: result: yes
configure:3664: checking for alloca
configure:3705: arm-gp2x-linux-gcc -o conftest -g -O2    conftest.c  >&5
configure:3711: $? = 0
configure:3715: test -z 
                         || test ! -s conftest.err
configure:3718: $? = 0
configure:3721: test -s conftest
configure:3724: $? = 0
configure:3736: result: yes
configure:3965: checking for stdlib.h
configure:3970: result: yes
configure:3965: checking for unistd.h
configure:3970: result: yes
configure:4114: checking for getpagesize
configure:4171: arm-gp2x-linux-gcc -o conftest -g -O2    conftest.c  >&5
configure:4177: $? = 0
configure:4181: test -z 
                         || test ! -s conftest.err
configure:4184: $? = 0
configure:4187: test -s conftest
configure:4190: $? = 0
configure:4202: result: yes
configure:4212: checking for working mmap
configure:4376: result: no
configure:4411: checking argz.h usability
configure:4423: arm-gp2x-linux-gcc -c -g -O2   conftest.c >&5
configure:4429: $? = 0
configure:4433: test -z 
                         || test ! -s conftest.err
configure:4436: $? = 0
configure:4439: test -s conftest.o
configure:4442: $? = 0
configure:4452: result: yes
configure:4456: checking argz.h presence
configure:4466: arm-gp2x-linux-gcc -E  conftest.c
configure:4472: $? = 0
configure:4492: result: yes
configure:4527: checking for argz.h
configure:4534: result: yes
configure:4411: checking limits.h usability
configure:4423: arm-gp2x-linux-gcc -c -g -O2   conftest.c >&5
configure:4429: $? = 0
configure:4433: test -z 
                         || test ! -s conftest.err
configure:4436: $? = 0
configure:4439: test -s conftest.o
configure:4442: $? = 0
configure:4452: result: yes
configure:4456: checking limits.h presence
configure:4466: arm-gp2x-linux-gcc -E  conftest.c
configure:4472: $? = 0
configure:4492: result: yes
configure:4527: checking for limits.h
configure:4534: result: yes
configure:4411: checking locale.h usability
configure:4423: arm-gp2x-linux-gcc -c -g -O2   conftest.c >&5
configure:4429: $? = 0
configure:4433: test -z 
                         || test ! -s conftest.err
configure:4436: $? = 0
configure:4439: test -s conftest.o
configure:4442: $? = 0
configure:4452: result: yes
configure:4456: checking locale.h presence
configure:4466: arm-gp2x-linux-gcc -E  conftest.c
configure:4472: $? = 0
configure:4492: result: yes
configure:4527: checking for locale.h
configure:4534: result: yes
configure:4411: checking nl_types.h usability
configure:4423: arm-gp2x-linux-gcc -c -g -O2   conftest.c >&5
configure:4429: $? = 0
configure:4433: test -z 
                         || test ! -s conftest.err
configure:4436: $? = 0
configure:4439: test -s conftest.o
configure:4442: $? = 0
configure:4452: result: yes
configure:4456: checking nl_types.h presence
configure:4466: arm-gp2x-linux-gcc -E  conftest.c
configure:4472: $? = 0
configure:4492: result: yes
configure:4527: checking for nl_types.h
configure:4534: result: yes
configure:4411: checking malloc.h usability
configure:4423: arm-gp2x-linux-gcc -c -g -O2   conftest.c >&5
configure:4429: $? = 0
configure:4433: test -z 
                         || test ! -s conftest.err
configure:4436: $? = 0
configure:4439: test -s conftest.o
configure:4442: $? = 0
configure:4452: result: yes
configure:4456: checking malloc.h presence
configure:4466: arm-gp2x-linux-gcc -E  conftest.c
configure:4472: $? = 0
configure:4492: result: yes
configure:4527: checking for malloc.h
configure:4534: result: yes
configure:4402: checking for string.h
configure:4407: result: yes
configure:4402: checking for unistd.h
configure:4407: result: yes
configure:4411: checking values.h usability
configure:4423: arm-gp2x-linux-gcc -c -g -O2   conftest.c >&5
configure:4429: $? = 0
configure:4433: test -z 
                         || test ! -s conftest.err
configure:4436: $? = 0
configure:4439: test -s conftest.o
configure:4442: $? = 0
configure:4452: result: yes
configure:4456: checking values.h presence
configure:4466: arm-gp2x-linux-gcc -E  conftest.c
configure:4472: $? = 0
configure:4492: result: yes
configure:4527: checking for values.h
configure:4534: result: yes
configure:4411: checking sys/param.h usability
configure:4423: arm-gp2x-linux-gcc -c -g -O2   conftest.c >&5
configure:4429: $? = 0
configure:4433: test -z 
                         || test ! -s conftest.err
configure:4436: $? = 0
configure:4439: test -s conftest.o
configure:4442: $? = 0
configure:4452: result: yes
configure:4456: checking sys/param.h presence
configure:4466: arm-gp2x-linux-gcc -E  conftest.c
configure:4472: $? = 0
configure:4492: result: yes
configure:4527: checking for sys/param.h
configure:4534: result: yes
configure:4561: checking for getcwd
configure:4618: arm-gp2x-linux-gcc -o conftest -g -O2    conftest.c  >&5
configure:4624: $? = 0
configure:4628: test -z 
                         || test ! -s conftest.err
configure:4631: $? = 0
configure:4634: test -s conftest
configure:4637: $? = 0
configure:4649: result: yes
configure:4561: checking for munmap
configure:4618: arm-gp2x-linux-gcc -o conftest -g -O2    conftest.c  >&5
configure:4624: $? = 0
configure:4628: test -z 
                         || test ! -s conftest.err
configure:4631: $? = 0
configure:4634: test -s conftest
configure:4637: $? = 0
configure:4649: result: yes
configure:4561: checking for putenv
configure:4618: arm-gp2x-linux-gcc -o conftest -g -O2    conftest.c  >&5
configure:4624: $? = 0
configure:4628: test -z 
                         || test ! -s conftest.err
configure:4631: $? = 0
configure:4634: test -s conftest
configure:4637: $? = 0
configure:4649: result: yes
configure:4561: checking for setenv
configure:4618: arm-gp2x-linux-gcc -o conftest -g -O2    conftest.c  >&5
configure:4624: $? = 0
configure:4628: test -z 
                         || test ! -s conftest.err
configure:4631: $? = 0
configure:4634: test -s conftest
configure:4637: $? = 0
configure:4649: result: yes
configure:4561: checking for setlocale
configure:4618: arm-gp2x-linux-gcc -o conftest -g -O2    conftest.c  >&5
configure:4624: $? = 0
configure:4628: test -z 
                         || test ! -s conftest.err
configure:4631: $? = 0
configure:4634: test -s conftest
configure:4637: $? = 0
configure:4649: result: yes
configure:4561: checking for strchr
configure:4618: arm-gp2x-linux-gcc -o conftest -g -O2    conftest.c  >&5
conftest.c:63: warning: conflicting types for built-in function 'strchr'
configure:4624: $? = 0
configure:4628: test -z 
                         || test ! -s conftest.err
configure:4631: $? = 0
configure:4634: test -s conftest
configure:4637: $? = 0
configure:4649: result: yes
configure:4561: checking for strcasecmp
configure:4618: arm-gp2x-linux-gcc -o conftest -g -O2    conftest.c  >&5
configure:4624: $? = 0
configure:4628: test -z 
                         || test ! -s conftest.err
configure:4631: $? = 0
configure:4634: test -s conftest
configure:4637: $? = 0
configure:4649: result: yes
configure:4561: checking for __argz_count
configure:4618: arm-gp2x-linux-gcc -o conftest -g -O2    conftest.c  >&5
configure:4624: $? = 0
configure:4628: test -z 
                         || test ! -s conftest.err
configure:4631: $? = 0
configure:4634: test -s conftest
configure:4637: $? = 0
configure:4649: result: yes
configure:4561: checking for __argz_stringify
configure:4618: arm-gp2x-linux-gcc -o conftest -g -O2    conftest.c  >&5
configure:4624: $? = 0
configure:4628: test -z 
                         || test ! -s conftest.err
configure:4631: $? = 0
configure:4634: test -s conftest
configure:4637: $? = 0
configure:4649: result: yes
configure:4561: checking for __argz_next
configure:4618: arm-gp2x-linux-gcc -o conftest -g -O2    conftest.c  >&5
configure:4624: $? = 0
configure:4628: test -z 
                         || test ! -s conftest.err
configure:4631: $? = 0
configure:4634: test -s conftest
configure:4637: $? = 0
configure:4649: result: yes
configure:4665: checking for stpcpy
configure:4722: arm-gp2x-linux-gcc -o conftest -g -O2    conftest.c  >&5
conftest.c:68: warning: conflicting types for built-in function 'stpcpy'
configure:4728: $? = 0
configure:4732: test -z 
                         || test ! -s conftest.err
configure:4735: $? = 0
configure:4738: test -s conftest
configure:4741: $? = 0
configure:4753: result: yes
configure:4773: checking for LC_MESSAGES
configure:4794: arm-gp2x-linux-gcc -o conftest -g -O2    conftest.c  >&5
configure:4800: $? = 0
configure:4804: test -z 
                         || test ! -s conftest.err
configure:4807: $? = 0
configure:4810: test -s conftest
configure:4813: $? = 0
configure:4825: result: yes
configure:4835: checking whether NLS is requested
configure:4844: result: yes
configure:4851: checking whether included gettext is requested
configure:4861: result: no
configure:4880: checking libintl.h usability
configure:4892: arm-gp2x-linux-gcc -c -g -O2   conftest.c >&5
configure:4898: $? = 0
configure:4902: test -z 
                         || test ! -s conftest.err
configure:4905: $? = 0
configure:4908: test -s conftest.o
configure:4911: $? = 0
configure:4921: result: yes
configure:4925: checking libintl.h presence
configure:4935: arm-gp2x-linux-gcc -E  conftest.c
configure:4941: $? = 0
configure:4961: result: yes
configure:4996: checking for libintl.h
configure:5003: result: yes
configure:5008: checking for gettext in libc
configure:5029: arm-gp2x-linux-gcc -o conftest -g -O2    conftest.c  >&5
configure:5035: $? = 0
configure:5039: test -z 
                         || test ! -s conftest.err
configure:5042: $? = 0
configure:5045: test -s conftest
configure:5048: $? = 0
configure:5060: result: yes
configure:5196: checking for msgfmt
configure:5223: result: /usr/bin/msgfmt
configure:5234: checking for dcgettext
configure:5291: arm-gp2x-linux-gcc -o conftest -g -O2    conftest.c  >&5
conftest.c:72: warning: conflicting types for built-in function 'dcgettext'
configure:5297: $? = 0
configure:5301: test -z 
                         || test ! -s conftest.err
configure:5304: $? = 0
configure:5307: test -s conftest
configure:5310: $? = 0
configure:5322: result: yes
configure:5334: checking for gmsgfmt
configure:5365: result: /usr/bin/msgfmt
configure:5374: checking for xgettext
configure:5401: result: /usr/bin/xgettext
configure:5425: arm-gp2x-linux-gcc -o conftest -g -O2    conftest.c  >&5
configure:5431: $? = 0
configure:5435: test -z 
                         || test ! -s conftest.err
configure:5438: $? = 0
configure:5441: test -s conftest
configure:5444: $? = 0
configure:5870: checking for catalogs to be installed
configure:5902: result: 
configure:6111: checking libunwind.h usability
configure:6123: arm-gp2x-linux-gcc -c -g -O2   conftest.c >&5
conftest.c:88:23: libunwind.h: No such file or directory
configure:6129: $? = 1
configure: failed program was:
| /* confdefs.h.  */
| 
| #define PACKAGE_NAME ""
| #define PACKAGE_TARNAME ""
| #define PACKAGE_VERSION ""
| #define PACKAGE_STRING ""
| #define PACKAGE_BUGREPORT ""
| #define _GNU_SOURCE 1
| #define STDC_HEADERS 1
| #define HAVE_SYS_TYPES_H 1
| #define HAVE_SYS_STAT_H 1
| #define HAVE_STDLIB_H 1
| #define HAVE_STRING_H 1
| #define HAVE_MEMORY_H 1
| #define HAVE_STRINGS_H 1
| #define HAVE_INTTYPES_H 1
| #define HAVE_STDINT_H 1
| #define HAVE_UNISTD_H 1
| #define HAVE_ALLOCA_H 1
| #define HAVE_ALLOCA 1
| #define HAVE_STDLIB_H 1
| #define HAVE_UNISTD_H 1
| #define HAVE_GETPAGESIZE 1
| #define HAVE_ARGZ_H 1
| #define HAVE_LIMITS_H 1
| #define HAVE_LOCALE_H 1
| #define HAVE_NL_TYPES_H 1
| #define HAVE_MALLOC_H 1
| #define HAVE_STRING_H 1
| #define HAVE_UNISTD_H 1
| #define HAVE_VALUES_H 1
| #define HAVE_SYS_PARAM_H 1
| #define HAVE_GETCWD 1
| #define HAVE_MUNMAP 1
| #define HAVE_PUTENV 1
| #define HAVE_SETENV 1
| #define HAVE_SETLOCALE 1
| #define HAVE_STRCHR 1
| #define HAVE_STRCASECMP 1
| #define HAVE___ARGZ_COUNT 1
| #define HAVE___ARGZ_STRINGIFY 1
| #define HAVE___ARGZ_NEXT 1
| #define HAVE_STPCPY 1
| #define HAVE_STPCPY 1
| #define HAVE_LC_MESSAGES 1
| #define HAVE_GETTEXT 1
| #define HAVE_DCGETTEXT 1
| #define ENABLE_NLS 1
| #define PACKAGE "gdb"
| #define DEBUGDIR "/gp2xsdk/Tools/lib/debug"
| #define DEFAULT_BFD_ARCH bfd_arm_arch
| #define DEFAULT_BFD_VEC bfd_elf32_littlearm_vec
| /* end confdefs.h.  */
| #include <stdio.h>
| #if HAVE_SYS_TYPES_H
| # include <sys/types.h>
| #endif
| #if HAVE_SYS_STAT_H
| # include <sys/stat.h>
| #endif
| #if STDC_HEADERS
| # include <stdlib.h>
| # include <stddef.h>
| #else
| # if HAVE_STDLIB_H
| #  include <stdlib.h>
| # endif
| #endif
| #if HAVE_STRING_H
| # if !STDC_HEADERS && HAVE_MEMORY_H
| #  include <memory.h>
| # endif
| # include <string.h>
| #endif
| #if HAVE_STRINGS_H
| # include <strings.h>
| #endif
| #if HAVE_INTTYPES_H
| # include <inttypes.h>
| #else
| # if HAVE_STDINT_H
| #  include <stdint.h>
| # endif
| #endif
| #if HAVE_UNISTD_H
| # include <unistd.h>
| #endif
| #include <libunwind.h>
configure:6152: result: no
configure:6156: checking libunwind.h presence
configure:6166: arm-gp2x-linux-gcc -E  conftest.c
conftest.c:54:23: libunwind.h: No such file or directory
configure:6172: $? = 1
configure: failed program was:
| /* confdefs.h.  */
| 
| #define PACKAGE_NAME ""
| #define PACKAGE_TARNAME ""
| #define PACKAGE_VERSION ""
| #define PACKAGE_STRING ""
| #define PACKAGE_BUGREPORT ""
| #define _GNU_SOURCE 1
| #define STDC_HEADERS 1
| #define HAVE_SYS_TYPES_H 1
| #define HAVE_SYS_STAT_H 1
| #define HAVE_STDLIB_H 1
| #define HAVE_STRING_H 1
| #define HAVE_MEMORY_H 1
| #define HAVE_STRINGS_H 1
| #define HAVE_INTTYPES_H 1
| #define HAVE_STDINT_H 1
| #define HAVE_UNISTD_H 1
| #define HAVE_ALLOCA_H 1
| #define HAVE_ALLOCA 1
| #define HAVE_STDLIB_H 1
| #define HAVE_UNISTD_H 1
| #define HAVE_GETPAGESIZE 1
| #define HAVE_ARGZ_H 1
| #define HAVE_LIMITS_H 1
| #define HAVE_LOCALE_H 1
| #define HAVE_NL_TYPES_H 1
| #define HAVE_MALLOC_H 1
| #define HAVE_STRING_H 1
| #define HAVE_UNISTD_H 1
| #define HAVE_VALUES_H 1
| #define HAVE_SYS_PARAM_H 1
| #define HAVE_GETCWD 1
| #define HAVE_MUNMAP 1
| #define HAVE_PUTENV 1
| #define HAVE_SETENV 1
| #define HAVE_SETLOCALE 1
| #define HAVE_STRCHR 1
| #define HAVE_STRCASECMP 1
| #define HAVE___ARGZ_COUNT 1
| #define HAVE___ARGZ_STRINGIFY 1
| #define HAVE___ARGZ_NEXT 1
| #define HAVE_STPCPY 1
| #define HAVE_STPCPY 1
| #define HAVE_LC_MESSAGES 1
| #define HAVE_GETTEXT 1
| #define HAVE_DCGETTEXT 1
| #define ENABLE_NLS 1
| #define PACKAGE "gdb"
| #define DEBUGDIR "/gp2xsdk/Tools/lib/debug"
| #define DEFAULT_BFD_ARCH bfd_arm_arch
| #define DEFAULT_BFD_VEC bfd_elf32_littlearm_vec
| /* end confdefs.h.  */
| #include <libunwind.h>
configure:6192: result: no
configure:6227: checking for libunwind.h
configure:6234: result: no
configure:6261: checking libunwind-ia64.h usability
configure:6273: arm-gp2x-linux-gcc -c -g -O2   conftest.c >&5
conftest.c:88:28: libunwind-ia64.h: No such file or directory
configure:6279: $? = 1
configure: failed program was:
| /* confdefs.h.  */
| 
| #define PACKAGE_NAME ""
| #define PACKAGE_TARNAME ""
| #define PACKAGE_VERSION ""
| #define PACKAGE_STRING ""
| #define PACKAGE_BUGREPORT ""
| #define _GNU_SOURCE 1
| #define STDC_HEADERS 1
| #define HAVE_SYS_TYPES_H 1
| #define HAVE_SYS_STAT_H 1
| #define HAVE_STDLIB_H 1
| #define HAVE_STRING_H 1
| #define HAVE_MEMORY_H 1
| #define HAVE_STRINGS_H 1
| #define HAVE_INTTYPES_H 1
| #define HAVE_STDINT_H 1
| #define HAVE_UNISTD_H 1
| #define HAVE_ALLOCA_H 1
| #define HAVE_ALLOCA 1
| #define HAVE_STDLIB_H 1
| #define HAVE_UNISTD_H 1
| #define HAVE_GETPAGESIZE 1
| #define HAVE_ARGZ_H 1
| #define HAVE_LIMITS_H 1
| #define HAVE_LOCALE_H 1
| #define HAVE_NL_TYPES_H 1
| #define HAVE_MALLOC_H 1
| #define HAVE_STRING_H 1
| #define HAVE_UNISTD_H 1
| #define HAVE_VALUES_H 1
| #define HAVE_SYS_PARAM_H 1
| #define HAVE_GETCWD 1
| #define HAVE_MUNMAP 1
| #define HAVE_PUTENV 1
| #define HAVE_SETENV 1
| #define HAVE_SETLOCALE 1
| #define HAVE_STRCHR 1
| #define HAVE_STRCASECMP 1
| #define HAVE___ARGZ_COUNT 1
| #define HAVE___ARGZ_STRINGIFY 1
| #define HAVE___ARGZ_NEXT 1
| #define HAVE_STPCPY 1
| #define HAVE_STPCPY 1
| #define HAVE_LC_MESSAGES 1
| #define HAVE_GETTEXT 1
| #define HAVE_DCGETTEXT 1
| #define ENABLE_NLS 1
| #define PACKAGE "gdb"
| #define DEBUGDIR "/gp2xsdk/Tools/lib/debug"
| #define DEFAULT_BFD_ARCH bfd_arm_arch
| #define DEFAULT_BFD_VEC bfd_elf32_littlearm_vec
| /* end confdefs.h.  */
| #include <stdio.h>
| #if HAVE_SYS_TYPES_H
| # include <sys/types.h>
| #endif
| #if HAVE_SYS_STAT_H
| # include <sys/stat.h>
| #endif
| #if STDC_HEADERS
| # include <stdlib.h>
| # include <stddef.h>
| #else
| # if HAVE_STDLIB_H
| #  include <stdlib.h>
| # endif
| #endif
| #if HAVE_STRING_H
| # if !STDC_HEADERS && HAVE_MEMORY_H
| #  include <memory.h>
| # endif
| # include <string.h>
| #endif
| #if HAVE_STRINGS_H
| # include <strings.h>
| #endif
| #if HAVE_INTTYPES_H
| # include <inttypes.h>
| #else
| # if HAVE_STDINT_H
| #  include <stdint.h>
| # endif
| #endif
| #if HAVE_UNISTD_H
| # include <unistd.h>
| #endif
| #include <libunwind-ia64.h>
configure:6302: result: no
configure:6306: checking libunwind-ia64.h presence
configure:6316: arm-gp2x-linux-gcc -E  conftest.c
conftest.c:54:28: libunwind-ia64.h: No such file or directory
configure:6322: $? = 1
configure: failed program was:
| /* confdefs.h.  */
| 
| #define PACKAGE_NAME ""
| #define PACKAGE_TARNAME ""
| #define PACKAGE_VERSION ""
| #define PACKAGE_STRING ""
| #define PACKAGE_BUGREPORT ""
| #define _GNU_SOURCE 1
| #define STDC_HEADERS 1
| #define HAVE_SYS_TYPES_H 1
| #define HAVE_SYS_STAT_H 1
| #define HAVE_STDLIB_H 1
| #define HAVE_STRING_H 1
| #define HAVE_MEMORY_H 1
| #define HAVE_STRINGS_H 1
| #define HAVE_INTTYPES_H 1
| #define HAVE_STDINT_H 1
| #define HAVE_UNISTD_H 1
| #define HAVE_ALLOCA_H 1
| #define HAVE_ALLOCA 1
| #define HAVE_STDLIB_H 1
| #define HAVE_UNISTD_H 1
| #define HAVE_GETPAGESIZE 1
| #define HAVE_ARGZ_H 1
| #define HAVE_LIMITS_H 1
| #define HAVE_LOCALE_H 1
| #define HAVE_NL_TYPES_H 1
| #define HAVE_MALLOC_H 1
| #define HAVE_STRING_H 1
| #define HAVE_UNISTD_H 1
| #define HAVE_VALUES_H 1
| #define HAVE_SYS_PARAM_H 1
| #define HAVE_GETCWD 1
| #define HAVE_MUNMAP 1
| #define HAVE_PUTENV 1
| #define HAVE_SETENV 1
| #define HAVE_SETLOCALE 1
| #define HAVE_STRCHR 1
| #define HAVE_STRCASECMP 1
| #define HAVE___ARGZ_COUNT 1
| #define HAVE___ARGZ_STRINGIFY 1
| #define HAVE___ARGZ_NEXT 1
| #define HAVE_STPCPY 1
| #define HAVE_STPCPY 1
| #define HAVE_LC_MESSAGES 1
| #define HAVE_GETTEXT 1
| #define HAVE_DCGETTEXT 1
| #define ENABLE_NLS 1
| #define PACKAGE "gdb"
| #define DEBUGDIR "/gp2xsdk/Tools/lib/debug"
| #define DEFAULT_BFD_ARCH bfd_arm_arch
| #define DEFAULT_BFD_VEC bfd_elf32_littlearm_vec
| /* end confdefs.h.  */
| #include <libunwind-ia64.h>
configure:6342: result: no
configure:6377: checking for libunwind-ia64.h
configure:6384: result: no
configure:6735: checking for monstartup
configure:6792: arm-gp2x-linux-gcc -o conftest -g -O2    conftest.c  >&5
configure:6798: $? = 0
configure:6802: test -z 
                         || test ! -s conftest.err
configure:6805: $? = 0
configure:6808: test -s conftest
configure:6811: $? = 0
configure:6823: result: yes
configure:6735: checking for _mcleanup
configure:6792: arm-gp2x-linux-gcc -o conftest -g -O2    conftest.c  >&5
configure:6798: $? = 0
configure:6802: test -z 
                         || test ! -s conftest.err
configure:6805: $? = 0
configure:6808: test -s conftest
configure:6811: $? = 0
configure:6823: result: yes
configure:6833: checking for _etext
configure:6856: arm-gp2x-linux-gcc -o conftest -g -O2    conftest.c  >&5
configure:6862: $? = 0
configure:6866: test -z 
                         || test ! -s conftest.err
configure:6869: $? = 0
configure:6872: test -s conftest
configure:6875: $? = 0
configure:6887: result: yes
configure:6977: checking for gawk
configure:7006: result: no
configure:6977: checking for mawk
configure:6993: found /usr/bin/mawk
configure:7003: result: mawk
configure:7026: checking for a BSD-compatible install
configure:7081: result: /usr/bin/install -c
configure:7092: checking whether ln -s works
configure:7096: result: yes
configure:7106: checking for arm-gp2x-linux-ranlib
configure:7132: result: arm-gp2x-linux-ranlib
configure:7187: checking for bison
configure:7213: result: /home/eurotalk/arse/gdb-6.4/missing bison -y
configure:7228: checking for arm-gp2x-linux-ar
configure:7254: result: arm-gp2x-linux-ar
configure:7307: checking for arm-gp2x-linux-dlltool
configure:7333: result: arm-gp2x-linux-dlltool
configure:7386: checking for arm-gp2x-linux-windres
configure:7412: result: arm-gp2x-linux-windres
configure:7467: checking for arm-gp2x-linux-mig
configure:7496: result: no
configure:7505: checking for mig
configure:7534: result: no
configure:7550: checking for main in -lm
configure:7574: arm-gp2x-linux-gcc -o conftest -g -O2    conftest.c -lm   >&5
configure:7580: $? = 0
configure:7584: test -z 
                         || test ! -s conftest.err
configure:7587: $? = 0
configure:7590: test -s conftest
configure:7593: $? = 0
configure:7606: result: yes
configure:7622: checking for wctype
configure:7679: arm-gp2x-linux-gcc -o conftest -g -O2    conftest.c -lm  >&5
configure:7685: $? = 0
configure:7689: test -z 
                         || test ! -s conftest.err
configure:7692: $? = 0
configure:7695: test -s conftest
configure:7698: $? = 0
configure:7710: result: yes
configure:7793: checking for library containing gethostbyname
configure:7823: arm-gp2x-linux-gcc -o conftest -g -O2    conftest.c -lm  >&5
configure:7829: $? = 0
configure:7833: test -z 
                         || test ! -s conftest.err
configure:7836: $? = 0
configure:7839: test -s conftest
configure:7842: $? = 0
configure:7912: result: none required
configure:7921: checking for library containing socketpair
configure:7951: arm-gp2x-linux-gcc -o conftest -g -O2    conftest.c -lm  >&5
configure:7957: $? = 0
configure:7961: test -z 
                         || test ! -s conftest.err
configure:7964: $? = 0
configure:7967: test -s conftest
configure:7970: $? = 0
configure:8040: result: none required
configure:8057: checking for library containing waddstr
configure:8087: arm-gp2x-linux-gcc -o conftest -g -O2    conftest.c -lm  >&5
/tmp/ccM18bHd.o: In function `main':
/home/eurotalk/arse/gdb-6.4/gdb/conftest.c:69: undefined reference to `waddstr'
collect2: ld returned 1 exit status
configure:8093: $? = 1
configure: failed program was:
| /* confdefs.h.  */
| 
| #define PACKAGE_NAME ""
| #define PACKAGE_TARNAME ""
| #define PACKAGE_VERSION ""
| #define PACKAGE_STRING ""
| #define PACKAGE_BUGREPORT ""
| #define _GNU_SOURCE 1
| #define STDC_HEADERS 1
| #define HAVE_SYS_TYPES_H 1
| #define HAVE_SYS_STAT_H 1
| #define HAVE_STDLIB_H 1
| #define HAVE_STRING_H 1
| #define HAVE_MEMORY_H 1
| #define HAVE_STRINGS_H 1
| #define HAVE_INTTYPES_H 1
| #define HAVE_STDINT_H 1
| #define HAVE_UNISTD_H 1
| #define HAVE_ALLOCA_H 1
| #define HAVE_ALLOCA 1
| #define HAVE_STDLIB_H 1
| #define HAVE_UNISTD_H 1
| #define HAVE_GETPAGESIZE 1
| #define HAVE_ARGZ_H 1
| #define HAVE_LIMITS_H 1
| #define HAVE_LOCALE_H 1
| #define HAVE_NL_TYPES_H 1
| #define HAVE_MALLOC_H 1
| #define HAVE_STRING_H 1
| #define HAVE_UNISTD_H 1
| #define HAVE_VALUES_H 1
| #define HAVE_SYS_PARAM_H 1
| #define HAVE_GETCWD 1
| #define HAVE_MUNMAP 1
| #define HAVE_PUTENV 1
| #define HAVE_SETENV 1
| #define HAVE_SETLOCALE 1
| #define HAVE_STRCHR 1
| #define HAVE_STRCASECMP 1
| #define HAVE___ARGZ_COUNT 1
| #define HAVE___ARGZ_STRINGIFY 1
| #define HAVE___ARGZ_NEXT 1
| #define HAVE_STPCPY 1
| #define HAVE_STPCPY 1
| #define HAVE_LC_MESSAGES 1
| #define HAVE_GETTEXT 1
| #define HAVE_DCGETTEXT 1
| #define ENABLE_NLS 1
| #define PACKAGE "gdb"
| #define DEBUGDIR "/gp2xsdk/Tools/lib/debug"
| #define DEFAULT_BFD_ARCH bfd_arm_arch
| #define DEFAULT_BFD_VEC bfd_elf32_littlearm_vec
| #define HAVE_MONSTARTUP 1
| #define HAVE__MCLEANUP 1
| #define HAVE__ETEXT 1
| #define HAVE_LIBM 1
| /* end confdefs.h.  */
| 
| /* Override any gcc2 internal prototype to avoid an error.  */
| #ifdef __cplusplus
| extern "C"
| #endif
| /* We use char because int might match the return type of a gcc2
|    builtin and then its argument prototype would still apply.  */
| char waddstr ();
| int
| main ()
| {
| waddstr ();
|   ;
|   return 0;
| }
configure:8142: arm-gp2x-linux-gcc -o conftest -g -O2    conftest.c -lncurses  -lm  >&5
/gp2xsdk/Tools/lib/gcc/arm-gp2x-linux/3.4.6/../../../../arm-gp2x-linux/bin/ld: cannot find -lncurses
collect2: ld returned 1 exit status
configure:8148: $? = 1
configure: failed program was:
| /* confdefs.h.  */
| 
| #define PACKAGE_NAME ""
| #define PACKAGE_TARNAME ""
| #define PACKAGE_VERSION ""
| #define PACKAGE_STRING ""
| #define PACKAGE_BUGREPORT ""
| #define _GNU_SOURCE 1
| #define STDC_HEADERS 1
| #define HAVE_SYS_TYPES_H 1
| #define HAVE_SYS_STAT_H 1
| #define HAVE_STDLIB_H 1
| #define HAVE_STRING_H 1
| #define HAVE_MEMORY_H 1
| #define HAVE_STRINGS_H 1
| #define HAVE_INTTYPES_H 1
| #define HAVE_STDINT_H 1
| #define HAVE_UNISTD_H 1
| #define HAVE_ALLOCA_H 1
| #define HAVE_ALLOCA 1
| #define HAVE_STDLIB_H 1
| #define HAVE_UNISTD_H 1
| #define HAVE_GETPAGESIZE 1
| #define HAVE_ARGZ_H 1
| #define HAVE_LIMITS_H 1
| #define HAVE_LOCALE_H 1
| #define HAVE_NL_TYPES_H 1
| #define HAVE_MALLOC_H 1
| #define HAVE_STRING_H 1
| #define HAVE_UNISTD_H 1
| #define HAVE_VALUES_H 1
| #define HAVE_SYS_PARAM_H 1
| #define HAVE_GETCWD 1
| #define HAVE_MUNMAP 1
| #define HAVE_PUTENV 1
| #define HAVE_SETENV 1
| #define HAVE_SETLOCALE 1
| #define HAVE_STRCHR 1
| #define HAVE_STRCASECMP 1
| #define HAVE___ARGZ_COUNT 1
| #define HAVE___ARGZ_STRINGIFY 1
| #define HAVE___ARGZ_NEXT 1
| #define HAVE_STPCPY 1
| #define HAVE_STPCPY 1
| #define HAVE_LC_MESSAGES 1
| #define HAVE_GETTEXT 1
| #define HAVE_DCGETTEXT 1
| #define ENABLE_NLS 1
| #define PACKAGE "gdb"
| #define DEBUGDIR "/gp2xsdk/Tools/lib/debug"
| #define DEFAULT_BFD_ARCH bfd_arm_arch
| #define DEFAULT_BFD_VEC bfd_elf32_littlearm_vec
| #define HAVE_MONSTARTUP 1
| #define HAVE__MCLEANUP 1
| #define HAVE__ETEXT 1
| #define HAVE_LIBM 1
| /* end confdefs.h.  */
| 
| /* Override any gcc2 internal prototype to avoid an error.  */
| #ifdef __cplusplus
| extern "C"
| #endif
| /* We use char because int might match the return type of a gcc2
|    builtin and then its argument prototype would still apply.  */
| char waddstr ();
| int
| main ()
| {
| waddstr ();
|   ;
|   return 0;
| }
configure:8142: arm-gp2x-linux-gcc -o conftest -g -O2    conftest.c -lcursesX  -lm  >&5
/gp2xsdk/Tools/lib/gcc/arm-gp2x-linux/3.4.6/../../../../arm-gp2x-linux/bin/ld: cannot find -lcursesX
collect2: ld returned 1 exit status
configure:8148: $? = 1
configure: failed program was:
| /* confdefs.h.  */
| 
| #define PACKAGE_NAME ""
| #define PACKAGE_TARNAME ""
| #define PACKAGE_VERSION ""
| #define PACKAGE_STRING ""
| #define PACKAGE_BUGREPORT ""
| #define _GNU_SOURCE 1
| #define STDC_HEADERS 1
| #define HAVE_SYS_TYPES_H 1
| #define HAVE_SYS_STAT_H 1
| #define HAVE_STDLIB_H 1
| #define HAVE_STRING_H 1
| #define HAVE_MEMORY_H 1
| #define HAVE_STRINGS_H 1
| #define HAVE_INTTYPES_H 1
| #define HAVE_STDINT_H 1
| #define HAVE_UNISTD_H 1
| #define HAVE_ALLOCA_H 1
| #define HAVE_ALLOCA 1
| #define HAVE_STDLIB_H 1
| #define HAVE_UNISTD_H 1
| #define HAVE_GETPAGESIZE 1
| #define HAVE_ARGZ_H 1
| #define HAVE_LIMITS_H 1
| #define HAVE_LOCALE_H 1
| #define HAVE_NL_TYPES_H 1
| #define HAVE_MALLOC_H 1
| #define HAVE_STRING_H 1
| #define HAVE_UNISTD_H 1
| #define HAVE_VALUES_H 1
| #define HAVE_SYS_PARAM_H 1
| #define HAVE_GETCWD 1
| #define HAVE_MUNMAP 1
| #define HAVE_PUTENV 1
| #define HAVE_SETENV 1
| #define HAVE_SETLOCALE 1
| #define HAVE_STRCHR 1
| #define HAVE_STRCASECMP 1
| #define HAVE___ARGZ_COUNT 1
| #define HAVE___ARGZ_STRINGIFY 1
| #define HAVE___ARGZ_NEXT 1
| #define HAVE_STPCPY 1
| #define HAVE_STPCPY 1
| #define HAVE_LC_MESSAGES 1
| #define HAVE_GETTEXT 1
| #define HAVE_DCGETTEXT 1
| #define ENABLE_NLS 1
| #define PACKAGE "gdb"
| #define DEBUGDIR "/gp2xsdk/Tools/lib/debug"
| #define DEFAULT_BFD_ARCH bfd_arm_arch
| #define DEFAULT_BFD_VEC bfd_elf32_littlearm_vec
| #define HAVE_MONSTARTUP 1
| #define HAVE__MCLEANUP 1
| #define HAVE__ETEXT 1
| #define HAVE_LIBM 1
| /* end confdefs.h.  */
| 
| /* Override any gcc2 internal prototype to avoid an error.  */
| #ifdef __cplusplus
| extern "C"
| #endif
| /* We use char because int might match the return type of a gcc2
|    builtin and then its argument prototype would still apply.  */
| char waddstr ();
| int
| main ()
| {
| waddstr ();
|   ;
|   return 0;
| }
configure:8142: arm-gp2x-linux-gcc -o conftest -g -O2    conftest.c -lcurses  -lm  >&5
/gp2xsdk/Tools/lib/gcc/arm-gp2x-linux/3.4.6/../../../../arm-gp2x-linux/bin/ld: cannot find -lcurses
collect2: ld returned 1 exit status
configure:8148: $? = 1
configure: failed program was:
| /* confdefs.h.  */
| 
| #define PACKAGE_NAME ""
| #define PACKAGE_TARNAME ""
| #define PACKAGE_VERSION ""
| #define PACKAGE_STRING ""
| #define PACKAGE_BUGREPORT ""
| #define _GNU_SOURCE 1
| #define STDC_HEADERS 1
| #define HAVE_SYS_TYPES_H 1
| #define HAVE_SYS_STAT_H 1
| #define HAVE_STDLIB_H 1
| #define HAVE_STRING_H 1
| #define HAVE_MEMORY_H 1
| #define HAVE_STRINGS_H 1
| #define HAVE_INTTYPES_H 1
| #define HAVE_STDINT_H 1
| #define HAVE_UNISTD_H 1
| #define HAVE_ALLOCA_H 1
| #define HAVE_ALLOCA 1
| #define HAVE_STDLIB_H 1
| #define HAVE_UNISTD_H 1
| #define HAVE_GETPAGESIZE 1
| #define HAVE_ARGZ_H 1
| #define HAVE_LIMITS_H 1
| #define HAVE_LOCALE_H 1
| #define HAVE_NL_TYPES_H 1
| #define HAVE_MALLOC_H 1
| #define HAVE_STRING_H 1
| #define HAVE_UNISTD_H 1
| #define HAVE_VALUES_H 1
| #define HAVE_SYS_PARAM_H 1
| #define HAVE_GETCWD 1
| #define HAVE_MUNMAP 1
| #define HAVE_PUTENV 1
| #define HAVE_SETENV 1
| #define HAVE_SETLOCALE 1
| #define HAVE_STRCHR 1
| #define HAVE_STRCASECMP 1
| #define HAVE___ARGZ_COUNT 1
| #define HAVE___ARGZ_STRINGIFY 1
| #define HAVE___ARGZ_NEXT 1
| #define HAVE_STPCPY 1
| #define HAVE_STPCPY 1
| #define HAVE_LC_MESSAGES 1
| #define HAVE_GETTEXT 1
| #define HAVE_DCGETTEXT 1
| #define ENABLE_NLS 1
| #define PACKAGE "gdb"
| #define DEBUGDIR "/gp2xsdk/Tools/lib/debug"
| #define DEFAULT_BFD_ARCH bfd_arm_arch
| #define DEFAULT_BFD_VEC bfd_elf32_littlearm_vec
| #define HAVE_MONSTARTUP 1
| #define HAVE__MCLEANUP 1
| #define HAVE__ETEXT 1
| #define HAVE_LIBM 1
| /* end confdefs.h.  */
| 
| /* Override any gcc2 internal prototype to avoid an error.  */
| #ifdef __cplusplus
| extern "C"
| #endif
| /* We use char because int might match the return type of a gcc2
|    builtin and then its argument prototype would still apply.  */
| char waddstr ();
| int
| main ()
| {
| waddstr ();
|   ;
|   return 0;
| }
configure:8176: result: no
configure:8204: checking for library containing tgetent
configure:8234: arm-gp2x-linux-gcc -o conftest -g -O2    conftest.c -lm  >&5
/tmp/cceasmT1.o: In function `main':
/home/eurotalk/arse/gdb-6.4/gdb/conftest.c:69: undefined reference to `tgetent'
collect2: ld returned 1 exit status
configure:8240: $? = 1
configure: failed program was:
| /* confdefs.h.  */
| 
| #define PACKAGE_NAME ""
| #define PACKAGE_TARNAME ""
| #define PACKAGE_VERSION ""
| #define PACKAGE_STRING ""
| #define PACKAGE_BUGREPORT ""
| #define _GNU_SOURCE 1
| #define STDC_HEADERS 1
| #define HAVE_SYS_TYPES_H 1
| #define HAVE_SYS_STAT_H 1
| #define HAVE_STDLIB_H 1
| #define HAVE_STRING_H 1
| #define HAVE_MEMORY_H 1
| #define HAVE_STRINGS_H 1
| #define HAVE_INTTYPES_H 1
| #define HAVE_STDINT_H 1
| #define HAVE_UNISTD_H 1
| #define HAVE_ALLOCA_H 1
| #define HAVE_ALLOCA 1
| #define HAVE_STDLIB_H 1
| #define HAVE_UNISTD_H 1
| #define HAVE_GETPAGESIZE 1
| #define HAVE_ARGZ_H 1
| #define HAVE_LIMITS_H 1
| #define HAVE_LOCALE_H 1
| #define HAVE_NL_TYPES_H 1
| #define HAVE_MALLOC_H 1
| #define HAVE_STRING_H 1
| #define HAVE_UNISTD_H 1
| #define HAVE_VALUES_H 1
| #define HAVE_SYS_PARAM_H 1
| #define HAVE_GETCWD 1
| #define HAVE_MUNMAP 1
| #define HAVE_PUTENV 1
| #define HAVE_SETENV 1
| #define HAVE_SETLOCALE 1
| #define HAVE_STRCHR 1
| #define HAVE_STRCASECMP 1
| #define HAVE___ARGZ_COUNT 1
| #define HAVE___ARGZ_STRINGIFY 1
| #define HAVE___ARGZ_NEXT 1
| #define HAVE_STPCPY 1
| #define HAVE_STPCPY 1
| #define HAVE_LC_MESSAGES 1
| #define HAVE_GETTEXT 1
| #define HAVE_DCGETTEXT 1
| #define ENABLE_NLS 1
| #define PACKAGE "gdb"
| #define DEBUGDIR "/gp2xsdk/Tools/lib/debug"
| #define DEFAULT_BFD_ARCH bfd_arm_arch
| #define DEFAULT_BFD_VEC bfd_elf32_littlearm_vec
| #define HAVE_MONSTARTUP 1
| #define HAVE__MCLEANUP 1
| #define HAVE__ETEXT 1
| #define HAVE_LIBM 1
| /* end confdefs.h.  */
| 
| /* Override any gcc2 internal prototype to avoid an error.  */
| #ifdef __cplusplus
| extern "C"
| #endif
| /* We use char because int might match the return type of a gcc2
|    builtin and then its argument prototype would still apply.  */
| char tgetent ();
| int
| main ()
| {
| tgetent ();
|   ;
|   return 0;
| }
configure:8289: arm-gp2x-linux-gcc -o conftest -g -O2    conftest.c -ltermcap  -lm  >&5
/gp2xsdk/Tools/lib/gcc/arm-gp2x-linux/3.4.6/../../../../arm-gp2x-linux/bin/ld: cannot find -ltermcap
collect2: ld returned 1 exit status
configure:8295: $? = 1
configure: failed program was:
| /* confdefs.h.  */
| 
| #define PACKAGE_NAME ""
| #define PACKAGE_TARNAME ""
| #define PACKAGE_VERSION ""
| #define PACKAGE_STRING ""
| #define PACKAGE_BUGREPORT ""
| #define _GNU_SOURCE 1
| #define STDC_HEADERS 1
| #define HAVE_SYS_TYPES_H 1
| #define HAVE_SYS_STAT_H 1
| #define HAVE_STDLIB_H 1
| #define HAVE_STRING_H 1
| #define HAVE_MEMORY_H 1
| #define HAVE_STRINGS_H 1
| #define HAVE_INTTYPES_H 1
| #define HAVE_STDINT_H 1
| #define HAVE_UNISTD_H 1
| #define HAVE_ALLOCA_H 1
| #define HAVE_ALLOCA 1
| #define HAVE_STDLIB_H 1
| #define HAVE_UNISTD_H 1
| #define HAVE_GETPAGESIZE 1
| #define HAVE_ARGZ_H 1
| #define HAVE_LIMITS_H 1
| #define HAVE_LOCALE_H 1
| #define HAVE_NL_TYPES_H 1
| #define HAVE_MALLOC_H 1
| #define HAVE_STRING_H 1
| #define HAVE_UNISTD_H 1
| #define HAVE_VALUES_H 1
| #define HAVE_SYS_PARAM_H 1
| #define HAVE_GETCWD 1
| #define HAVE_MUNMAP 1
| #define HAVE_PUTENV 1
| #define HAVE_SETENV 1
| #define HAVE_SETLOCALE 1
| #define HAVE_STRCHR 1
| #define HAVE_STRCASECMP 1
| #define HAVE___ARGZ_COUNT 1
| #define HAVE___ARGZ_STRINGIFY 1
| #define HAVE___ARGZ_NEXT 1
| #define HAVE_STPCPY 1
| #define HAVE_STPCPY 1
| #define HAVE_LC_MESSAGES 1
| #define HAVE_GETTEXT 1
| #define HAVE_DCGETTEXT 1
| #define ENABLE_NLS 1
| #define PACKAGE "gdb"
| #define DEBUGDIR "/gp2xsdk/Tools/lib/debug"
| #define DEFAULT_BFD_ARCH bfd_arm_arch
| #define DEFAULT_BFD_VEC bfd_elf32_littlearm_vec
| #define HAVE_MONSTARTUP 1
| #define HAVE__MCLEANUP 1
| #define HAVE__ETEXT 1
| #define HAVE_LIBM 1
| /* end confdefs.h.  */
| 
| /* Override any gcc2 internal prototype to avoid an error.  */
| #ifdef __cplusplus
| extern "C"
| #endif
| /* We use char because int might match the return type of a gcc2
|    builtin and then its argument prototype would still apply.  */
| char tgetent ();
| int
| main ()
| {
| tgetent ();
|   ;
|   return 0;
| }
configure:8289: arm-gp2x-linux-gcc -o conftest -g -O2    conftest.c -ltinfo  -lm  >&5
/gp2xsdk/Tools/lib/gcc/arm-gp2x-linux/3.4.6/../../../../arm-gp2x-linux/bin/ld: cannot find -ltinfo
collect2: ld returned 1 exit status
configure:8295: $? = 1
configure: failed program was:
| /* confdefs.h.  */
| 
| #define PACKAGE_NAME ""
| #define PACKAGE_TARNAME ""
| #define PACKAGE_VERSION ""
| #define PACKAGE_STRING ""
| #define PACKAGE_BUGREPORT ""
| #define _GNU_SOURCE 1
| #define STDC_HEADERS 1
| #define HAVE_SYS_TYPES_H 1
| #define HAVE_SYS_STAT_H 1
| #define HAVE_STDLIB_H 1
| #define HAVE_STRING_H 1
| #define HAVE_MEMORY_H 1
| #define HAVE_STRINGS_H 1
| #define HAVE_INTTYPES_H 1
| #define HAVE_STDINT_H 1
| #define HAVE_UNISTD_H 1
| #define HAVE_ALLOCA_H 1
| #define HAVE_ALLOCA 1
| #define HAVE_STDLIB_H 1
| #define HAVE_UNISTD_H 1
| #define HAVE_GETPAGESIZE 1
| #define HAVE_ARGZ_H 1
| #define HAVE_LIMITS_H 1
| #define HAVE_LOCALE_H 1
| #define HAVE_NL_TYPES_H 1
| #define HAVE_MALLOC_H 1
| #define HAVE_STRING_H 1
| #define HAVE_UNISTD_H 1
| #define HAVE_VALUES_H 1
| #define HAVE_SYS_PARAM_H 1
| #define HAVE_GETCWD 1
| #define HAVE_MUNMAP 1
| #define HAVE_PUTENV 1
| #define HAVE_SETENV 1
| #define HAVE_SETLOCALE 1
| #define HAVE_STRCHR 1
| #define HAVE_STRCASECMP 1
| #define HAVE___ARGZ_COUNT 1
| #define HAVE___ARGZ_STRINGIFY 1
| #define HAVE___ARGZ_NEXT 1
| #define HAVE_STPCPY 1
| #define HAVE_STPCPY 1
| #define HAVE_LC_MESSAGES 1
| #define HAVE_GETTEXT 1
| #define HAVE_DCGETTEXT 1
| #define ENABLE_NLS 1
| #define PACKAGE "gdb"
| #define DEBUGDIR "/gp2xsdk/Tools/lib/debug"
| #define DEFAULT_BFD_ARCH bfd_arm_arch
| #define DEFAULT_BFD_VEC bfd_elf32_littlearm_vec
| #define HAVE_MONSTARTUP 1
| #define HAVE__MCLEANUP 1
| #define HAVE__ETEXT 1
| #define HAVE_LIBM 1
| /* end confdefs.h.  */
| 
| /* Override any gcc2 internal prototype to avoid an error.  */
| #ifdef __cplusplus
| extern "C"
| #endif
| /* We use char because int might match the return type of a gcc2
|    builtin and then its argument prototype would still apply.  */
| char tgetent ();
| int
| main ()
| {
| tgetent ();
|   ;
|   return 0;
| }
configure:8289: arm-gp2x-linux-gcc -o conftest -g -O2    conftest.c -lcurses  -lm  >&5
/gp2xsdk/Tools/lib/gcc/arm-gp2x-linux/3.4.6/../../../../arm-gp2x-linux/bin/ld: cannot find -lcurses
collect2: ld returned 1 exit status
configure:8295: $? = 1
configure: failed program was:
| /* confdefs.h.  */
| 
| #define PACKAGE_NAME ""
| #define PACKAGE_TARNAME ""
| #define PACKAGE_VERSION ""
| #define PACKAGE_STRING ""
| #define PACKAGE_BUGREPORT ""
| #define _GNU_SOURCE 1
| #define STDC_HEADERS 1
| #define HAVE_SYS_TYPES_H 1
| #define HAVE_SYS_STAT_H 1
| #define HAVE_STDLIB_H 1
| #define HAVE_STRING_H 1
| #define HAVE_MEMORY_H 1
| #define HAVE_STRINGS_H 1
| #define HAVE_INTTYPES_H 1
| #define HAVE_STDINT_H 1
| #define HAVE_UNISTD_H 1
| #define HAVE_ALLOCA_H 1
| #define HAVE_ALLOCA 1
| #define HAVE_STDLIB_H 1
| #define HAVE_UNISTD_H 1
| #define HAVE_GETPAGESIZE 1
| #define HAVE_ARGZ_H 1
| #define HAVE_LIMITS_H 1
| #define HAVE_LOCALE_H 1
| #define HAVE_NL_TYPES_H 1
| #define HAVE_MALLOC_H 1
| #define HAVE_STRING_H 1
| #define HAVE_UNISTD_H 1
| #define HAVE_VALUES_H 1
| #define HAVE_SYS_PARAM_H 1
| #define HAVE_GETCWD 1
| #define HAVE_MUNMAP 1
| #define HAVE_PUTENV 1
| #define HAVE_SETENV 1
| #define HAVE_SETLOCALE 1
| #define HAVE_STRCHR 1
| #define HAVE_STRCASECMP 1
| #define HAVE___ARGZ_COUNT 1
| #define HAVE___ARGZ_STRINGIFY 1
| #define HAVE___ARGZ_NEXT 1
| #define HAVE_STPCPY 1
| #define HAVE_STPCPY 1
| #define HAVE_LC_MESSAGES 1
| #define HAVE_GETTEXT 1
| #define HAVE_DCGETTEXT 1
| #define ENABLE_NLS 1
| #define PACKAGE "gdb"
| #define DEBUGDIR "/gp2xsdk/Tools/lib/debug"
| #define DEFAULT_BFD_ARCH bfd_arm_arch
| #define DEFAULT_BFD_VEC bfd_elf32_littlearm_vec
| #define HAVE_MONSTARTUP 1
| #define HAVE__MCLEANUP 1
| #define HAVE__ETEXT 1
| #define HAVE_LIBM 1
| /* end confdefs.h.  */
| 
| /* Override any gcc2 internal prototype to avoid an error.  */
| #ifdef __cplusplus
| extern "C"
| #endif
| /* We use char because int might match the return type of a gcc2
|    builtin and then its argument prototype would still apply.  */
| char tgetent ();
| int
| main ()
| {
| tgetent ();
|   ;
|   return 0;
| }
configure:8289: arm-gp2x-linux-gcc -o conftest -g -O2    conftest.c -lncurses  -lm  >&5
/gp2xsdk/Tools/lib/gcc/arm-gp2x-linux/3.4.6/../../../../arm-gp2x-linux/bin/ld: cannot find -lncurses
collect2: ld returned 1 exit status
configure:8295: $? = 1
configure: failed program was:
| /* confdefs.h.  */
| 
| #define PACKAGE_NAME ""
| #define PACKAGE_TARNAME ""
| #define PACKAGE_VERSION ""
| #define PACKAGE_STRING ""
| #define PACKAGE_BUGREPORT ""
| #define _GNU_SOURCE 1
| #define STDC_HEADERS 1
| #define HAVE_SYS_TYPES_H 1
| #define HAVE_SYS_STAT_H 1
| #define HAVE_STDLIB_H 1
| #define HAVE_STRING_H 1
| #define HAVE_MEMORY_H 1
| #define HAVE_STRINGS_H 1
| #define HAVE_INTTYPES_H 1
| #define HAVE_STDINT_H 1
| #define HAVE_UNISTD_H 1
| #define HAVE_ALLOCA_H 1
| #define HAVE_ALLOCA 1
| #define HAVE_STDLIB_H 1
| #define HAVE_UNISTD_H 1
| #define HAVE_GETPAGESIZE 1
| #define HAVE_ARGZ_H 1
| #define HAVE_LIMITS_H 1
| #define HAVE_LOCALE_H 1
| #define HAVE_NL_TYPES_H 1
| #define HAVE_MALLOC_H 1
| #define HAVE_STRING_H 1
| #define HAVE_UNISTD_H 1
| #define HAVE_VALUES_H 1
| #define HAVE_SYS_PARAM_H 1
| #define HAVE_GETCWD 1
| #define HAVE_MUNMAP 1
| #define HAVE_PUTENV 1
| #define HAVE_SETENV 1
| #define HAVE_SETLOCALE 1
| #define HAVE_STRCHR 1
| #define HAVE_STRCASECMP 1
| #define HAVE___ARGZ_COUNT 1
| #define HAVE___ARGZ_STRINGIFY 1
| #define HAVE___ARGZ_NEXT 1
| #define HAVE_STPCPY 1
| #define HAVE_STPCPY 1
| #define HAVE_LC_MESSAGES 1
| #define HAVE_GETTEXT 1
| #define HAVE_DCGETTEXT 1
| #define ENABLE_NLS 1
| #define PACKAGE "gdb"
| #define DEBUGDIR "/gp2xsdk/Tools/lib/debug"
| #define DEFAULT_BFD_ARCH bfd_arm_arch
| #define DEFAULT_BFD_VEC bfd_elf32_littlearm_vec
| #define HAVE_MONSTARTUP 1
| #define HAVE__MCLEANUP 1
| #define HAVE__ETEXT 1
| #define HAVE_LIBM 1
| /* end confdefs.h.  */
| 
| /* Override any gcc2 internal prototype to avoid an error.  */
| #ifdef __cplusplus
| extern "C"
| #endif
| /* We use char because int might match the return type of a gcc2
|    builtin and then its argument prototype would still apply.  */
| char tgetent ();
| int
| main ()
| {
| tgetent ();
|   ;
|   return 0;
| }
configure:8323: result: no
configure:8332: error: no termcap library found

## ---------------- ##
## Cache variables. ##
## ---------------- ##

ac_cv_build=i686-pc-none
ac_cv_build_alias=i686
ac_cv_c_compiler_gnu=yes
ac_cv_c_const=yes
ac_cv_c_inline=inline
ac_cv_env_CC_set=set
ac_cv_env_CC_value=arm-gp2x-linux-gcc
ac_cv_env_CFLAGS_set=set
ac_cv_env_CFLAGS_value='-g -O2 '
ac_cv_env_CPPFLAGS_set=
ac_cv_env_CPPFLAGS_value=
ac_cv_env_CPP_set=
ac_cv_env_CPP_value=
ac_cv_env_LDFLAGS_set=set
ac_cv_env_LDFLAGS_value=
ac_cv_env_build_alias_set=set
ac_cv_env_build_alias_value=i686
ac_cv_env_host_alias_set=set
ac_cv_env_host_alias_value=arm-gp2x-linux
ac_cv_env_target_alias_set=set
ac_cv_env_target_alias_value=arm-gp2x-linux
ac_cv_exeext=
ac_cv_func___argz_count=yes
ac_cv_func___argz_next=yes
ac_cv_func___argz_stringify=yes
ac_cv_func__mcleanup=yes
ac_cv_func_alloca_works=yes
ac_cv_func_dcgettext=yes
ac_cv_func_getcwd=yes
ac_cv_func_getpagesize=yes
ac_cv_func_mmap_fixed_mapped=no
ac_cv_func_monstartup=yes
ac_cv_func_munmap=yes
ac_cv_func_putenv=yes
ac_cv_func_setenv=yes
ac_cv_func_setlocale=yes
ac_cv_func_stpcpy=yes
ac_cv_func_strcasecmp=yes
ac_cv_func_strchr=yes
ac_cv_func_wctype=yes
ac_cv_header_argz_h=yes
ac_cv_header_inttypes_h=yes
ac_cv_header_libintl_h=yes
ac_cv_header_libunwind_h=no
ac_cv_header_libunwind_ia64_h=no
ac_cv_header_limits_h=yes
ac_cv_header_locale_h=yes
ac_cv_header_malloc_h=yes
ac_cv_header_memory_h=yes
ac_cv_header_nl_types_h=yes
ac_cv_header_stdc=yes
ac_cv_header_stdint_h=yes
ac_cv_header_stdlib_h=yes
ac_cv_header_string_h=yes
ac_cv_header_strings_h=yes
ac_cv_header_sys_param_h=yes
ac_cv_header_sys_stat_h=yes
ac_cv_header_sys_types_h=yes
ac_cv_header_unistd_h=yes
ac_cv_header_values_h=yes
ac_cv_host=arm-gp2x-linux-gnu
ac_cv_host_alias=arm-gp2x-linux
ac_cv_lib_m_main=yes
ac_cv_objext=o
ac_cv_path_GMSGFMT=/usr/bin/msgfmt
ac_cv_path_MSGFMT=/usr/bin/msgfmt
ac_cv_path_XGETTEXT=/usr/bin/xgettext
ac_cv_prog_AR=arm-gp2x-linux-ar
ac_cv_prog_AWK=mawk
ac_cv_prog_CC=arm-gp2x-linux-gcc
ac_cv_prog_CPP='arm-gp2x-linux-gcc -E'
ac_cv_prog_DLLTOOL=arm-gp2x-linux-dlltool
ac_cv_prog_RANLIB=arm-gp2x-linux-ranlib
ac_cv_prog_WINDRES=arm-gp2x-linux-windres
ac_cv_prog_YACC='/home/eurotalk/arse/gdb-6.4/missing bison -y'
ac_cv_prog_cc_g=yes
ac_cv_prog_cc_stdc=
ac_cv_prog_egrep='grep -E'
ac_cv_prog_make_make_set=yes
ac_cv_search_gethostbyname='none required'
ac_cv_search_socketpair='none required'
ac_cv_search_strerror='none required'
ac_cv_search_tgetent=no
ac_cv_search_waddstr=no
ac_cv_target=arm-gp2x-linux-gnu
ac_cv_target_alias=arm-gp2x-linux
ac_cv_type_off_t=yes
ac_cv_type_size_t=yes
ac_cv_var__etext=yes
ac_cv_working_alloca_h=yes
am_cv_prog_cc_stdc=
am_cv_val_LC_MESSAGES=yes
gt_cv_func_gettext_libc=yes
nls_cv_force_use_gnu_gettext=no
nls_cv_header_intl=
nls_cv_header_libgt=
nls_cv_use_gnu_gettext=no

## ----------------- ##
## Output variables. ##
## ----------------- ##

ALLOCA=''
AR='arm-gp2x-linux-ar'
AWK='mawk'
CATALOGS=''
CATOBJEXT='.gmo'
CC='arm-gp2x-linux-gcc'
CFLAGS='-g -O2 '
CONFIG_ALL=' all-po'
CONFIG_CLEAN=' clean-po'
CONFIG_DEPS=' $(SUBDIR_CLI_DEPS) $(SUBDIR_MI_DEPS)'
CONFIG_INSTALL=' install-po'
CONFIG_LDFLAGS=''
CONFIG_OBS=' $(SUBDIR_CLI_OBS) $(SUBDIR_MI_OBS)'
CONFIG_SRCS=' $(SUBDIR_CLI_SRCS) $(SUBDIR_MI_SRCS)'
CONFIG_UNINSTALL=' uninstall-po'
CPP='arm-gp2x-linux-gcc -E'
CPPFLAGS=''
DATADIRNAME='share'
DEFS=''
DLLTOOL='arm-gp2x-linux-dlltool'
ECHO_C=''
ECHO_N='-n'
ECHO_T=''
EGREP='grep -E'
ENABLE_CFLAGS=' $(SUBDIR_CLI_CFLAGS) $(SUBDIR_MI_CFLAGS)'
EXEEXT=''
GDBTKLIBS=''
GDBTK_CFLAGS=''
GDBTK_SRC_DIR=''
GMOFILES=''
GMSGFMT='/usr/bin/msgfmt'
GT_NO=''
GT_YES='#YES#'
GUI_CFLAGS_X=''
IGNORE_SIM=''
IGNORE_SIM_OBS=''
INCLUDE_LOCALE_H='#include <locale.h>'
INSTALL_DATA='/usr/bin/install -c -m 644'
INSTALL_PROGRAM='/usr/bin/install -c'
INSTALL_SCRIPT='/usr/bin/install -c'
INSTOBJEXT='.mo'
INTLDEPS=''
INTLLIBS=''
INTLOBJS=''
ITCLHDIR=''
ITCLLIB=''
ITCL_BUILD_INCLUDES=''
ITCL_BUILD_LIB_SPEC=''
ITCL_DEFS=''
ITCL_DEPS=''
ITCL_LIB_SPEC=''
ITCL_VERSION=''
ITKHDIR=''
ITKLIB=''
ITK_BUILD_INCLUDES=''
ITK_BUILD_LIB_SPEC=''
ITK_DEFS=''
ITK_DEPS=''
ITK_LIB_SPEC=''
ITK_VERSION=''
LDFLAGS=''
LIBGUI=''
LIBICONV=''
LIBOBJS=''
LIBS='-lm '
LN_S='ln -s'
LTLIBOBJS=''
MAINT='#'
MAINTAINER_MODE_FALSE=''
MAINTAINER_MODE_TRUE='#'
MIG=''
MKINSTALLDIRS='$(srcdir)/../../mkinstalldirs'
MSGFMT='/usr/bin/msgfmt'
OBJEXT='o'
PACKAGE='gdb'
PACKAGE_BUGREPORT=''
PACKAGE_NAME=''
PACKAGE_STRING=''
PACKAGE_TARNAME=''
PACKAGE_VERSION=''
PATH_SEPARATOR=':'
POFILES=''
POSUB='po'
PROFILE_CFLAGS=''
RANLIB='arm-gp2x-linux-ranlib'
SER_HARDWIRE=''
SET_MAKE=''
SHELL='/bin/sh'
TARGET_SYSTEM_ROOT=''
TARGET_SYSTEM_ROOT_DEFINE=''
TCLHDIR=''
TCL_BUILD_LIB_SPEC=''
TCL_CC=''
TCL_CC_SEARCH_FLAGS=''
TCL_COMPAT_OBJS=''
TCL_DEFS=''
TCL_DEPS=''
TCL_DL_LIBS=''
TCL_LD_FLAGS=''
TCL_LD_SEARCH_FLAGS=''
TCL_LIB_SPEC=''
TCL_LIB_VERSIONS_OK=''
TCL_MAJOR_VERSION=''
TCL_MINOR_VERSION=''
TCL_RANLIB=''
TCL_SHLIB_CFLAGS=''
TCL_SHLIB_LD=''
TCL_SHLIB_LD_LIBS=''
TCL_SHLIB_SUFFIX=''
TCL_VERSION=''
TKHDIR=''
TK_BUILD_INCLUDES=''
TK_BUILD_LIB_SPEC=''
TK_DEFS=''
TK_DEPS=''
TK_LIB_SPEC=''
TK_VERSION=''
TK_XINCLUDES=''
TK_XLIBSW=''
USE_INCLUDED_LIBINTL='no'
USE_NLS='yes'
WARN_CFLAGS=''
WERROR_CFLAGS=''
WIN32LDAPP=''
WIN32LIBS=''
WINDRES='arm-gp2x-linux-windres'
XGETTEXT='/usr/bin/xgettext'
X_CFLAGS=''
X_LDFLAGS=''
X_LIBS=''
YACC='/home/eurotalk/arse/gdb-6.4/missing bison -y'
ac_ct_AR=''
ac_ct_CC=''
ac_ct_DLLTOOL=''
ac_ct_MIG=''
ac_ct_RANLIB=''
ac_ct_WINDRES=''
bindir='${exec_prefix}/bin'
build='i686-pc-none'
build_alias='i686'
build_cpu='i686'
build_os='none'
build_vendor='pc'
datadir='${prefix}/share'
exec_prefix='${prefix}'
frags=''
host='arm-gp2x-linux-gnu'
host_alias='arm-gp2x-linux'
host_cpu='arm'
host_os='linux-gnu'
host_vendor='gp2x'
includedir='${prefix}/include'
infodir='${prefix}/info'
l=''
libdir='${exec_prefix}/lib'
libexecdir='${exec_prefix}/libexec'
localedir='${datadir}/locale'
localstatedir='${prefix}/var'
mandir='${prefix}/man'
nm_h=''
oldincludedir='/usr/include'
prefix='/gp2xsdk/Tools'
program_transform_name='s,y,y,'
sbindir='${exec_prefix}/sbin'
sharedstatedir='${prefix}/com'
subdirs=' doc testsuite'
sysconfdir='${prefix}/etc'
target='arm-gp2x-linux-gnu'
target_alias='arm-gp2x-linux'
target_cpu='arm'
target_os='linux-gnu'
target_subdir=''
target_vendor='gp2x'
tm_h=''
xm_h=''

## ------------- ##
## Output files. ##
## ------------- ##

host_makefile_frag=''
target_makefile_frag=''

## ----------- ##
## confdefs.h. ##
## ----------- ##

#define DEBUGDIR "/gp2xsdk/Tools/lib/debug"
#define DEFAULT_BFD_ARCH bfd_arm_arch
#define DEFAULT_BFD_VEC bfd_elf32_littlearm_vec
#define ENABLE_NLS 1
#define HAVE_ALLOCA 1
#define HAVE_ALLOCA_H 1
#define HAVE_ARGZ_H 1
#define HAVE_DCGETTEXT 1
#define HAVE_GETCWD 1
#define HAVE_GETPAGESIZE 1
#define HAVE_GETTEXT 1
#define HAVE_INTTYPES_H 1
#define HAVE_LC_MESSAGES 1
#define HAVE_LIBM 1
#define HAVE_LIMITS_H 1
#define HAVE_LOCALE_H 1
#define HAVE_MALLOC_H 1
#define HAVE_MEMORY_H 1
#define HAVE_MONSTARTUP 1
#define HAVE_MUNMAP 1
#define HAVE_NL_TYPES_H 1
#define HAVE_PUTENV 1
#define HAVE_SETENV 1
#define HAVE_SETLOCALE 1
#define HAVE_STDINT_H 1
#define HAVE_STDLIB_H 1
#define HAVE_STDLIB_H 1
#define HAVE_STPCPY 1
#define HAVE_STPCPY 1
#define HAVE_STRCASECMP 1
#define HAVE_STRCHR 1
#define HAVE_STRINGS_H 1
#define HAVE_STRING_H 1
#define HAVE_STRING_H 1
#define HAVE_SYS_PARAM_H 1
#define HAVE_SYS_STAT_H 1
#define HAVE_SYS_TYPES_H 1
#define HAVE_UNISTD_H 1
#define HAVE_UNISTD_H 1
#define HAVE_UNISTD_H 1
#define HAVE_VALUES_H 1
#define HAVE__ETEXT 1
#define HAVE__MCLEANUP 1
#define HAVE___ARGZ_COUNT 1
#define HAVE___ARGZ_NEXT 1
#define HAVE___ARGZ_STRINGIFY 1
#define PACKAGE "gdb"
#define PACKAGE_BUGREPORT ""
#define PACKAGE_NAME ""
#define PACKAGE_STRING ""
#define PACKAGE_TARNAME ""
#define PACKAGE_VERSION ""
#define STDC_HEADERS 1
#define _GNU_SOURCE 1

configure: exit 1