All pastes #86930 Raw Edit

Untitled

public text v1 · immutable
·published 2006-07-13 13:03 UTC
rendered paste body
This file contains any messages produced by compilers while
running configure, to aid debugging if configure makes a mistake.

It was created by configure, which was
generated by GNU Autoconf 2.59.  Invocation command line was

  $ ./configure 

## --------- ##
## Platform. ##
## --------- ##

hostname = ubersystem
uname -m = i686
uname -r = 2.6.9
uname -s = Linux
uname -v = #4 Fri Jan 28 19:48:09 UTC 2005

/usr/bin/uname -p = unknown
/bin/uname -X     = unknown

/bin/arch              = i686
/usr/bin/arch -k       = unknown
/usr/convex/getsysinfo = unknown
hostinfo               = unknown
/bin/machine           = unknown
/usr/bin/oslevel       = unknown
/bin/universe          = unknown

PATH: /bin
PATH: /usr/bin
PATH: /usr/X11/bin
PATH: /storage/apps/enlightenment/enlightenment/bin
PATH: /storage/apps/kde/bin
PATH: /opt/qt-3.3.4/bin
PATH: /opt/j2re1.4.2/bin


## ----------- ##
## Core tests. ##
## ----------- ##

configure:1571: checking for a BSD-compatible install
configure:1626: result: /bin/install -c
configure:1637: checking whether build environment is sane
configure:1680: result: yes
configure:1704: WARNING: `missing' script is too old or missing
configure:1745: checking for gawk
configure:1761: found /usr/bin/gawk
configure:1771: result: gawk
configure:1781: checking whether make sets $(MAKE)
configure:1801: result: yes
configure:2017: checking for gcc
configure:2033: found /usr/bin/gcc
configure:2043: result: gcc
configure:2287: checking for C compiler version
configure:2290: gcc --version </dev/null >&5
gcc (GCC) 3.4.2
Copyright (C) 2004 Free Software Foundation, Inc.
This is free software; see the source for copying conditions.  There is NO
warranty; not even for MERCHANTABILITY or FITNESS FOR A PARTICULAR PURPOSE.

configure:2293: $? = 0
configure:2295: gcc -v </dev/null >&5
Reading specs from /usr/lib/gcc/i686-pc-linux-gnu/3.4.2/specs
Configured with: ../gcc-3.4.2/configure --prefix=/usr --libexecdir=/usr/lib --enable-shared --enable-threads=posix --enable-__cxa_atexit --enable-clocale=gnu --enable-languages=c,c++
Thread model: posix
gcc version 3.4.2
configure:2298: $? = 0
configure:2300: gcc -V </dev/null >&5
gcc: `-V' option must have argument
configure:2303: $? = 1
configure:2326: checking for C compiler default output file name
configure:2329: gcc    conftest.c  >&5
configure:2332: $? = 0
configure:2378: result: a.out
configure:2383: checking whether the C compiler works
configure:2389: ./a.out
configure:2392: $? = 0
configure:2409: result: yes
configure:2416: checking whether we are cross compiling
configure:2418: result: no
configure:2421: checking for suffix of executables
configure:2423: gcc -o conftest    conftest.c  >&5
configure:2426: $? = 0
configure:2451: result: 
configure:2457: checking for suffix of object files
configure:2478: gcc -c   conftest.c >&5
configure:2481: $? = 0
configure:2503: result: o
configure:2507: checking whether we are using the GNU C compiler
configure:2531: gcc -c   conftest.c >&5
configure:2537: $? = 0
configure:2541: test -z 
			 || test ! -s conftest.err
configure:2544: $? = 0
configure:2547: test -s conftest.o
configure:2550: $? = 0
configure:2563: result: yes
configure:2569: checking whether gcc accepts -g
configure:2590: gcc -c -g  conftest.c >&5
configure:2596: $? = 0
configure:2600: test -z 
			 || test ! -s conftest.err
configure:2603: $? = 0
configure:2606: test -s conftest.o
configure:2609: $? = 0
configure:2620: result: yes
configure:2637: checking for gcc option to accept ANSI C
configure:2707: gcc  -c -g -O2  conftest.c >&5
configure:2713: $? = 0
configure:2717: test -z 
			 || test ! -s conftest.err
configure:2720: $? = 0
configure:2723: test -s conftest.o
configure:2726: $? = 0
configure:2744: result: none needed
configure:2762: gcc -c -g -O2  conftest.c >&5
conftest.c:2: error: parse error before "me"
configure:2768: $? = 1
configure: failed program was:
| #ifndef __cplusplus
|   choke me
| #endif
configure:2912: checking for style of include used by make
configure:2940: result: GNU
configure:2968: checking dependency style of gcc
configure:3058: result: gcc3
configure:3127: checking for g++
configure:3143: found /usr/bin/g++
configure:3153: result: g++
configure:3169: checking for C++ compiler version
configure:3172: g++ --version </dev/null >&5
g++ (GCC) 3.4.2
Copyright (C) 2004 Free Software Foundation, Inc.
This is free software; see the source for copying conditions.  There is NO
warranty; not even for MERCHANTABILITY or FITNESS FOR A PARTICULAR PURPOSE.

configure:3175: $? = 0
configure:3177: g++ -v </dev/null >&5
Reading specs from /usr/lib/gcc/i686-pc-linux-gnu/3.4.2/specs
Configured with: ../gcc-3.4.2/configure --prefix=/usr --libexecdir=/usr/lib --enable-shared --enable-threads=posix --enable-__cxa_atexit --enable-clocale=gnu --enable-languages=c,c++
Thread model: posix
gcc version 3.4.2
configure:3180: $? = 0
configure:3182: g++ -V </dev/null >&5
g++: `-V' option must have argument
configure:3185: $? = 1
configure:3188: checking whether we are using the GNU C++ compiler
configure:3212: g++ -c -I/usr/include/X11/  conftest.cc >&5
configure:3218: $? = 0
configure:3222: test -z 
			 || test ! -s conftest.err
configure:3225: $? = 0
configure:3228: test -s conftest.o
configure:3231: $? = 0
configure:3244: result: yes
configure:3250: checking whether g++ accepts -g
configure:3271: g++ -c -g  conftest.cc >&5
configure:3277: $? = 0
configure:3281: test -z 
			 || test ! -s conftest.err
configure:3284: $? = 0
configure:3287: test -s conftest.o
configure:3290: $? = 0
configure:3301: result: yes
configure:3343: g++ -c -I/usr/include/X11/  conftest.cc >&5
configure:3349: $? = 0
configure:3353: test -z 
			 || test ! -s conftest.err
configure:3356: $? = 0
configure:3359: test -s conftest.o
configure:3362: $? = 0
configure:3388: g++ -c -I/usr/include/X11/  conftest.cc >&5
conftest.cc: In function `int main()':
conftest.cc:13: error: `exit' undeclared (first use this function)
conftest.cc:13: error: (Each undeclared identifier is reported only once for each function it appears in.)
configure:3394: $? = 1
configure: failed program was:
| /* confdefs.h.  */
| 
| #define PACKAGE_NAME ""
| #define PACKAGE_TARNAME ""
| #define PACKAGE_VERSION ""
| #define PACKAGE_STRING ""
| #define PACKAGE_BUGREPORT ""
| /* end confdefs.h.  */
| 
| int
| main ()
| {
| exit (42);
|   ;
|   return 0;
| }
configure:3343: g++ -c -I/usr/include/X11/  conftest.cc >&5
configure:3349: $? = 0
configure:3353: test -z 
			 || test ! -s conftest.err
configure:3356: $? = 0
configure:3359: test -s conftest.o
configure:3362: $? = 0
configure:3388: g++ -c -I/usr/include/X11/  conftest.cc >&5
configure:3394: $? = 0
configure:3398: test -z 
			 || test ! -s conftest.err
configure:3401: $? = 0
configure:3404: test -s conftest.o
configure:3407: $? = 0
configure:3432: checking dependency style of g++
configure:3522: result: gcc3
configure:3552: checking for a BSD-compatible install
configure:3607: result: /bin/install -c
configure:3696: checking build system type
configure:3714: result: i686-pc-linux-gnu
configure:3722: checking host system type
configure:3736: result: i686-pc-linux-gnu
configure:3744: checking for a sed that does not truncate output
configure:3798: result: /bin/sed
configure:3801: checking for egrep
configure:3811: result: grep -E
configure:3827: checking for ld used by gcc
configure:3894: result: /usr/i686-pc-linux-gnu/bin/ld
configure:3903: checking if the linker (/usr/i686-pc-linux-gnu/bin/ld) is GNU ld
configure:3918: result: yes
configure:3923: checking for /usr/i686-pc-linux-gnu/bin/ld option to reload object files
configure:3930: result: -r
configure:3948: checking for BSD-compatible nm
configure:3997: result: /usr/bin/nm -B
configure:4001: checking whether ln -s works
configure:4005: result: yes
configure:4012: checking how to recognise dependent libraries
configure:4188: result: pass_all
configure:4425: checking how to run the C preprocessor
configure:4460: gcc -E  conftest.c
configure:4466: $? = 0
configure:4498: gcc -E  conftest.c
conftest.c:12:28: ac_nonexistent.h: No such file or directory
configure:4504: $? = 1
configure: failed program was:
| /* confdefs.h.  */
| 
| #define PACKAGE_NAME ""
| #define PACKAGE_TARNAME ""
| #define PACKAGE_VERSION ""
| #define PACKAGE_STRING ""
| #define PACKAGE_BUGREPORT ""
| #ifdef __cplusplus
| extern "C" void std::exit (int) throw (); using std::exit;
| #endif
| /* end confdefs.h.  */
| #include <ac_nonexistent.h>
configure:4543: result: gcc -E
configure:4567: gcc -E  conftest.c
configure:4573: $? = 0
configure:4605: gcc -E  conftest.c
conftest.c:12:28: ac_nonexistent.h: No such file or directory
configure:4611: $? = 1
configure: failed program was:
| /* confdefs.h.  */
| 
| #define PACKAGE_NAME ""
| #define PACKAGE_TARNAME ""
| #define PACKAGE_VERSION ""
| #define PACKAGE_STRING ""
| #define PACKAGE_BUGREPORT ""
| #ifdef __cplusplus
| extern "C" void std::exit (int) throw (); using std::exit;
| #endif
| /* end confdefs.h.  */
| #include <ac_nonexistent.h>
configure:4655: checking for ANSI C header files
configure:4680: gcc -c -g -O2  conftest.c >&5
configure:4686: $? = 0
configure:4690: test -z 
			 || test ! -s conftest.err
configure:4693: $? = 0
configure:4696: test -s conftest.o
configure:4699: $? = 0
configure:4788: gcc -o conftest -g -O2   conftest.c  >&5
configure:4791: $? = 0
configure:4793: ./conftest
configure:4796: $? = 0
configure:4811: result: yes
configure:4835: checking for sys/types.h
configure:4851: gcc -c -g -O2  conftest.c >&5
configure:4857: $? = 0
configure:4861: test -z 
			 || test ! -s conftest.err
configure:4864: $? = 0
configure:4867: test -s conftest.o
configure:4870: $? = 0
configure:4881: result: yes
configure:4835: checking for sys/stat.h
configure:4851: gcc -c -g -O2  conftest.c >&5
configure:4857: $? = 0
configure:4861: test -z 
			 || test ! -s conftest.err
configure:4864: $? = 0
configure:4867: test -s conftest.o
configure:4870: $? = 0
configure:4881: result: yes
configure:4835: checking for stdlib.h
configure:4851: gcc -c -g -O2  conftest.c >&5
configure:4857: $? = 0
configure:4861: test -z 
			 || test ! -s conftest.err
configure:4864: $? = 0
configure:4867: test -s conftest.o
configure:4870: $? = 0
configure:4881: result: yes
configure:4835: checking for string.h
configure:4851: gcc -c -g -O2  conftest.c >&5
configure:4857: $? = 0
configure:4861: test -z 
			 || test ! -s conftest.err
configure:4864: $? = 0
configure:4867: test -s conftest.o
configure:4870: $? = 0
configure:4881: result: yes
configure:4835: checking for memory.h
configure:4851: gcc -c -g -O2  conftest.c >&5
configure:4857: $? = 0
configure:4861: test -z 
			 || test ! -s conftest.err
configure:4864: $? = 0
configure:4867: test -s conftest.o
configure:4870: $? = 0
configure:4881: result: yes
configure:4835: checking for strings.h
configure:4851: gcc -c -g -O2  conftest.c >&5
configure:4857: $? = 0
configure:4861: test -z 
			 || test ! -s conftest.err
configure:4864: $? = 0
configure:4867: test -s conftest.o
configure:4870: $? = 0
configure:4881: result: yes
configure:4835: checking for inttypes.h
configure:4851: gcc -c -g -O2  conftest.c >&5
configure:4857: $? = 0
configure:4861: test -z 
			 || test ! -s conftest.err
configure:4864: $? = 0
configure:4867: test -s conftest.o
configure:4870: $? = 0
configure:4881: result: yes
configure:4835: checking for stdint.h
configure:4851: gcc -c -g -O2  conftest.c >&5
configure:4857: $? = 0
configure:4861: test -z 
			 || test ! -s conftest.err
configure:4864: $? = 0
configure:4867: test -s conftest.o
configure:4870: $? = 0
configure:4881: result: yes
configure:4835: checking for unistd.h
configure:4851: gcc -c -g -O2  conftest.c >&5
configure:4857: $? = 0
configure:4861: test -z 
			 || test ! -s conftest.err
configure:4864: $? = 0
configure:4867: test -s conftest.o
configure:4870: $? = 0
configure:4881: result: yes
configure:4907: checking dlfcn.h usability
configure:4919: gcc -c -g -O2  conftest.c >&5
configure:4925: $? = 0
configure:4929: test -z 
			 || test ! -s conftest.err
configure:4932: $? = 0
configure:4935: test -s conftest.o
configure:4938: $? = 0
configure:4948: result: yes
configure:4952: checking dlfcn.h presence
configure:4962: gcc -E  conftest.c
configure:4968: $? = 0
configure:4988: result: yes
configure:5023: checking for dlfcn.h
configure:5030: result: yes
configure:5053: checking how to run the C++ preprocessor
configure:5084: g++ -E  conftest.cc
configure:5090: $? = 0
configure:5122: g++ -E  conftest.cc
conftest.cc:23:28: ac_nonexistent.h: No such file or directory
configure:5128: $? = 1
configure: failed program was:
| /* confdefs.h.  */
| 
| #define PACKAGE_NAME ""
| #define PACKAGE_TARNAME ""
| #define PACKAGE_VERSION ""
| #define PACKAGE_STRING ""
| #define PACKAGE_BUGREPORT ""
| #ifdef __cplusplus
| extern "C" void std::exit (int) throw (); using std::exit;
| #endif
| #define STDC_HEADERS 1
| #define HAVE_SYS_TYPES_H 1
| #define HAVE_SYS_STAT_H 1
| #define HAVE_STDLIB_H 1
| #define HAVE_STRING_H 1
| #define HAVE_MEMORY_H 1
| #define HAVE_STRINGS_H 1
| #define HAVE_INTTYPES_H 1
| #define HAVE_STDINT_H 1
| #define HAVE_UNISTD_H 1
| #define HAVE_DLFCN_H 1
| /* end confdefs.h.  */
| #include <ac_nonexistent.h>
configure:5167: result: g++ -E
configure:5191: g++ -E  conftest.cc
configure:5197: $? = 0
configure:5229: g++ -E  conftest.cc
conftest.cc:23:28: ac_nonexistent.h: No such file or directory
configure:5235: $? = 1
configure: failed program was:
| /* confdefs.h.  */
| 
| #define PACKAGE_NAME ""
| #define PACKAGE_TARNAME ""
| #define PACKAGE_VERSION ""
| #define PACKAGE_STRING ""
| #define PACKAGE_BUGREPORT ""
| #ifdef __cplusplus
| extern "C" void std::exit (int) throw (); using std::exit;
| #endif
| #define STDC_HEADERS 1
| #define HAVE_SYS_TYPES_H 1
| #define HAVE_SYS_STAT_H 1
| #define HAVE_STDLIB_H 1
| #define HAVE_STRING_H 1
| #define HAVE_MEMORY_H 1
| #define HAVE_STRINGS_H 1
| #define HAVE_INTTYPES_H 1
| #define HAVE_STDINT_H 1
| #define HAVE_UNISTD_H 1
| #define HAVE_DLFCN_H 1
| /* end confdefs.h.  */
| #include <ac_nonexistent.h>
configure:5332: checking for g77
configure:5361: result: no
configure:5332: checking for f77
configure:5361: result: no
configure:5332: checking for xlf
configure:5361: result: no
configure:5332: checking for frt
configure:5361: result: no
configure:5332: checking for pgf77
configure:5361: result: no
configure:5332: checking for fort77
configure:5361: result: no
configure:5332: checking for fl32
configure:5361: result: no
configure:5332: checking for af77
configure:5361: result: no
configure:5332: checking for f90
configure:5361: result: no
configure:5332: checking for xlf90
configure:5361: result: no
configure:5332: checking for pgf90
configure:5361: result: no
configure:5332: checking for epcf90
configure:5361: result: no
configure:5332: checking for f95
configure:5361: result: no
configure:5332: checking for fort
configure:5361: result: no
configure:5332: checking for xlf95
configure:5361: result: no
configure:5332: checking for ifc
configure:5361: result: no
configure:5332: checking for efc
configure:5361: result: no
configure:5332: checking for pgf95
configure:5361: result: no
configure:5332: checking for lf95
configure:5361: result: no
configure:5332: checking for gfortran
configure:5361: result: no
configure:5373: checking for Fortran 77 compiler version
configure:5376:  --version </dev/null >&5
./configure: line 5377: --version: command not found
configure:5379: $? = 127
configure:5381:  -v </dev/null >&5
./configure: line 5382: -v: command not found
configure:5384: $? = 127
configure:5386:  -V </dev/null >&5
./configure: line 5387: -V: command not found
configure:5389: $? = 127
configure:5397: checking whether we are using the GNU Fortran 77 compiler
configure:5411:  -c  conftest.F >&5
./configure: line 5412: -c: command not found
configure:5417: $? = 127
configure: failed program was:
|       program main
| #ifndef __GNUC__
|        choke me
| #endif
| 
|       end
configure:5443: result: no
configure:5449: checking whether  accepts -g
configure:5461:  -c -g conftest.f >&5
./configure: line 5462: -c: command not found
configure:5467: $? = 127
configure: failed program was:
|       program main
| 
|       end
configure:5492: result: no
configure:5522: checking the maximum length of command line arguments
configure:5631: result: 32768
configure:5642: checking command to parse /usr/bin/nm -B output from gcc object
configure:5747: g++ -c -I/usr/include/X11/  conftest.cc >&5
configure:5750: $? = 0
configure:5754: /usr/bin/nm -B conftest.o \| sed -n -e 's/^.*[ 	]\([ABCDGIRSTW][ABCDGIRSTW]*\)[ 	][ 	]*\([_A-Za-z][_A-Za-z0-9]*\)$/\1 \2 \2/p' \> conftest.nm
configure:5757: $? = 0
configure:5809: g++ -o conftest -I/usr/include/X11/   conftest.cc conftstm.o >&5
configure:5812: $? = 0
configure:5850: result: ok
configure:5854: checking for objdir
configure:5869: result: .libs
configure:5959: checking for ar
configure:5975: found /usr/bin/ar
configure:5986: result: ar
configure:6039: checking for ranlib
configure:6055: found /usr/bin/ranlib
configure:6066: result: ranlib
configure:6119: checking for strip
configure:6135: found /usr/bin/strip
configure:6146: result: strip
configure:6369: checking for correct ltmain.sh version
configure:6419: result: yes
configure:6479: checking if gcc supports -fno-rtti -fno-exceptions
configure:6497: gcc -c -g -O2  -fno-rtti -fno-exceptions conftest.c >&5
cc1: warning: command line option "-fno-rtti" is valid for C++/ObjC++ but not for C
configure:6501: $? = 0
configure:6514: result: no
configure:6529: checking for gcc option to produce PIC
configure:6739: result: -fPIC
configure:6747: checking if gcc PIC flag -fPIC works
configure:6765: gcc -c -g -O2  -fPIC -DPIC conftest.c >&5
configure:6769: $? = 0
configure:6782: result: yes
configure:6810: checking if gcc static flag -static works
configure:6838: result: yes
configure:6848: checking if gcc supports -c -o file.o
configure:6869: gcc -c -g -O2  -o out/conftest2.o conftest.c >&5
configure:6873: $? = 0
configure:6895: result: yes
configure:6921: checking whether the gcc linker (/usr/i686-pc-linux-gnu/bin/ld) supports shared libraries
configure:7879: result: yes
configure:7900: checking whether -lc should be explicitly linked in
configure:7905: gcc -c -g -O2  conftest.c >&5
configure:7908: $? = 0
configure:7923: gcc -shared conftest.o  -v -Wl,-soname -Wl,conftest -o conftest 2\>\&1 \| grep  -lc  \>/dev/null 2\>\&1
configure:7926: $? = 0
configure:7938: result: no
configure:7946: checking dynamic linker characteristics
configure:8571: result: GNU/Linux ld.so
configure:8580: checking how to hardcode library paths into programs
configure:8605: result: immediate
configure:8619: checking whether stripping libraries is possible
configure:8624: result: yes
configure:9458: checking if libtool supports shared libraries
configure:9460: result: yes
configure:9463: checking whether to build shared libraries
configure:9484: result: yes
configure:9487: checking whether to build static libraries
configure:9491: result: yes
configure:9583: creating libtool
configure:10171: checking for ld used by g++
configure:10238: result: /usr/i686-pc-linux-gnu/bin/ld
configure:10247: checking if the linker (/usr/i686-pc-linux-gnu/bin/ld) is GNU ld
configure:10262: result: yes
configure:10313: checking whether the g++ linker (/usr/i686-pc-linux-gnu/bin/ld) supports shared libraries
configure:11251: result: yes
configure:11269: g++ -c -I/usr/include/X11/  conftest.cpp >&5
configure:11272: $? = 0
configure:11391: checking for g++ option to produce PIC
configure:11665: result: -fPIC
configure:11673: checking if g++ PIC flag -fPIC works
configure:11691: g++ -c -I/usr/include/X11/  -fPIC -DPIC conftest.cpp >&5
configure:11695: $? = 0
configure:11708: result: yes
configure:11736: checking if g++ static flag -static works
configure:11764: result: yes
configure:11774: checking if g++ supports -c -o file.o
configure:11795: g++ -c -I/usr/include/X11/  -o out/conftest2.o conftest.cpp >&5
configure:11799: $? = 0
configure:11821: result: yes
configure:11847: checking whether the g++ linker (/usr/i686-pc-linux-gnu/bin/ld) supports shared libraries
configure:11872: result: yes
configure:11939: checking dynamic linker characteristics
configure:12564: result: GNU/Linux ld.so
configure:12573: checking how to hardcode library paths into programs
configure:12598: result: immediate
configure:18827: checking for sed
configure:18843: found /bin/sed
configure:18853: result: sed
configure:18870: checking for ANSI C header files
configure:19026: result: yes
configure:19075: checking errno.h usability
configure:19087: g++ -c -I/usr/include/X11/  conftest.cc >&5
configure:19093: $? = 0
configure:19097: test -z 
			 || test ! -s conftest.err
configure:19100: $? = 0
configure:19103: test -s conftest.o
configure:19106: $? = 0
configure:19116: result: yes
configure:19120: checking errno.h presence
configure:19130: g++ -E  conftest.cc
configure:19136: $? = 0
configure:19156: result: yes
configure:19191: checking for errno.h
configure:19198: result: yes
configure:19075: checking ctype.h usability
configure:19087: g++ -c -I/usr/include/X11/  conftest.cc >&5
configure:19093: $? = 0
configure:19097: test -z 
			 || test ! -s conftest.err
configure:19100: $? = 0
configure:19103: test -s conftest.o
configure:19106: $? = 0
configure:19116: result: yes
configure:19120: checking ctype.h presence
configure:19130: g++ -E  conftest.cc
configure:19136: $? = 0
configure:19156: result: yes
configure:19191: checking for ctype.h
configure:19198: result: yes
configure:19075: checking dirent.h usability
configure:19087: g++ -c -I/usr/include/X11/  conftest.cc >&5
configure:19093: $? = 0
configure:19097: test -z 
			 || test ! -s conftest.err
configure:19100: $? = 0
configure:19103: test -s conftest.o
configure:19106: $? = 0
configure:19116: result: yes
configure:19120: checking dirent.h presence
configure:19130: g++ -E  conftest.cc
configure:19136: $? = 0
configure:19156: result: yes
configure:19191: checking for dirent.h
configure:19198: result: yes
configure:19075: checking fcntl.h usability
configure:19087: g++ -c -I/usr/include/X11/  conftest.cc >&5
configure:19093: $? = 0
configure:19097: test -z 
			 || test ! -s conftest.err
configure:19100: $? = 0
configure:19103: test -s conftest.o
configure:19106: $? = 0
configure:19116: result: yes
configure:19120: checking fcntl.h presence
configure:19130: g++ -E  conftest.cc
configure:19136: $? = 0
configure:19156: result: yes
configure:19191: checking for fcntl.h
configure:19198: result: yes
configure:19075: checking libgen.h usability
configure:19087: g++ -c -I/usr/include/X11/  conftest.cc >&5
configure:19093: $? = 0
configure:19097: test -z 
			 || test ! -s conftest.err
configure:19100: $? = 0
configure:19103: test -s conftest.o
configure:19106: $? = 0
configure:19116: result: yes
configure:19120: checking libgen.h presence
configure:19130: g++ -E  conftest.cc
configure:19136: $? = 0
configure:19156: result: yes
configure:19191: checking for libgen.h
configure:19198: result: yes
configure:19075: checking locale.h usability
configure:19087: g++ -c -I/usr/include/X11/  conftest.cc >&5
configure:19093: $? = 0
configure:19097: test -z 
			 || test ! -s conftest.err
configure:19100: $? = 0
configure:19103: test -s conftest.o
configure:19106: $? = 0
configure:19116: result: yes
configure:19120: checking locale.h presence
configure:19130: g++ -E  conftest.cc
configure:19136: $? = 0
configure:19156: result: yes
configure:19191: checking for locale.h
configure:19198: result: yes
configure:19075: checking nl_types.h usability
configure:19087: g++ -c -I/usr/include/X11/  conftest.cc >&5
configure:19093: $? = 0
configure:19097: test -z 
			 || test ! -s conftest.err
configure:19100: $? = 0
configure:19103: test -s conftest.o
configure:19106: $? = 0
configure:19116: result: yes
configure:19120: checking nl_types.h presence
configure:19130: g++ -E  conftest.cc
configure:19136: $? = 0
configure:19156: result: yes
configure:19191: checking for nl_types.h
configure:19198: result: yes
configure:19075: checking process.h usability
configure:19087: g++ -c -I/usr/include/X11/  conftest.cc >&5
conftest.cc:65:21: process.h: No such file or directory
configure:19093: $? = 1
configure: failed program was:
| /* confdefs.h.  */
| 
| #define PACKAGE_NAME ""
| #define PACKAGE_TARNAME ""
| #define PACKAGE_VERSION ""
| #define PACKAGE_STRING ""
| #define PACKAGE_BUGREPORT ""
| #ifdef __cplusplus
| extern "C" void std::exit (int) throw (); using std::exit;
| #endif
| #define STDC_HEADERS 1
| #define HAVE_SYS_TYPES_H 1
| #define HAVE_SYS_STAT_H 1
| #define HAVE_STDLIB_H 1
| #define HAVE_STRING_H 1
| #define HAVE_MEMORY_H 1
| #define HAVE_STRINGS_H 1
| #define HAVE_INTTYPES_H 1
| #define HAVE_STDINT_H 1
| #define HAVE_UNISTD_H 1
| #define HAVE_DLFCN_H 1
| #define STDC_HEADERS 1
| #define HAVE_ERRNO_H 1
| #define HAVE_CTYPE_H 1
| #define HAVE_DIRENT_H 1
| #define HAVE_FCNTL_H 1
| #define HAVE_LIBGEN_H 1
| #define HAVE_LOCALE_H 1
| #define HAVE_NL_TYPES_H 1
| /* end confdefs.h.  */
| #include <stdio.h>
| #if HAVE_SYS_TYPES_H
| # include <sys/types.h>
| #endif
| #if HAVE_SYS_STAT_H
| # include <sys/stat.h>
| #endif
| #if STDC_HEADERS
| # include <stdlib.h>
| # include <stddef.h>
| #else
| # if HAVE_STDLIB_H
| #  include <stdlib.h>
| # endif
| #endif
| #if HAVE_STRING_H
| # if !STDC_HEADERS && HAVE_MEMORY_H
| #  include <memory.h>
| # endif
| # include <string.h>
| #endif
| #if HAVE_STRINGS_H
| # include <strings.h>
| #endif
| #if HAVE_INTTYPES_H
| # include <inttypes.h>
| #else
| # if HAVE_STDINT_H
| #  include <stdint.h>
| # endif
| #endif
| #if HAVE_UNISTD_H
| # include <unistd.h>
| #endif
| #include <process.h>
configure:19116: result: no
configure:19120: checking process.h presence
configure:19130: g++ -E  conftest.cc
conftest.cc:31:21: process.h: No such file or directory
configure:19136: $? = 1
configure: failed program was:
| /* confdefs.h.  */
| 
| #define PACKAGE_NAME ""
| #define PACKAGE_TARNAME ""
| #define PACKAGE_VERSION ""
| #define PACKAGE_STRING ""
| #define PACKAGE_BUGREPORT ""
| #ifdef __cplusplus
| extern "C" void std::exit (int) throw (); using std::exit;
| #endif
| #define STDC_HEADERS 1
| #define HAVE_SYS_TYPES_H 1
| #define HAVE_SYS_STAT_H 1
| #define HAVE_STDLIB_H 1
| #define HAVE_STRING_H 1
| #define HAVE_MEMORY_H 1
| #define HAVE_STRINGS_H 1
| #define HAVE_INTTYPES_H 1
| #define HAVE_STDINT_H 1
| #define HAVE_UNISTD_H 1
| #define HAVE_DLFCN_H 1
| #define STDC_HEADERS 1
| #define HAVE_ERRNO_H 1
| #define HAVE_CTYPE_H 1
| #define HAVE_DIRENT_H 1
| #define HAVE_FCNTL_H 1
| #define HAVE_LIBGEN_H 1
| #define HAVE_LOCALE_H 1
| #define HAVE_NL_TYPES_H 1
| /* end confdefs.h.  */
| #include <process.h>
configure:19156: result: no
configure:19191: checking for process.h
configure:19198: result: no
configure:19075: checking signal.h usability
configure:19087: g++ -c -I/usr/include/X11/  conftest.cc >&5
configure:19093: $? = 0
configure:19097: test -z 
			 || test ! -s conftest.err
configure:19100: $? = 0
configure:19103: test -s conftest.o
configure:19106: $? = 0
configure:19116: result: yes
configure:19120: checking signal.h presence
configure:19130: g++ -E  conftest.cc
configure:19136: $? = 0
configure:19156: result: yes
configure:19191: checking for signal.h
configure:19198: result: yes
configure:19075: checking stdarg.h usability
configure:19087: g++ -c -I/usr/include/X11/  conftest.cc >&5
configure:19093: $? = 0
configure:19097: test -z 
			 || test ! -s conftest.err
configure:19100: $? = 0
configure:19103: test -s conftest.o
configure:19106: $? = 0
configure:19116: result: yes
configure:19120: checking stdarg.h presence
configure:19130: g++ -E  conftest.cc
configure:19136: $? = 0
configure:19156: result: yes
configure:19191: checking for stdarg.h
configure:19198: result: yes
configure:19075: checking stdio.h usability
configure:19087: g++ -c -I/usr/include/X11/  conftest.cc >&5
configure:19093: $? = 0
configure:19097: test -z 
			 || test ! -s conftest.err
configure:19100: $? = 0
configure:19103: test -s conftest.o
configure:19106: $? = 0
configure:19116: result: yes
configure:19120: checking stdio.h presence
configure:19130: g++ -E  conftest.cc
configure:19136: $? = 0
configure:19156: result: yes
configure:19191: checking for stdio.h
configure:19198: result: yes
configure:19075: checking time.h usability
configure:19087: g++ -c -I/usr/include/X11/  conftest.cc >&5
configure:19093: $? = 0
configure:19097: test -z 
			 || test ! -s conftest.err
configure:19100: $? = 0
configure:19103: test -s conftest.o
configure:19106: $? = 0
configure:19116: result: yes
configure:19120: checking time.h presence
configure:19130: g++ -E  conftest.cc
configure:19136: $? = 0
configure:19156: result: yes
configure:19191: checking for time.h
configure:19198: result: yes
configure:19066: checking for unistd.h
configure:19071: result: yes
configure:19075: checking sys/param.h usability
configure:19087: g++ -c -I/usr/include/X11/  conftest.cc >&5
configure:19093: $? = 0
configure:19097: test -z 
			 || test ! -s conftest.err
configure:19100: $? = 0
configure:19103: test -s conftest.o
configure:19106: $? = 0
configure:19116: result: yes
configure:19120: checking sys/param.h presence
configure:19130: g++ -E  conftest.cc
configure:19136: $? = 0
configure:19156: result: yes
configure:19191: checking for sys/param.h
configure:19198: result: yes
configure:19075: checking sys/select.h usability
configure:19087: g++ -c -I/usr/include/X11/  conftest.cc >&5
configure:19093: $? = 0
configure:19097: test -z 
			 || test ! -s conftest.err
configure:19100: $? = 0
configure:19103: test -s conftest.o
configure:19106: $? = 0
configure:19116: result: yes
configure:19120: checking sys/select.h presence
configure:19130: g++ -E  conftest.cc
configure:19136: $? = 0
configure:19156: result: yes
configure:19191: checking for sys/select.h
configure:19198: result: yes
configure:19075: checking sys/signal.h usability
configure:19087: g++ -c -I/usr/include/X11/  conftest.cc >&5
configure:19093: $? = 0
configure:19097: test -z 
			 || test ! -s conftest.err
configure:19100: $? = 0
configure:19103: test -s conftest.o
configure:19106: $? = 0
configure:19116: result: yes
configure:19120: checking sys/signal.h presence
configure:19130: g++ -E  conftest.cc
configure:19136: $? = 0
configure:19156: result: yes
configure:19191: checking for sys/signal.h
configure:19198: result: yes
configure:19066: checking for sys/stat.h
configure:19071: result: yes
configure:19075: checking sys/time.h usability
configure:19087: g++ -c -I/usr/include/X11/  conftest.cc >&5
configure:19093: $? = 0
configure:19097: test -z 
			 || test ! -s conftest.err
configure:19100: $? = 0
configure:19103: test -s conftest.o
configure:19106: $? = 0
configure:19116: result: yes
configure:19120: checking sys/time.h presence
configure:19130: g++ -E  conftest.cc
configure:19136: $? = 0
configure:19156: result: yes
configure:19191: checking for sys/time.h
configure:19198: result: yes
configure:19066: checking for sys/types.h
configure:19071: result: yes
configure:19075: checking sys/wait.h usability
configure:19087: g++ -c -I/usr/include/X11/  conftest.cc >&5
configure:19093: $? = 0
configure:19097: test -z 
			 || test ! -s conftest.err
configure:19100: $? = 0
configure:19103: test -s conftest.o
configure:19106: $? = 0
configure:19116: result: yes
configure:19120: checking sys/wait.h presence
configure:19130: g++ -E  conftest.cc
configure:19136: $? = 0
configure:19156: result: yes
configure:19191: checking for sys/wait.h
configure:19198: result: yes
configure:19075: checking iconv.h usability
configure:19087: g++ -c -I/usr/include/X11/  conftest.cc >&5
configure:19093: $? = 0
configure:19097: test -z 
			 || test ! -s conftest.err
configure:19100: $? = 0
configure:19103: test -s conftest.o
configure:19106: $? = 0
configure:19116: result: yes
configure:19120: checking iconv.h presence
configure:19130: g++ -E  conftest.cc
configure:19136: $? = 0
configure:19156: result: yes
configure:19191: checking for iconv.h
configure:19198: result: yes
configure:19226: checking sstream usability
configure:19238: g++ -c -I/usr/include/X11/  conftest.cc >&5
configure:19244: $? = 0
configure:19248: test -z 
			 || test ! -s conftest.err
configure:19251: $? = 0
configure:19254: test -s conftest.o
configure:19257: $? = 0
configure:19267: result: yes
configure:19271: checking sstream presence
configure:19281: g++ -E  conftest.cc
configure:19287: $? = 0
configure:19307: result: yes
configure:19342: checking for sstream
configure:19349: result: yes
configure:19542: checking cassert usability
configure:19554: g++ -c -I/usr/include/X11/  conftest.cc >&5
configure:19560: $? = 0
configure:19564: test -z 
			 || test ! -s conftest.err
configure:19567: $? = 0
configure:19570: test -s conftest.o
configure:19573: $? = 0
configure:19583: result: yes
configure:19587: checking cassert presence
configure:19597: g++ -E  conftest.cc
configure:19603: $? = 0
configure:19623: result: yes
configure:19658: checking for cassert
configure:19665: result: yes
configure:19542: checking cctype usability
configure:19554: g++ -c -I/usr/include/X11/  conftest.cc >&5
configure:19560: $? = 0
configure:19564: test -z 
			 || test ! -s conftest.err
configure:19567: $? = 0
configure:19570: test -s conftest.o
configure:19573: $? = 0
configure:19583: result: yes
configure:19587: checking cctype presence
configure:19597: g++ -E  conftest.cc
configure:19603: $? = 0
configure:19623: result: yes
configure:19658: checking for cctype
configure:19665: result: yes
configure:19542: checking cerrno usability
configure:19554: g++ -c -I/usr/include/X11/  conftest.cc >&5
configure:19560: $? = 0
configure:19564: test -z 
			 || test ! -s conftest.err
configure:19567: $? = 0
configure:19570: test -s conftest.o
configure:19573: $? = 0
configure:19583: result: yes
configure:19587: checking cerrno presence
configure:19597: g++ -E  conftest.cc
configure:19603: $? = 0
configure:19623: result: yes
configure:19658: checking for cerrno
configure:19665: result: yes
configure:19542: checking cmath usability
configure:19554: g++ -c -I/usr/include/X11/  conftest.cc >&5
configure:19560: $? = 0
configure:19564: test -z 
			 || test ! -s conftest.err
configure:19567: $? = 0
configure:19570: test -s conftest.o
configure:19573: $? = 0
configure:19583: result: yes
configure:19587: checking cmath presence
configure:19597: g++ -E  conftest.cc
configure:19603: $? = 0
configure:19623: result: yes
configure:19658: checking for cmath
configure:19665: result: yes
configure:19542: checking cstdarg usability
configure:19554: g++ -c -I/usr/include/X11/  conftest.cc >&5
configure:19560: $? = 0
configure:19564: test -z 
			 || test ! -s conftest.err
configure:19567: $? = 0
configure:19570: test -s conftest.o
configure:19573: $? = 0
configure:19583: result: yes
configure:19587: checking cstdarg presence
configure:19597: g++ -E  conftest.cc
configure:19603: $? = 0
configure:19623: result: yes
configure:19658: checking for cstdarg
configure:19665: result: yes
configure:19542: checking cstdio usability
configure:19554: g++ -c -I/usr/include/X11/  conftest.cc >&5
configure:19560: $? = 0
configure:19564: test -z 
			 || test ! -s conftest.err
configure:19567: $? = 0
configure:19570: test -s conftest.o
configure:19573: $? = 0
configure:19583: result: yes
configure:19587: checking cstdio presence
configure:19597: g++ -E  conftest.cc
configure:19603: $? = 0
configure:19623: result: yes
configure:19658: checking for cstdio
configure:19665: result: yes
configure:19542: checking cstdlib usability
configure:19554: g++ -c -I/usr/include/X11/  conftest.cc >&5
configure:19560: $? = 0
configure:19564: test -z 
			 || test ! -s conftest.err
configure:19567: $? = 0
configure:19570: test -s conftest.o
configure:19573: $? = 0
configure:19583: result: yes
configure:19587: checking cstdlib presence
configure:19597: g++ -E  conftest.cc
configure:19603: $? = 0
configure:19623: result: yes
configure:19658: checking for cstdlib
configure:19665: result: yes
configure:19542: checking cstring usability
configure:19554: g++ -c -I/usr/include/X11/  conftest.cc >&5
configure:19560: $? = 0
configure:19564: test -z 
			 || test ! -s conftest.err
configure:19567: $? = 0
configure:19570: test -s conftest.o
configure:19573: $? = 0
configure:19583: result: yes
configure:19587: checking cstring presence
configure:19597: g++ -E  conftest.cc
configure:19603: $? = 0
configure:19623: result: yes
configure:19658: checking for cstring
configure:19665: result: yes
configure:19542: checking ctime usability
configure:19554: g++ -c -I/usr/include/X11/  conftest.cc >&5
configure:19560: $? = 0
configure:19564: test -z 
			 || test ! -s conftest.err
configure:19567: $? = 0
configure:19570: test -s conftest.o
configure:19573: $? = 0
configure:19583: result: yes
configure:19587: checking ctime presence
configure:19597: g++ -E  conftest.cc
configure:19603: $? = 0
configure:19623: result: yes
configure:19658: checking for ctime
configure:19665: result: yes
configure:19679: checking whether time.h and sys/time.h may both be included
configure:19704: g++ -c -I/usr/include/X11/  conftest.cc >&5
configure:19710: $? = 0
configure:19714: test -z 
			 || test ! -s conftest.err
configure:19717: $? = 0
configure:19720: test -s conftest.o
configure:19723: $? = 0
configure:19734: result: yes
configure:19749: checking for basename
configure:19806: g++ -o conftest -I/usr/include/X11/   conftest.cc  >&5
configure:19812: $? = 0
configure:19816: test -z 
			 || test ! -s conftest.err
configure:19819: $? = 0
configure:19822: test -s conftest
configure:19825: $? = 0
configure:19837: result: yes
configure:19928: checking for getpid
configure:19985: g++ -o conftest -I/usr/include/X11/   conftest.cc  >&5
configure:19991: $? = 0
configure:19995: test -z 
			 || test ! -s conftest.err
configure:19998: $? = 0
configure:20001: test -s conftest
configure:20004: $? = 0
configure:20016: result: yes
configure:19928: checking for setlocale
configure:19985: g++ -o conftest -I/usr/include/X11/   conftest.cc  >&5
configure:19991: $? = 0
configure:19995: test -z 
			 || test ! -s conftest.err
configure:19998: $? = 0
configure:20001: test -s conftest
configure:20004: $? = 0
configure:20016: result: yes
configure:19928: checking for sigaction
configure:19985: g++ -o conftest -I/usr/include/X11/   conftest.cc  >&5
configure:19991: $? = 0
configure:19995: test -z 
			 || test ! -s conftest.err
configure:19998: $? = 0
configure:20001: test -s conftest
configure:20004: $? = 0
configure:20016: result: yes
configure:19928: checking for strcasestr
configure:19985: g++ -o conftest -I/usr/include/X11/   conftest.cc  >&5
configure:19991: $? = 0
configure:19995: test -z 
			 || test ! -s conftest.err
configure:19998: $? = 0
configure:20001: test -s conftest
configure:20004: $? = 0
configure:20016: result: yes
configure:19928: checking for snprintf
configure:19985: g++ -o conftest -I/usr/include/X11/   conftest.cc  >&5
configure:19991: $? = 0
configure:19995: test -z 
			 || test ! -s conftest.err
configure:19998: $? = 0
configure:20001: test -s conftest
configure:20004: $? = 0
configure:20016: result: yes
configure:19928: checking for vsnprintf
configure:19985: g++ -o conftest -I/usr/include/X11/   conftest.cc  >&5
configure:19991: $? = 0
configure:19995: test -z 
			 || test ! -s conftest.err
configure:19998: $? = 0
configure:20001: test -s conftest
configure:20004: $? = 0
configure:20016: result: yes
configure:19928: checking for catopen
configure:19985: g++ -o conftest -I/usr/include/X11/   conftest.cc  >&5
configure:19991: $? = 0
configure:19995: test -z 
			 || test ! -s conftest.err
configure:19998: $? = 0
configure:20001: test -s conftest
configure:20004: $? = 0
configure:20016: result: yes
configure:19928: checking for catgets
configure:19985: g++ -o conftest -I/usr/include/X11/   conftest.cc  >&5
configure:19991: $? = 0
configure:19995: test -z 
			 || test ! -s conftest.err
configure:19998: $? = 0
configure:20001: test -s conftest
configure:20004: $? = 0
configure:20016: result: yes
configure:19928: checking for catclose
configure:19985: g++ -o conftest -I/usr/include/X11/   conftest.cc  >&5
configure:19991: $? = 0
configure:19995: test -z 
			 || test ! -s conftest.err
configure:19998: $? = 0
configure:20001: test -s conftest
configure:20004: $? = 0
configure:20016: result: yes
configure:20028: checking for strftime
configure:20052: g++ -c -I/usr/include/X11/  conftest.cc >&5
configure:20058: $? = 0
configure:20062: test -z 
			 || test ! -s conftest.err
configure:20065: $? = 0
configure:20068: test -s conftest.o
configure:20071: $? = 0
configure:20079: result: yes
configure:20115: g++ -c -I/usr/include/X11/  conftest.cc >&5
configure:20121: $? = 0
configure:20125: test -z 
			 || test ! -s conftest.err
configure:20128: $? = 0
configure:20131: test -s conftest.o
configure:20134: $? = 0
configure:20168: g++ -c -I/usr/include/X11/  conftest.cc >&5
conftest.cc: In function `int main()':
conftest.cc:72: error: `libiconv_open' undeclared (first use this function)
conftest.cc:72: error: (Each undeclared identifier is reported only once for each function it appears in.)
configure:20174: $? = 1
configure: failed program was:
| /* confdefs.h.  */
| 
| #define PACKAGE_NAME ""
| #define PACKAGE_TARNAME ""
| #define PACKAGE_VERSION ""
| #define PACKAGE_STRING ""
| #define PACKAGE_BUGREPORT ""
| #ifdef __cplusplus
| extern "C" void std::exit (int) throw (); using std::exit;
| #endif
| #define STDC_HEADERS 1
| #define HAVE_SYS_TYPES_H 1
| #define HAVE_SYS_STAT_H 1
| #define HAVE_STDLIB_H 1
| #define HAVE_STRING_H 1
| #define HAVE_MEMORY_H 1
| #define HAVE_STRINGS_H 1
| #define HAVE_INTTYPES_H 1
| #define HAVE_STDINT_H 1
| #define HAVE_UNISTD_H 1
| #define HAVE_DLFCN_H 1
| #define STDC_HEADERS 1
| #define HAVE_ERRNO_H 1
| #define HAVE_CTYPE_H 1
| #define HAVE_DIRENT_H 1
| #define HAVE_FCNTL_H 1
| #define HAVE_LIBGEN_H 1
| #define HAVE_LOCALE_H 1
| #define HAVE_NL_TYPES_H 1
| #define HAVE_SIGNAL_H 1
| #define HAVE_STDARG_H 1
| #define HAVE_STDIO_H 1
| #define HAVE_TIME_H 1
| #define HAVE_UNISTD_H 1
| #define HAVE_SYS_PARAM_H 1
| #define HAVE_SYS_SELECT_H 1
| #define HAVE_SYS_SIGNAL_H 1
| #define HAVE_SYS_STAT_H 1
| #define HAVE_SYS_TIME_H 1
| #define HAVE_SYS_TYPES_H 1
| #define HAVE_SYS_WAIT_H 1
| #define HAVE_ICONV_H 1
| #define HAVE_SSTREAM 1
| #define HAVE_CASSERT 1
| #define HAVE_CCTYPE 1
| #define HAVE_CERRNO 1
| #define HAVE_CMATH 1
| #define HAVE_CSTDARG 1
| #define HAVE_CSTDIO 1
| #define HAVE_CSTDLIB 1
| #define HAVE_CSTRING 1
| #define HAVE_CTIME 1
| #define TIME_WITH_SYS_TIME 1
| #define HAVE_BASENAME 1
| #define HAVE_GETPID 1
| #define HAVE_SETLOCALE 1
| #define HAVE_SIGACTION 1
| #define HAVE_STRCASESTR 1
| #define HAVE_SNPRINTF 1
| #define HAVE_VSNPRINTF 1
| #define HAVE_CATOPEN 1
| #define HAVE_CATGETS 1
| #define HAVE_CATCLOSE 1
| #define HAVE_STRFTIME 1
| /* end confdefs.h.  */
| #include <stdlib.h>
|           #include <iconv.h>
| int
| main ()
| {
| 
|           libiconv_open(NULL, NULL);
|           return 0;
| 
| 
|   ;
|   return 0;
| }
configure:20206: checking for iconv_open in -liconv
configure:20236: g++ -o conftest -I/usr/include/X11/   conftest.cc -liconv   >&5
/usr/lib/gcc/i686-pc-linux-gnu/3.4.2/../../../../i686-pc-linux-gnu/bin/ld: cannot find -liconv
collect2: ld returned 1 exit status
configure:20242: $? = 1
configure: failed program was:
| /* confdefs.h.  */
| 
| #define PACKAGE_NAME ""
| #define PACKAGE_TARNAME ""
| #define PACKAGE_VERSION ""
| #define PACKAGE_STRING ""
| #define PACKAGE_BUGREPORT ""
| #ifdef __cplusplus
| extern "C" void std::exit (int) throw (); using std::exit;
| #endif
| #define STDC_HEADERS 1
| #define HAVE_SYS_TYPES_H 1
| #define HAVE_SYS_STAT_H 1
| #define HAVE_STDLIB_H 1
| #define HAVE_STRING_H 1
| #define HAVE_MEMORY_H 1
| #define HAVE_STRINGS_H 1
| #define HAVE_INTTYPES_H 1
| #define HAVE_STDINT_H 1
| #define HAVE_UNISTD_H 1
| #define HAVE_DLFCN_H 1
| #define STDC_HEADERS 1
| #define HAVE_ERRNO_H 1
| #define HAVE_CTYPE_H 1
| #define HAVE_DIRENT_H 1
| #define HAVE_FCNTL_H 1
| #define HAVE_LIBGEN_H 1
| #define HAVE_LOCALE_H 1
| #define HAVE_NL_TYPES_H 1
| #define HAVE_SIGNAL_H 1
| #define HAVE_STDARG_H 1
| #define HAVE_STDIO_H 1
| #define HAVE_TIME_H 1
| #define HAVE_UNISTD_H 1
| #define HAVE_SYS_PARAM_H 1
| #define HAVE_SYS_SELECT_H 1
| #define HAVE_SYS_SIGNAL_H 1
| #define HAVE_SYS_STAT_H 1
| #define HAVE_SYS_TIME_H 1
| #define HAVE_SYS_TYPES_H 1
| #define HAVE_SYS_WAIT_H 1
| #define HAVE_ICONV_H 1
| #define HAVE_SSTREAM 1
| #define HAVE_CASSERT 1
| #define HAVE_CCTYPE 1
| #define HAVE_CERRNO 1
| #define HAVE_CMATH 1
| #define HAVE_CSTDARG 1
| #define HAVE_CSTDIO 1
| #define HAVE_CSTDLIB 1
| #define HAVE_CSTRING 1
| #define HAVE_CTIME 1
| #define TIME_WITH_SYS_TIME 1
| #define HAVE_BASENAME 1
| #define HAVE_GETPID 1
| #define HAVE_SETLOCALE 1
| #define HAVE_SIGACTION 1
| #define HAVE_STRCASESTR 1
| #define HAVE_SNPRINTF 1
| #define HAVE_VSNPRINTF 1
| #define HAVE_CATOPEN 1
| #define HAVE_CATGETS 1
| #define HAVE_CATCLOSE 1
| #define HAVE_STRFTIME 1
| #define HAVE_ICONV 1
| /* end confdefs.h.  */
| 
| /* Override any gcc2 internal prototype to avoid an error.  */
| #ifdef __cplusplus
| extern "C"
| #endif
| /* We use char because int might match the return type of a gcc2
|    builtin and then its argument prototype would still apply.  */
| char iconv_open ();
| int
| main ()
| {
| iconv_open ();
|   ;
|   return 0;
| }
configure:20268: result: no
configure:20276: checking for libiconv_open in -liconv
configure:20306: g++ -o conftest -I/usr/include/X11/   conftest.cc -liconv   >&5
/usr/lib/gcc/i686-pc-linux-gnu/3.4.2/../../../../i686-pc-linux-gnu/bin/ld: cannot find -liconv
collect2: ld returned 1 exit status
configure:20312: $? = 1
configure: failed program was:
| /* confdefs.h.  */
| 
| #define PACKAGE_NAME ""
| #define PACKAGE_TARNAME ""
| #define PACKAGE_VERSION ""
| #define PACKAGE_STRING ""
| #define PACKAGE_BUGREPORT ""
| #ifdef __cplusplus
| extern "C" void std::exit (int) throw (); using std::exit;
| #endif
| #define STDC_HEADERS 1
| #define HAVE_SYS_TYPES_H 1
| #define HAVE_SYS_STAT_H 1
| #define HAVE_STDLIB_H 1
| #define HAVE_STRING_H 1
| #define HAVE_MEMORY_H 1
| #define HAVE_STRINGS_H 1
| #define HAVE_INTTYPES_H 1
| #define HAVE_STDINT_H 1
| #define HAVE_UNISTD_H 1
| #define HAVE_DLFCN_H 1
| #define STDC_HEADERS 1
| #define HAVE_ERRNO_H 1
| #define HAVE_CTYPE_H 1
| #define HAVE_DIRENT_H 1
| #define HAVE_FCNTL_H 1
| #define HAVE_LIBGEN_H 1
| #define HAVE_LOCALE_H 1
| #define HAVE_NL_TYPES_H 1
| #define HAVE_SIGNAL_H 1
| #define HAVE_STDARG_H 1
| #define HAVE_STDIO_H 1
| #define HAVE_TIME_H 1
| #define HAVE_UNISTD_H 1
| #define HAVE_SYS_PARAM_H 1
| #define HAVE_SYS_SELECT_H 1
| #define HAVE_SYS_SIGNAL_H 1
| #define HAVE_SYS_STAT_H 1
| #define HAVE_SYS_TIME_H 1
| #define HAVE_SYS_TYPES_H 1
| #define HAVE_SYS_WAIT_H 1
| #define HAVE_ICONV_H 1
| #define HAVE_SSTREAM 1
| #define HAVE_CASSERT 1
| #define HAVE_CCTYPE 1
| #define HAVE_CERRNO 1
| #define HAVE_CMATH 1
| #define HAVE_CSTDARG 1
| #define HAVE_CSTDIO 1
| #define HAVE_CSTDLIB 1
| #define HAVE_CSTRING 1
| #define HAVE_CTIME 1
| #define TIME_WITH_SYS_TIME 1
| #define HAVE_BASENAME 1
| #define HAVE_GETPID 1
| #define HAVE_SETLOCALE 1
| #define HAVE_SIGACTION 1
| #define HAVE_STRCASESTR 1
| #define HAVE_SNPRINTF 1
| #define HAVE_VSNPRINTF 1
| #define HAVE_CATOPEN 1
| #define HAVE_CATGETS 1
| #define HAVE_CATCLOSE 1
| #define HAVE_STRFTIME 1
| #define HAVE_ICONV 1
| /* end confdefs.h.  */
| 
| /* Override any gcc2 internal prototype to avoid an error.  */
| #ifdef __cplusplus
| extern "C"
| #endif
| /* We use char because int might match the return type of a gcc2
|    builtin and then its argument prototype would still apply.  */
| char libiconv_open ();
| int
| main ()
| {
| libiconv_open ();
|   ;
|   return 0;
| }
configure:20338: result: no
configure:20347: checking for iconv declaration
configure:20375: g++ -c -I/usr/include/X11/  conftest.cc >&5
configure:20381: $? = 0
configure:20385: test -z 
			 || test ! -s conftest.err
configure:20388: $? = 0
configure:20391: test -s conftest.o
configure:20394: $? = 0
configure:20406: result: no
configure:20420: checking for t_open in -lnsl
configure:20450: g++ -o conftest -I/usr/include/X11/   conftest.cc -lnsl   >&5
/tmp/cc2PW5k2.o(.text+0x1d): In function `main':
: undefined reference to `t_open'
collect2: ld returned 1 exit status
configure:20456: $? = 1
configure: failed program was:
| /* confdefs.h.  */
| 
| #define PACKAGE_NAME ""
| #define PACKAGE_TARNAME ""
| #define PACKAGE_VERSION ""
| #define PACKAGE_STRING ""
| #define PACKAGE_BUGREPORT ""
| #ifdef __cplusplus
| extern "C" void std::exit (int) throw (); using std::exit;
| #endif
| #define STDC_HEADERS 1
| #define HAVE_SYS_TYPES_H 1
| #define HAVE_SYS_STAT_H 1
| #define HAVE_STDLIB_H 1
| #define HAVE_STRING_H 1
| #define HAVE_MEMORY_H 1
| #define HAVE_STRINGS_H 1
| #define HAVE_INTTYPES_H 1
| #define HAVE_STDINT_H 1
| #define HAVE_UNISTD_H 1
| #define HAVE_DLFCN_H 1
| #define STDC_HEADERS 1
| #define HAVE_ERRNO_H 1
| #define HAVE_CTYPE_H 1
| #define HAVE_DIRENT_H 1
| #define HAVE_FCNTL_H 1
| #define HAVE_LIBGEN_H 1
| #define HAVE_LOCALE_H 1
| #define HAVE_NL_TYPES_H 1
| #define HAVE_SIGNAL_H 1
| #define HAVE_STDARG_H 1
| #define HAVE_STDIO_H 1
| #define HAVE_TIME_H 1
| #define HAVE_UNISTD_H 1
| #define HAVE_SYS_PARAM_H 1
| #define HAVE_SYS_SELECT_H 1
| #define HAVE_SYS_SIGNAL_H 1
| #define HAVE_SYS_STAT_H 1
| #define HAVE_SYS_TIME_H 1
| #define HAVE_SYS_TYPES_H 1
| #define HAVE_SYS_WAIT_H 1
| #define HAVE_ICONV_H 1
| #define HAVE_SSTREAM 1
| #define HAVE_CASSERT 1
| #define HAVE_CCTYPE 1
| #define HAVE_CERRNO 1
| #define HAVE_CMATH 1
| #define HAVE_CSTDARG 1
| #define HAVE_CSTDIO 1
| #define HAVE_CSTDLIB 1
| #define HAVE_CSTRING 1
| #define HAVE_CTIME 1
| #define TIME_WITH_SYS_TIME 1
| #define HAVE_BASENAME 1
| #define HAVE_GETPID 1
| #define HAVE_SETLOCALE 1
| #define HAVE_SIGACTION 1
| #define HAVE_STRCASESTR 1
| #define HAVE_SNPRINTF 1
| #define HAVE_VSNPRINTF 1
| #define HAVE_CATOPEN 1
| #define HAVE_CATGETS 1
| #define HAVE_CATCLOSE 1
| #define HAVE_STRFTIME 1
| #define HAVE_ICONV 1
| /* end confdefs.h.  */
| 
| /* Override any gcc2 internal prototype to avoid an error.  */
| #ifdef __cplusplus
| extern "C"
| #endif
| /* We use char because int might match the return type of a gcc2
|    builtin and then its argument prototype would still apply.  */
| char t_open ();
| int
| main ()
| {
| t_open ();
|   ;
|   return 0;
| }
configure:20482: result: no
configure:20488: checking for socket in -lsocket
configure:20518: g++ -o conftest -I/usr/include/X11/   conftest.cc -lsocket   >&5
/usr/lib/gcc/i686-pc-linux-gnu/3.4.2/../../../../i686-pc-linux-gnu/bin/ld: cannot find -lsocket
collect2: ld returned 1 exit status
configure:20524: $? = 1
configure: failed program was:
| /* confdefs.h.  */
| 
| #define PACKAGE_NAME ""
| #define PACKAGE_TARNAME ""
| #define PACKAGE_VERSION ""
| #define PACKAGE_STRING ""
| #define PACKAGE_BUGREPORT ""
| #ifdef __cplusplus
| extern "C" void std::exit (int) throw (); using std::exit;
| #endif
| #define STDC_HEADERS 1
| #define HAVE_SYS_TYPES_H 1
| #define HAVE_SYS_STAT_H 1
| #define HAVE_STDLIB_H 1
| #define HAVE_STRING_H 1
| #define HAVE_MEMORY_H 1
| #define HAVE_STRINGS_H 1
| #define HAVE_INTTYPES_H 1
| #define HAVE_STDINT_H 1
| #define HAVE_UNISTD_H 1
| #define HAVE_DLFCN_H 1
| #define STDC_HEADERS 1
| #define HAVE_ERRNO_H 1
| #define HAVE_CTYPE_H 1
| #define HAVE_DIRENT_H 1
| #define HAVE_FCNTL_H 1
| #define HAVE_LIBGEN_H 1
| #define HAVE_LOCALE_H 1
| #define HAVE_NL_TYPES_H 1
| #define HAVE_SIGNAL_H 1
| #define HAVE_STDARG_H 1
| #define HAVE_STDIO_H 1
| #define HAVE_TIME_H 1
| #define HAVE_UNISTD_H 1
| #define HAVE_SYS_PARAM_H 1
| #define HAVE_SYS_SELECT_H 1
| #define HAVE_SYS_SIGNAL_H 1
| #define HAVE_SYS_STAT_H 1
| #define HAVE_SYS_TIME_H 1
| #define HAVE_SYS_TYPES_H 1
| #define HAVE_SYS_WAIT_H 1
| #define HAVE_ICONV_H 1
| #define HAVE_SSTREAM 1
| #define HAVE_CASSERT 1
| #define HAVE_CCTYPE 1
| #define HAVE_CERRNO 1
| #define HAVE_CMATH 1
| #define HAVE_CSTDARG 1
| #define HAVE_CSTDIO 1
| #define HAVE_CSTDLIB 1
| #define HAVE_CSTRING 1
| #define HAVE_CTIME 1
| #define TIME_WITH_SYS_TIME 1
| #define HAVE_BASENAME 1
| #define HAVE_GETPID 1
| #define HAVE_SETLOCALE 1
| #define HAVE_SIGACTION 1
| #define HAVE_STRCASESTR 1
| #define HAVE_SNPRINTF 1
| #define HAVE_VSNPRINTF 1
| #define HAVE_CATOPEN 1
| #define HAVE_CATGETS 1
| #define HAVE_CATCLOSE 1
| #define HAVE_STRFTIME 1
| #define HAVE_ICONV 1
| /* end confdefs.h.  */
| 
| /* Override any gcc2 internal prototype to avoid an error.  */
| #ifdef __cplusplus
| extern "C"
| #endif
| /* We use char because int might match the return type of a gcc2
|    builtin and then its argument prototype would still apply.  */
| char socket ();
| int
| main ()
| {
| socket ();
|   ;
|   return 0;
| }
configure:20550: result: no
configure:20557: checking for X
configure:20662: g++ -E  conftest.cc
configure:20668: $? = 0
configure:20718: g++ -o conftest -I/usr/include/X11/   conftest.cc -lXt  >&5
configure:20724: $? = 0
configure:20728: test -z 
			 || test ! -s conftest.err
configure:20731: $? = 0
configure:20734: test -s conftest
configure:20737: $? = 0
configure:20787: result: libraries , headers 
configure:20959: g++ -o conftest -I/usr/include/X11/   conftest.cc   -lX11 >&5
/usr/lib/gcc/i686-pc-linux-gnu/3.4.2/../../../libX11.a(ConnDis.o)(.text+0xb13): In function `_X11TransConnectDisplay':
/home/X/lib/libX11-X11R7.0-1.0.0/src/ConnDis.c:1232: undefined reference to `XauDisposeAuth'
/usr/lib/gcc/i686-pc-linux-gnu/3.4.2/../../../libX11.a(ConnDis.o)(.text+0xbe1):/home/X/lib/libX11-X11R7.0-1.0.0/src/ConnDis.c:1037: undefined reference to `XauGetBestAuthByAddr'
/usr/lib/gcc/i686-pc-linux-gnu/3.4.2/../../../libX11.a(ConnDis.o)(.text+0xe3f):/home/X/lib/libX11-X11R7.0-1.0.0/src/ConnDis.c:1176: undefined reference to `XdmcpWrap'
collect2: ld returned 1 exit status
configure:20965: $? = 1
configure: failed program was:
| /* confdefs.h.  */
| 
| #define PACKAGE_NAME ""
| #define PACKAGE_TARNAME ""
| #define PACKAGE_VERSION ""
| #define PACKAGE_STRING ""
| #define PACKAGE_BUGREPORT ""
| #ifdef __cplusplus
| extern "C" void std::exit (int) throw (); using std::exit;
| #endif
| #define STDC_HEADERS 1
| #define HAVE_SYS_TYPES_H 1
| #define HAVE_SYS_STAT_H 1
| #define HAVE_STDLIB_H 1
| #define HAVE_STRING_H 1
| #define HAVE_MEMORY_H 1
| #define HAVE_STRINGS_H 1
| #define HAVE_INTTYPES_H 1
| #define HAVE_STDINT_H 1
| #define HAVE_UNISTD_H 1
| #define HAVE_DLFCN_H 1
| #define STDC_HEADERS 1
| #define HAVE_ERRNO_H 1
| #define HAVE_CTYPE_H 1
| #define HAVE_DIRENT_H 1
| #define HAVE_FCNTL_H 1
| #define HAVE_LIBGEN_H 1
| #define HAVE_LOCALE_H 1
| #define HAVE_NL_TYPES_H 1
| #define HAVE_SIGNAL_H 1
| #define HAVE_STDARG_H 1
| #define HAVE_STDIO_H 1
| #define HAVE_TIME_H 1
| #define HAVE_UNISTD_H 1
| #define HAVE_SYS_PARAM_H 1
| #define HAVE_SYS_SELECT_H 1
| #define HAVE_SYS_SIGNAL_H 1
| #define HAVE_SYS_STAT_H 1
| #define HAVE_SYS_TIME_H 1
| #define HAVE_SYS_TYPES_H 1
| #define HAVE_SYS_WAIT_H 1
| #define HAVE_ICONV_H 1
| #define HAVE_SSTREAM 1
| #define HAVE_CASSERT 1
| #define HAVE_CCTYPE 1
| #define HAVE_CERRNO 1
| #define HAVE_CMATH 1
| #define HAVE_CSTDARG 1
| #define HAVE_CSTDIO 1
| #define HAVE_CSTDLIB 1
| #define HAVE_CSTRING 1
| #define HAVE_CTIME 1
| #define TIME_WITH_SYS_TIME 1
| #define HAVE_BASENAME 1
| #define HAVE_GETPID 1
| #define HAVE_SETLOCALE 1
| #define HAVE_SIGACTION 1
| #define HAVE_STRCASESTR 1
| #define HAVE_SNPRINTF 1
| #define HAVE_VSNPRINTF 1
| #define HAVE_CATOPEN 1
| #define HAVE_CATGETS 1
| #define HAVE_CATCLOSE 1
| #define HAVE_STRFTIME 1
| #define HAVE_ICONV 1
| /* end confdefs.h.  */
| 
| /* Override any gcc2 internal prototype to avoid an error.  */
| #ifdef __cplusplus
| extern "C"
| #endif
| /* We use char because int might match the return type of a gcc2
|    builtin and then its argument prototype would still apply.  */
| char XOpenDisplay ();
| int
| main ()
| {
| XOpenDisplay ();
|   ;
|   return 0;
| }
configure:20985: checking for dnet_ntoa in -ldnet
configure:21015: g++ -o conftest -I/usr/include/X11/   conftest.cc -ldnet    -lX11 >&5
/usr/lib/gcc/i686-pc-linux-gnu/3.4.2/../../../../i686-pc-linux-gnu/bin/ld: cannot find -ldnet
collect2: ld returned 1 exit status
configure:21021: $? = 1
configure: failed program was:
| /* confdefs.h.  */
| 
| #define PACKAGE_NAME ""
| #define PACKAGE_TARNAME ""
| #define PACKAGE_VERSION ""
| #define PACKAGE_STRING ""
| #define PACKAGE_BUGREPORT ""
| #ifdef __cplusplus
| extern "C" void std::exit (int) throw (); using std::exit;
| #endif
| #define STDC_HEADERS 1
| #define HAVE_SYS_TYPES_H 1
| #define HAVE_SYS_STAT_H 1
| #define HAVE_STDLIB_H 1
| #define HAVE_STRING_H 1
| #define HAVE_MEMORY_H 1
| #define HAVE_STRINGS_H 1
| #define HAVE_INTTYPES_H 1
| #define HAVE_STDINT_H 1
| #define HAVE_UNISTD_H 1
| #define HAVE_DLFCN_H 1
| #define STDC_HEADERS 1
| #define HAVE_ERRNO_H 1
| #define HAVE_CTYPE_H 1
| #define HAVE_DIRENT_H 1
| #define HAVE_FCNTL_H 1
| #define HAVE_LIBGEN_H 1
| #define HAVE_LOCALE_H 1
| #define HAVE_NL_TYPES_H 1
| #define HAVE_SIGNAL_H 1
| #define HAVE_STDARG_H 1
| #define HAVE_STDIO_H 1
| #define HAVE_TIME_H 1
| #define HAVE_UNISTD_H 1
| #define HAVE_SYS_PARAM_H 1
| #define HAVE_SYS_SELECT_H 1
| #define HAVE_SYS_SIGNAL_H 1
| #define HAVE_SYS_STAT_H 1
| #define HAVE_SYS_TIME_H 1
| #define HAVE_SYS_TYPES_H 1
| #define HAVE_SYS_WAIT_H 1
| #define HAVE_ICONV_H 1
| #define HAVE_SSTREAM 1
| #define HAVE_CASSERT 1
| #define HAVE_CCTYPE 1
| #define HAVE_CERRNO 1
| #define HAVE_CMATH 1
| #define HAVE_CSTDARG 1
| #define HAVE_CSTDIO 1
| #define HAVE_CSTDLIB 1
| #define HAVE_CSTRING 1
| #define HAVE_CTIME 1
| #define TIME_WITH_SYS_TIME 1
| #define HAVE_BASENAME 1
| #define HAVE_GETPID 1
| #define HAVE_SETLOCALE 1
| #define HAVE_SIGACTION 1
| #define HAVE_STRCASESTR 1
| #define HAVE_SNPRINTF 1
| #define HAVE_VSNPRINTF 1
| #define HAVE_CATOPEN 1
| #define HAVE_CATGETS 1
| #define HAVE_CATCLOSE 1
| #define HAVE_STRFTIME 1
| #define HAVE_ICONV 1
| /* end confdefs.h.  */
| 
| /* Override any gcc2 internal prototype to avoid an error.  */
| #ifdef __cplusplus
| extern "C"
| #endif
| /* We use char because int might match the return type of a gcc2
|    builtin and then its argument prototype would still apply.  */
| char dnet_ntoa ();
| int
| main ()
| {
| dnet_ntoa ();
|   ;
|   return 0;
| }
configure:21047: result: no
configure:21054: checking for dnet_ntoa in -ldnet_stub
configure:21084: g++ -o conftest -I/usr/include/X11/   conftest.cc -ldnet_stub    -lX11 >&5
/usr/lib/gcc/i686-pc-linux-gnu/3.4.2/../../../../i686-pc-linux-gnu/bin/ld: cannot find -ldnet_stub
collect2: ld returned 1 exit status
configure:21090: $? = 1
configure: failed program was:
| /* confdefs.h.  */
| 
| #define PACKAGE_NAME ""
| #define PACKAGE_TARNAME ""
| #define PACKAGE_VERSION ""
| #define PACKAGE_STRING ""
| #define PACKAGE_BUGREPORT ""
| #ifdef __cplusplus
| extern "C" void std::exit (int) throw (); using std::exit;
| #endif
| #define STDC_HEADERS 1
| #define HAVE_SYS_TYPES_H 1
| #define HAVE_SYS_STAT_H 1
| #define HAVE_STDLIB_H 1
| #define HAVE_STRING_H 1
| #define HAVE_MEMORY_H 1
| #define HAVE_STRINGS_H 1
| #define HAVE_INTTYPES_H 1
| #define HAVE_STDINT_H 1
| #define HAVE_UNISTD_H 1
| #define HAVE_DLFCN_H 1
| #define STDC_HEADERS 1
| #define HAVE_ERRNO_H 1
| #define HAVE_CTYPE_H 1
| #define HAVE_DIRENT_H 1
| #define HAVE_FCNTL_H 1
| #define HAVE_LIBGEN_H 1
| #define HAVE_LOCALE_H 1
| #define HAVE_NL_TYPES_H 1
| #define HAVE_SIGNAL_H 1
| #define HAVE_STDARG_H 1
| #define HAVE_STDIO_H 1
| #define HAVE_TIME_H 1
| #define HAVE_UNISTD_H 1
| #define HAVE_SYS_PARAM_H 1
| #define HAVE_SYS_SELECT_H 1
| #define HAVE_SYS_SIGNAL_H 1
| #define HAVE_SYS_STAT_H 1
| #define HAVE_SYS_TIME_H 1
| #define HAVE_SYS_TYPES_H 1
| #define HAVE_SYS_WAIT_H 1
| #define HAVE_ICONV_H 1
| #define HAVE_SSTREAM 1
| #define HAVE_CASSERT 1
| #define HAVE_CCTYPE 1
| #define HAVE_CERRNO 1
| #define HAVE_CMATH 1
| #define HAVE_CSTDARG 1
| #define HAVE_CSTDIO 1
| #define HAVE_CSTDLIB 1
| #define HAVE_CSTRING 1
| #define HAVE_CTIME 1
| #define TIME_WITH_SYS_TIME 1
| #define HAVE_BASENAME 1
| #define HAVE_GETPID 1
| #define HAVE_SETLOCALE 1
| #define HAVE_SIGACTION 1
| #define HAVE_STRCASESTR 1
| #define HAVE_SNPRINTF 1
| #define HAVE_VSNPRINTF 1
| #define HAVE_CATOPEN 1
| #define HAVE_CATGETS 1
| #define HAVE_CATCLOSE 1
| #define HAVE_STRFTIME 1
| #define HAVE_ICONV 1
| /* end confdefs.h.  */
| 
| /* Override any gcc2 internal prototype to avoid an error.  */
| #ifdef __cplusplus
| extern "C"
| #endif
| /* We use char because int might match the return type of a gcc2
|    builtin and then its argument prototype would still apply.  */
| char dnet_ntoa ();
| int
| main ()
| {
| dnet_ntoa ();
|   ;
|   return 0;
| }
configure:21116: result: no
configure:21136: checking for gethostbyname
configure:21193: g++ -o conftest -I/usr/include/X11/   conftest.cc  >&5
configure:21199: $? = 0
configure:21203: test -z 
			 || test ! -s conftest.err
configure:21206: $? = 0
configure:21209: test -s conftest
configure:21212: $? = 0
configure:21224: result: yes
configure:21375: checking for connect
configure:21432: g++ -o conftest -I/usr/include/X11/   conftest.cc  >&5
configure:21438: $? = 0
configure:21442: test -z 
			 || test ! -s conftest.err
configure:21445: $? = 0
configure:21448: test -s conftest
configure:21451: $? = 0
configure:21463: result: yes
configure:21538: checking for remove
configure:21595: g++ -o conftest -I/usr/include/X11/   conftest.cc  >&5
configure:21601: $? = 0
configure:21605: test -z 
			 || test ! -s conftest.err
configure:21608: $? = 0
configure:21611: test -s conftest
configure:21614: $? = 0
configure:21626: result: yes
configure:21701: checking for shmat
configure:21758: g++ -o conftest -I/usr/include/X11/   conftest.cc  >&5
configure:21764: $? = 0
configure:21768: test -z 
			 || test ! -s conftest.err
configure:21771: $? = 0
configure:21774: test -s conftest
configure:21777: $? = 0
configure:21789: result: yes
configure:21873: checking for IceConnectionNumber in -lICE
configure:21903: g++ -o conftest -I/usr/include/X11/   conftest.cc -lICE   >&5
configure:21909: $? = 0
configure:21913: test -z 
			 || test ! -s conftest.err
configure:21916: $? = 0
configure:21919: test -s conftest
configure:21922: $? = 0
configure:21935: result: yes
configure:21959: checking for XOpenDisplay in -lX11
configure:21989: g++ -o conftest -I/usr/include/X11/       -lSM -lICE conftest.cc -lX11    >&5
/usr/lib/gcc/i686-pc-linux-gnu/3.4.2/../../../libX11.a(ConnDis.o)(.text+0xb13): In function `_X11TransConnectDisplay':
/home/X/lib/libX11-X11R7.0-1.0.0/src/ConnDis.c:1232: undefined reference to `XauDisposeAuth'
/usr/lib/gcc/i686-pc-linux-gnu/3.4.2/../../../libX11.a(ConnDis.o)(.text+0xbe1):/home/X/lib/libX11-X11R7.0-1.0.0/src/ConnDis.c:1037: undefined reference to `XauGetBestAuthByAddr'
/usr/lib/gcc/i686-pc-linux-gnu/3.4.2/../../../libX11.a(ConnDis.o)(.text+0xe3f):/home/X/lib/libX11-X11R7.0-1.0.0/src/ConnDis.c:1176: undefined reference to `XdmcpWrap'
collect2: ld returned 1 exit status
configure:21995: $? = 1
configure: failed program was:
| /* confdefs.h.  */
| 
| #define PACKAGE_NAME ""
| #define PACKAGE_TARNAME ""
| #define PACKAGE_VERSION ""
| #define PACKAGE_STRING ""
| #define PACKAGE_BUGREPORT ""
| #ifdef __cplusplus
| extern "C" void std::exit (int) throw (); using std::exit;
| #endif
| #define STDC_HEADERS 1
| #define HAVE_SYS_TYPES_H 1
| #define HAVE_SYS_STAT_H 1
| #define HAVE_STDLIB_H 1
| #define HAVE_STRING_H 1
| #define HAVE_MEMORY_H 1
| #define HAVE_STRINGS_H 1
| #define HAVE_INTTYPES_H 1
| #define HAVE_STDINT_H 1
| #define HAVE_UNISTD_H 1
| #define HAVE_DLFCN_H 1
| #define STDC_HEADERS 1
| #define HAVE_ERRNO_H 1
| #define HAVE_CTYPE_H 1
| #define HAVE_DIRENT_H 1
| #define HAVE_FCNTL_H 1
| #define HAVE_LIBGEN_H 1
| #define HAVE_LOCALE_H 1
| #define HAVE_NL_TYPES_H 1
| #define HAVE_SIGNAL_H 1
| #define HAVE_STDARG_H 1
| #define HAVE_STDIO_H 1
| #define HAVE_TIME_H 1
| #define HAVE_UNISTD_H 1
| #define HAVE_SYS_PARAM_H 1
| #define HAVE_SYS_SELECT_H 1
| #define HAVE_SYS_SIGNAL_H 1
| #define HAVE_SYS_STAT_H 1
| #define HAVE_SYS_TIME_H 1
| #define HAVE_SYS_TYPES_H 1
| #define HAVE_SYS_WAIT_H 1
| #define HAVE_ICONV_H 1
| #define HAVE_SSTREAM 1
| #define HAVE_CASSERT 1
| #define HAVE_CCTYPE 1
| #define HAVE_CERRNO 1
| #define HAVE_CMATH 1
| #define HAVE_CSTDARG 1
| #define HAVE_CSTDIO 1
| #define HAVE_CSTDLIB 1
| #define HAVE_CSTRING 1
| #define HAVE_CTIME 1
| #define TIME_WITH_SYS_TIME 1
| #define HAVE_BASENAME 1
| #define HAVE_GETPID 1
| #define HAVE_SETLOCALE 1
| #define HAVE_SIGACTION 1
| #define HAVE_STRCASESTR 1
| #define HAVE_SNPRINTF 1
| #define HAVE_VSNPRINTF 1
| #define HAVE_CATOPEN 1
| #define HAVE_CATGETS 1
| #define HAVE_CATCLOSE 1
| #define HAVE_STRFTIME 1
| #define HAVE_ICONV 1
| /* end confdefs.h.  */
| 
| /* Override any gcc2 internal prototype to avoid an error.  */
| #ifdef __cplusplus
| extern "C"
| #endif
| /* We use char because int might match the return type of a gcc2
|    builtin and then its argument prototype would still apply.  */
| char XOpenDisplay ();
| int
| main ()
| {
| XOpenDisplay ();
|   ;
|   return 0;
| }
configure:22021: result: no
configure:22026: error: Could not find XOpenDisplay in -lX11.

## ---------------- ##
## Cache variables. ##
## ---------------- ##

ac_cv_build=i686-pc-linux-gnu
ac_cv_build_alias=i686-pc-linux-gnu
ac_cv_c_compiler_gnu=yes
ac_cv_cxx_compiler_gnu=yes
ac_cv_env_CC_set=
ac_cv_env_CC_value=
ac_cv_env_CFLAGS_set=
ac_cv_env_CFLAGS_value=
ac_cv_env_CPPFLAGS_set=
ac_cv_env_CPPFLAGS_value=
ac_cv_env_CPP_set=
ac_cv_env_CPP_value=
ac_cv_env_CXXCPP_set=
ac_cv_env_CXXCPP_value=
ac_cv_env_CXXFLAGS_set=set
ac_cv_env_CXXFLAGS_value=-I/usr/include/X11/
ac_cv_env_CXX_set=
ac_cv_env_CXX_value=
ac_cv_env_F77_set=
ac_cv_env_F77_value=
ac_cv_env_FFLAGS_set=
ac_cv_env_FFLAGS_value=
ac_cv_env_LDFLAGS_set=
ac_cv_env_LDFLAGS_value=
ac_cv_env_build_alias_set=
ac_cv_env_build_alias_value=
ac_cv_env_host_alias_set=
ac_cv_env_host_alias_value=
ac_cv_env_target_alias_set=
ac_cv_env_target_alias_value=
ac_cv_exeext=
ac_cv_f77_compiler_gnu=no
ac_cv_func_basename=yes
ac_cv_func_catclose=yes
ac_cv_func_catgets=yes
ac_cv_func_catopen=yes
ac_cv_func_connect=yes
ac_cv_func_gethostbyname=yes
ac_cv_func_getpid=yes
ac_cv_func_remove=yes
ac_cv_func_setlocale=yes
ac_cv_func_shmat=yes
ac_cv_func_sigaction=yes
ac_cv_func_snprintf=yes
ac_cv_func_strcasestr=yes
ac_cv_func_vsnprintf=yes
ac_cv_have_x='have_x=yes 		ac_x_includes= ac_x_libraries='
ac_cv_header_cassert=yes
ac_cv_header_cctype=yes
ac_cv_header_cerrno=yes
ac_cv_header_cmath=yes
ac_cv_header_cstdarg=yes
ac_cv_header_cstdio=yes
ac_cv_header_cstdlib=yes
ac_cv_header_cstring=yes
ac_cv_header_ctime=yes
ac_cv_header_ctype_h=yes
ac_cv_header_dirent_h=yes
ac_cv_header_dlfcn_h=yes
ac_cv_header_errno_h=yes
ac_cv_header_fcntl_h=yes
ac_cv_header_iconv_h=yes
ac_cv_header_inttypes_h=yes
ac_cv_header_libgen_h=yes
ac_cv_header_locale_h=yes
ac_cv_header_memory_h=yes
ac_cv_header_nl_types_h=yes
ac_cv_header_process_h=no
ac_cv_header_signal_h=yes
ac_cv_header_sstream=yes
ac_cv_header_stdarg_h=yes
ac_cv_header_stdc=yes
ac_cv_header_stdint_h=yes
ac_cv_header_stdio_h=yes
ac_cv_header_stdlib_h=yes
ac_cv_header_string_h=yes
ac_cv_header_strings_h=yes
ac_cv_header_sys_param_h=yes
ac_cv_header_sys_select_h=yes
ac_cv_header_sys_signal_h=yes
ac_cv_header_sys_stat_h=yes
ac_cv_header_sys_time_h=yes
ac_cv_header_sys_types_h=yes
ac_cv_header_sys_wait_h=yes
ac_cv_header_time=yes
ac_cv_header_time_h=yes
ac_cv_header_unistd_h=yes
ac_cv_host=i686-pc-linux-gnu
ac_cv_host_alias=i686-pc-linux-gnu
ac_cv_iconv_const=no
ac_cv_lib_ICE_IceConnectionNumber=yes
ac_cv_lib_X11_XOpenDisplay=no
ac_cv_lib_dnet_dnet_ntoa=no
ac_cv_lib_dnet_stub_dnet_ntoa=no
ac_cv_lib_iconv_iconv_open=no
ac_cv_lib_iconv_libiconv_open=no
ac_cv_lib_nsl_t_open=no
ac_cv_lib_socket_socket=no
ac_cv_objext=o
ac_cv_path_install='/bin/install -c'
ac_cv_prog_AWK=gawk
ac_cv_prog_CPP='gcc -E'
ac_cv_prog_CXXCPP='g++ -E'
ac_cv_prog_ac_ct_AR=ar
ac_cv_prog_ac_ct_CC=gcc
ac_cv_prog_ac_ct_CXX=g++
ac_cv_prog_ac_ct_RANLIB=ranlib
ac_cv_prog_ac_ct_STRIP=strip
ac_cv_prog_cc_g=yes
ac_cv_prog_cc_stdc=
ac_cv_prog_cxx_g=yes
ac_cv_prog_egrep='grep -E'
ac_cv_prog_f77_g=no
ac_cv_prog_make_make_set=yes
ac_cv_prog_regex_cmd=sed
am_cv_CC_dependencies_compiler_type=gcc3
am_cv_CXX_dependencies_compiler_type=gcc3
lt_cv_deplibs_check_method=pass_all
lt_cv_file_magic_cmd='$MAGIC_CMD'
lt_cv_file_magic_test_file=
lt_cv_ld_reload_flag=-r
lt_cv_objdir=.libs
lt_cv_path_LD=/usr/i686-pc-linux-gnu/bin/ld
lt_cv_path_LDCXX=/usr/i686-pc-linux-gnu/bin/ld
lt_cv_path_NM='/usr/bin/nm -B'
lt_cv_path_SED=/bin/sed
lt_cv_prog_compiler_c_o=yes
lt_cv_prog_compiler_c_o_CXX=yes
lt_cv_prog_compiler_rtti_exceptions=no
lt_cv_prog_gnu_ld=yes
lt_cv_prog_gnu_ldcxx=yes
lt_cv_sys_global_symbol_pipe='sed -n -e '\''s/^.*[ 	]\([ABCDGIRSTW][ABCDGIRSTW]*\)[ 	][ 	]*\([_A-Za-z][_A-Za-z0-9]*\)$/\1 \2 \2/p'\'''
lt_cv_sys_global_symbol_to_c_name_address='sed -n -e '\''s/^: \([^ ]*\) $/  {\"\1\", (lt_ptr) 0},/p'\'' -e '\''s/^[BCDEGRST] \([^ ]*\) \([^ ]*\)$/  {"\2", (lt_ptr) \&\2},/p'\'''
lt_cv_sys_global_symbol_to_cdecl='sed -n -e '\''s/^. .* \(.*\)$/extern int \1;/p'\'''
lt_cv_sys_max_cmd_len=32768
lt_lt_cv_prog_compiler_c_o='"yes"'
lt_lt_cv_prog_compiler_c_o_CXX='"yes"'
lt_lt_cv_sys_global_symbol_pipe='"sed -n -e '\''s/^.*[ 	]\\([ABCDGIRSTW][ABCDGIRSTW]*\\)[ 	][ 	]*\\([_A-Za-z][_A-Za-z0-9]*\\)\$/\\1 \\2 \\2/p'\''"'
lt_lt_cv_sys_global_symbol_to_c_name_address='"sed -n -e '\''s/^: \\([^ ]*\\) \$/  {\\\"\\1\\\", (lt_ptr) 0},/p'\'' -e '\''s/^[BCDEGRST] \\([^ ]*\\) \\([^ ]*\\)\$/  {\"\\2\", (lt_ptr) \\&\\2},/p'\''"'
lt_lt_cv_sys_global_symbol_to_cdecl='"sed -n -e '\''s/^. .* \\(.*\\)\$/extern int \\1;/p'\''"'

## ----------------- ##
## Output variables. ##
## ----------------- ##

ACLOCAL='aclocal-1.9'
AMDEPBACKSLASH='\'
AMDEP_FALSE='#'
AMDEP_TRUE=''
AMTAR='tar'
AR='ar'
AUTOCONF='autoconf'
AUTOHEADER='autoheader'
AUTOMAKE='automake-1.9'
AWK='gawk'
CC='gcc'
CCDEPMODE='depmode=gcc3'
CFLAGS='-g -O2 '
CPP='gcc -E'
CPPFLAGS=''
CXX='g++'
CXXCPP='g++ -E'
CXXDEPMODE='depmode=gcc3'
CXXFLAGS='-I/usr/include/X11/ '
CYGPATH_W='echo'
DEBUG=''
DEFAULT_INIT=''
DEFAULT_KEYS=''
DEFAULT_MENU=''
DEFAULT_STYLE=''
DEFS=''
DEPDIR='.deps'
ECHO='echo'
ECHO_C=''
ECHO_N='-n'
ECHO_T=''
EGREP='grep -E'
EXEEXT=''
F77=''
FFLAGS=''
GNOME_FALSE=''
GNOME_TRUE=''
IMLIB2_CFLAGS=''
IMLIB2_CONFIG=''
IMLIB2_FALSE=''
IMLIB2_LIBS=''
IMLIB2_TRUE=''
INSTALL_DATA='${INSTALL} -m 644'
INSTALL_PROGRAM='${INSTALL}'
INSTALL_SCRIPT='${INSTALL}'
INSTALL_STRIP_PROGRAM='${SHELL} $(install_sh) -c -s'
LDFLAGS='    -lSM -lICE'
LIBOBJS=''
LIBS=' '
LIBTOOL='$(SHELL) $(top_builddir)/libtool'
LN_S='ln -s'
LOCALE_PATH=''
LTLIBOBJS=''
MAKEINFO='makeinfo'
MULTIBYTE_FALSE=''
MULTIBYTE_TRUE=''
NEWWMSPEC_FALSE=''
NEWWMSPEC_TRUE=''
NLS=''
OBJEXT='o'
PACKAGE='fluxbox'
PACKAGE_BUGREPORT=''
PACKAGE_NAME=''
PACKAGE_STRING=''
PACKAGE_TARNAME=''
PACKAGE_VERSION=''
PATH_SEPARATOR=':'
PKG_CONFIG=''
RANLIB='ranlib'
REGEXP_SRC_FALSE=''
REGEXP_SRC_TRUE=''
REMEMBER_SRC_FALSE=''
REMEMBER_SRC_TRUE=''
SET_MAKE=''
SHAPE=''
SHELL='/bin/sh'
STRIP='strip'
TOOLBAR_SRC_FALSE=''
TOOLBAR_SRC_TRUE=''
VERSION='1.0rc2'
XFT_FALSE=''
XFT_TRUE=''
XPM_FALSE=''
XPM_TRUE=''
X_CFLAGS=''
X_EXTRA_LIBS=''
X_LIBS=''
X_PRE_LIBS=' -lSM -lICE'
ac_ct_AR='ar'
ac_ct_CC='gcc'
ac_ct_CXX='g++'
ac_ct_F77=''
ac_ct_RANLIB='ranlib'
ac_ct_STRIP='strip'
am__fastdepCC_FALSE='#'
am__fastdepCC_TRUE=''
am__fastdepCXX_FALSE='#'
am__fastdepCXX_TRUE=''
am__include='include'
am__leading_dot='.'
am__quote=''
am__tar='${AMTAR} chof - "$$tardir"'
am__untar='${AMTAR} xf -'
bindir='${exec_prefix}/bin'
build='i686-pc-linux-gnu'
build_alias=''
build_cpu='i686'
build_os='linux-gnu'
build_vendor='pc'
datadir='${prefix}/share'
exec_prefix='NONE'
gencat_cmd=''
host='i686-pc-linux-gnu'
host_alias=''
host_cpu='i686'
host_os='linux-gnu'
host_vendor='pc'
includedir='${prefix}/include'
infodir='${prefix}/info'
install_sh='/home/fluxbox-1.0rc2/install-sh'
libdir='${exec_prefix}/lib'
libexecdir='${exec_prefix}/libexec'
localstatedir='${prefix}/var'
mandir='${prefix}/man'
mkdir_p='mkdir -p --'
oldincludedir='/usr/include'
prefix='/usr/local'
program_prefix='NONE'
program_suffix='NONE'
program_transform_name='s,x,x,'
regex_cmd='sed'
sbindir='${exec_prefix}/sbin'
sharedstatedir='${prefix}/com'
sysconfdir='${prefix}/etc'
target_alias=''

## ----------- ##
## confdefs.h. ##
## ----------- ##

#define HAVE_BASENAME 1
#define HAVE_CASSERT 1
#define HAVE_CATCLOSE 1
#define HAVE_CATGETS 1
#define HAVE_CATOPEN 1
#define HAVE_CCTYPE 1
#define HAVE_CERRNO 1
#define HAVE_CMATH 1
#define HAVE_CSTDARG 1
#define HAVE_CSTDIO 1
#define HAVE_CSTDLIB 1
#define HAVE_CSTRING 1
#define HAVE_CTIME 1
#define HAVE_CTYPE_H 1
#define HAVE_DIRENT_H 1
#define HAVE_DLFCN_H 1
#define HAVE_ERRNO_H 1
#define HAVE_FCNTL_H 1
#define HAVE_GETPID 1
#define HAVE_ICONV 1
#define HAVE_ICONV_H 1
#define HAVE_INTTYPES_H 1
#define HAVE_LIBGEN_H 1
#define HAVE_LOCALE_H 1
#define HAVE_MEMORY_H 1
#define HAVE_NL_TYPES_H 1
#define HAVE_SETLOCALE 1
#define HAVE_SIGACTION 1
#define HAVE_SIGNAL_H 1
#define HAVE_SNPRINTF 1
#define HAVE_SSTREAM 1
#define HAVE_STDARG_H 1
#define HAVE_STDINT_H 1
#define HAVE_STDIO_H 1
#define HAVE_STDLIB_H 1
#define HAVE_STRCASESTR 1
#define HAVE_STRFTIME 1
#define HAVE_STRINGS_H 1
#define HAVE_STRING_H 1
#define HAVE_SYS_PARAM_H 1
#define HAVE_SYS_SELECT_H 1
#define HAVE_SYS_SIGNAL_H 1
#define HAVE_SYS_STAT_H 1
#define HAVE_SYS_STAT_H 1
#define HAVE_SYS_TIME_H 1
#define HAVE_SYS_TYPES_H 1
#define HAVE_SYS_TYPES_H 1
#define HAVE_SYS_WAIT_H 1
#define HAVE_TIME_H 1
#define HAVE_UNISTD_H 1
#define HAVE_UNISTD_H 1
#define HAVE_VSNPRINTF 1
#define PACKAGE_BUGREPORT ""
#define PACKAGE_NAME ""
#define PACKAGE_STRING ""
#define PACKAGE_TARNAME ""
#define PACKAGE_VERSION ""
#define STDC_HEADERS 1
#define STDC_HEADERS 1
#define TIME_WITH_SYS_TIME 1
#endif
#ifdef __cplusplus
extern "C" void std::exit (int) throw (); using std::exit;

configure: exit 1