ej@ENET-5:~/Unreal3.2$ make custommodule MODULEFILE=commandsno
cd src; make 'CFLAGS=-I../include -I/home/ej/Unreal3.2/extras/regexp/include -I/home/ej/Unreal3.2/extras/c-ares/include -L../extras/c-ares/lib -pipe -g -O2 -funsigned-char -fno-strict-aliasing -DZIP_LINKS -export-dynamic ' 'CC=gcc' 'IRCDLIBS=-lcrypt -lnsl -lz -ldl -L/home/ej/Unreal3.2/extras/regexp/lib -ltre -lcares' 'LDFLAGS=' 'IRCDMODE=711' 'RES=' 'BINDIR=/home/ej/Unreal3.2/src/ircd' 'INSTALL=/usr/bin/install' 'INCLUDEDIR=../include' 'IRCDDIR=/home/ej/Unreal3.2' 'RM=/usr/bin/rm' 'CP=/usr/bin/cp' 'TOUCH=/usr/bin/touch' 'SHELL=/bin/sh' 'STRTOUL=' 'CRYPTOLIB=-lssl -lcrypto' 'CRYPTOINCLUDES=' 'URL=' MODULEFILE=commandsno 'EXLIBS=' custommodule
make[1]: Entering directory `/home/ej/Unreal3.2/src'
cd modules; make 'CFLAGS=-I../include -I/home/ej/Unreal3.2/extras/regexp/include -I/home/ej/Unreal3.2/extras/c-ares/include -L../extras/c-ares/lib -pipe -g -O2 -funsigned-char -fno-strict-aliasing -DZIP_LINKS -export-dynamic ' 'CC=gcc' 'IRCDLIBS=-lcrypt -lnsl -lz -ldl -L/home/ej/Unreal3.2/extras/regexp/lib -ltre -lcares' 'LDFLAGS=' 'IRCDMODE=711' 'BINDIR=/home/ej/Unreal3.2/src/ircd' 'INSTALL=/usr/bin/install' 'INCLUDEDIR=../include' 'IRCDDIR=/home/ej/Unreal3.2' 'MANDIR=' 'RM=/usr/bin/rm' 'CP=/usr/bin/cp' 'TOUCH=/usr/bin/touch' 'RES=' 'SHELL=/bin/sh' 'STRTOUL=' 'CRYPTOLIB=-lssl -lcrypto' 'CRYPTOINCLUDES=' 'URL=' MODULEFILE=commandsno 'EXLIBS=' custommodule
make[2]: Entering directory `/home/ej/Unreal3.2/src/modules'
gcc -I../include -I/home/ej/Unreal3.2/extras/regexp/include -I/home/ej/Unreal3.2/extras/c-ares/include -L../extras/c-ares/lib -pipe -g -O2 -funsigned-char -fno-strict-aliasing -DZIP_LINKS -export-dynamic -fPIC -DPIC -shared -DDYNAMIC_LINKING \
-o commandsno.so commandsno.c
commandsno.c:11:20: config.h: No such file or directory
commandsno.c:12:20: struct.h: No such file or directory
commandsno.c:13:20: common.h: No such file or directory
commandsno.c:14:17: sys.h: No such file or directory
commandsno.c:15:21: numeric.h: No such file or directory
commandsno.c:16:17: msg.h: No such file or directory
commandsno.c:17:21: channel.h: No such file or directory
commandsno.c:27:15: h.h: No such file or directory
commandsno.c:40: error: syntax error before "Cmdoverride"
commandsno.c:40: warning: no semicolon at end of struct or union
commandsno.c:42: error: syntax error before '}' token
commandsno.c:44: error: syntax error before '*' token
commandsno.c:53: error: syntax error before '*' token
commandsno.c:53: error: syntax error before "iFP"
commandsno.c:53: warning: data definition has no type or storage class
commandsno.c:54: error: syntax error before '*' token
commandsno.c:54: error: syntax error before '*' token
commandsno.c:54: warning: data definition has no type or storage class
commandsno.c:55: error: syntax error before '*' token
commandsno.c:56: error: syntax error before '*' token
commandsno.c:57: error: syntax error before '*' token
commandsno.c:58: error: syntax error before '*' token
commandsno.c:64: error: syntax error before '*' token
commandsno.c:64: warning: data definition has no type or storage class
commandsno.c:65: error: syntax error before '*' token
commandsno.c:65: warning: data definition has no type or storage class
commandsno.c:66: error: syntax error before '*' token
commandsno.c:66: warning: data definition has no type or storage class
commandsno.c:67: error: syntax error before '*' token
commandsno.c:67: warning: data definition has no type or storage class
commandsno.c:68: error: syntax error before '*' token
commandsno.c:68: warning: data definition has no type or storage class
commandsno.c:70: error: `BUFSIZE' undeclared here (not in a function)
commandsno.c:75: error: syntax error before '*' token
commandsno.c:75: warning: data definition has no type or storage class
commandsno.c:83: error: syntax error before "MOD_HEADER"
commandsno.c:84: warning: parameter names (without types) in function declaration
commandsno.c:84: error: function `MOD_HEADER' is initialized like a variable
commandsno.c:85: error: invalid initializer
commandsno.c:85: error: (near initialization for `MOD_HEADER')
commandsno.c:86: warning: excess elements in scalar initializer
commandsno.c:86: warning: (near initialization for `MOD_HEADER')
commandsno.c:87: warning: excess elements in scalar initializer
commandsno.c:87: warning: (near initialization for `MOD_HEADER')
commandsno.c:88: warning: excess elements in scalar initializer
commandsno.c:88: warning: (near initialization for `MOD_HEADER')
commandsno.c:90: warning: excess elements in scalar initializer
commandsno.c:90: warning: (near initialization for `MOD_HEADER')
commandsno.c:90: warning: data definition has no type or storage class
commandsno.c:92: error: syntax error before "int"
commandsno.c:92: error: syntax error before '*' token
commandsno.c:93: error: `MOD_TEST' declared as function returning a function
commandsno.c: In function `MOD_TEST':
commandsno.c:94: error: `modinfo' undeclared (first use in this function)
commandsno.c:94: error: (Each undeclared identifier is reported only once
commandsno.c:94: error: for each function it appears in.)
commandsno.c:94: error: `HOOKTYPE_CONFIGTEST' undeclared (first use in this function)
commandsno.c:94: warning: assignment makes pointer from integer without a cast
commandsno.c:95: error: `MOD_SUCCESS' undeclared (first use in this function)
commandsno.c: At top level:
commandsno.c:98: error: syntax error before "int"
commandsno.c:98: error: syntax error before '*' token
commandsno.c:99: error: `MOD_INIT' declared as function returning a function
commandsno.c: In function `MOD_INIT':
commandsno.c:100: error: `modinfo' undeclared (first use in this function)
commandsno.c:102: error: `MOD_OPT_PERM' undeclared (first use in this function)
commandsno.c:107: error: `HOOKTYPE_CONFIGRUN' undeclared (first use in this function)
commandsno.c:107: warning: assignment makes pointer from integer without a cast
commandsno.c:108: error: `HOOKTYPE_REHASH' undeclared (first use in this function)
commandsno.c:108: warning: assignment makes pointer from integer without a cast
commandsno.c:109: error: `HOOKTYPE_STATS' undeclared (first use in this function)
commandsno.c:109: warning: assignment makes pointer from integer without a cast
commandsno.c:110: error: `HOOKTYPE_REHASH_COMPLETE' undeclared (first use in this function)
commandsno.c:110: warning: assignment makes pointer from integer without a cast
commandsno.c:111: error: `umode_allow_opers' undeclared (first use in this function)
commandsno.c:114: error: `MOD_FAILED' undeclared (first use in this function)
commandsno.c:116: error: `MOD_SUCCESS' undeclared (first use in this function)
commandsno.c: At top level:
commandsno.c:119: error: syntax error before "int"
commandsno.c:120: error: `MOD_LOAD' declared as function returning a function
commandsno.c: In function `MOD_LOAD':
commandsno.c:122: error: `MOD_SUCCESS' undeclared (first use in this function)
commandsno.c: At top level:
commandsno.c:125: error: syntax error before "int"
commandsno.c:126: error: `MOD_UNLOAD' declared as function returning a function
commandsno.c: In function `MOD_UNLOAD':
commandsno.c:135: error: `MOD_SUCCESS' undeclared (first use in this function)
commandsno.c: In function `FreeConf':
commandsno.c:146: error: `ListStruct' undeclared (first use in this function)
commandsno.c:146: error: `next' undeclared (first use in this function)
commandsno.c:150: error: syntax error before ')' token
commandsno.c:152: error: dereferencing pointer to incomplete type
commandsno.c:152: error: dereferencing pointer to incomplete type
commandsno.c:152: error: dereferencing pointer to incomplete type
commandsno.c:152: error: dereferencing pointer to incomplete type
commandsno.c:153: error: dereferencing pointer to incomplete type
commandsno.c: In function `cb_rehash_complete':
commandsno.c:178: error: `Cmdoverride' undeclared (first use in this function)
commandsno.c:178: error: `ovr' undeclared (first use in this function)
commandsno.c:182: warning: assignment makes pointer from integer without a cast
commandsno.c:183: warning: assignment makes pointer from integer without a cast
commandsno.c:188: error: invalid application of `sizeof' to an incomplete type
commandsno.c:189: error: dereferencing pointer to incomplete type
commandsno.c:190: error: dereferencing pointer to incomplete type
commandsno.c: At top level:
commandsno.c:200: error: syntax error before '*' token
commandsno.c: In function `cb_config_test':
commandsno.c:204: error: `type' undeclared (first use in this function)
commandsno.c:204: error: `CONFIG_SET' undeclared (first use in this function)
commandsno.c:207: error: `ce' undeclared (first use in this function)
commandsno.c:217: error: `errs' undeclared (first use in this function)
commandsno.c: At top level:
commandsno.c:224: error: syntax error before '*' token
commandsno.c: In function `cb_config_run':
commandsno.c:226: error: `type' undeclared (first use in this function)
commandsno.c:226: error: `CONFIG_SET' undeclared (first use in this function)
commandsno.c:229: error: `ce' undeclared (first use in this function)
commandsno.c: At top level:
commandsno.c:240: error: syntax error before '*' token
commandsno.c: In function `cb_stats':
commandsno.c:242: error: `stats' undeclared (first use in this function)
commandsno.c:244: error: `sptr' undeclared (first use in this function)
commandsno.c:245: error: `me' undeclared (first use in this function)
commandsno.c:245: error: `RPL_TEXT' undeclared (first use in this function)
commandsno.c: At top level:
commandsno.c:251: error: syntax error before '*' token
commandsno.c:251: error: syntax error before "iFP"
commandsno.c: In function `AddOverride':
commandsno.c:253: error: `Cmdoverride' undeclared (first use in this function)
commandsno.c:253: error: `ovr' undeclared (first use in this function)
commandsno.c:253: error: request for member `handle' in something not a structure or union
commandsno.c:253: error: `msg' undeclared (first use in this function)
commandsno.c:253: error: `cb' undeclared (first use in this function)
commandsno.c:256: error: request for member `handle' in something not a structure or union
commandsno.c:256: error: `MODERR_NOERROR' undeclared (first use in this function)
commandsno.c:263: error: `commandsno' undeclared (first use in this function)
commandsno.c:263: error: request for member `name' in something not a structure or union
commandsno.c:263: error: request for member `handle' in something not a structure or union
commandsno.c: At top level:
commandsno.c:274: error: syntax error before '*' token
commandsno.c:274: error: syntax error before '*' token
commandsno.c: In function `AddSnomask':
commandsno.c:276: error: `Snomask' undeclared (first use in this function)
commandsno.c:276: error: `s' undeclared (first use in this function)
commandsno.c:278: error: `mode' undeclared (first use in this function)
commandsno.c:279: error: `module' undeclared (first use in this function)
commandsno.c:279: error: `flag' undeclared (first use in this function)
commandsno.c:279: error: `allowed' undeclared (first use in this function)
commandsno.c:282: error: `MODERR_NOERROR' undeclared (first use in this function)
commandsno.c: At top level:
commandsno.c:300: error: syntax error before '*' token
commandsno.c: In function `override_cmd':
commandsno.c:302: error: `sptr' undeclared (first use in this function)
commandsno.c:308: error: `parc' undeclared (first use in this function)
commandsno.c:312: error: `parv' undeclared (first use in this function)
commandsno.c:321: error: `ovr' undeclared (first use in this function)
commandsno.c:324: error: `cptr' undeclared (first use in this function)
commandsno.c: At top level:
commandsno.c:70: error: storage size of `mybuf' isn't known
make[2]: *** [custommodule] Error 1
make[2]: Leaving directory `/home/ej/Unreal3.2/src/modules'
make[1]: *** [custommodule] Error 2
make[1]: Leaving directory `/home/ej/Unreal3.2/src'
make: *** [custommodule] Error 2
ej@ENET-5:~/Unreal3.2$