All pastes #86615 Raw Edit

drbombay43

public text v1 · immutable
·published 2006-07-13 01:55 UTC
rendered paste body
make[2]: Entering directory `/var/tmp/portage/libdv-0.104-r1/work/libdv-0.104/playdv'
if i686-pc-linux-gnu-gcc -DHAVE_CONFIG_H -I. -I. -I..    -I/usr/include/SDL -D_GNU_SOURCE=1 -D_REENTRANT  -O2 -march=pentium4 -pipe -fomit-frame-pointer -ftracer -Wall -MT playdv.o -MD -MP -MF ".deps/playdv.Tpo" -c -o playdv.o playdv.c; \
        then mv -f ".deps/playdv.Tpo" ".deps/playdv.Po"; else rm -f ".deps/playdv.Tpo"; exit 1; fi
In file included from playdv.c:44:
display.h:35:21: error: gtk/gtk.h: No such file or directory
In file included from playdv.c:44:
display.h:79: error: expected specifier-qualifier-list before 'gint'
display.h:137: error: expected '=', ',', ';', 'asm' or '__attribute__' before 'dv_display_init'
playdv.c:76: error: expected specifier-qualifier-list before 'guint8'
playdv.c:86: error: expected specifier-qualifier-list before 'gint'
playdv.c: In function 'dv_player_new':
playdv.c:106: error: 'dv_player_t' has no member named 'arg_loop_count'
playdv.c:109: error: 'dv_player_t' has no member named 'option_table'
playdv.c:116: error: 'dv_player_t' has no member named 'option_table'
playdv.c:118: error: 'dv_player_t' has no member named 'arg_disable_audio'
playdv.c:122: error: 'dv_player_t' has no member named 'option_table'
playdv.c:125: error: 'dv_player_t' has no member named 'arg_disable_video'
playdv.c:128: error: 'dv_player_t' has no member named 'option_table'
playdv.c:132: error: 'dv_player_t' has no member named 'arg_num_frames'
playdv.c:137: error: 'dv_player_t' has no member named 'option_table'
playdv.c:140: error: 'dv_player_t' has no member named 'arg_dump_frames'
playdv.c:146: error: 'dv_player_t' has no member named 'option_table'
playdv.c:148: error: 'dv_player_t' has no member named 'no_mmap'
playdv.c:152: error: 'dv_player_t' has no member named 'option_table'
playdv.c:156: error: 'dv_player_t' has no member named 'arg_loop_count'
playdv.c:161: error: 'dv_player_t' has no member named 'option_table'
playdv.c:167: error: 'dv_player_t' has no member named 'option_table'
playdv.c:169: error: 'dv_display_t' has no member named 'option_table'
playdv.c:173: error: 'dv_player_t' has no member named 'option_table'
playdv.c:179: error: 'dv_player_t' has no member named 'option_table'
playdv.c: In function 'mmap_unaligned':
playdv.c:268: error: 'dv_mmap_region_t' has no member named 'data_start'
playdv.c:279: error: 'dv_mmap_region_t' has no member named 'data_start'
playdv.c: In function 'main':
playdv.c:299: error: 'guint' undeclared (first use in this function)
playdv.c:299: error: (Each undeclared identifier is reported only once
playdv.c:299: error: for each function it appears in.)
playdv.c:299: error: expected ';' before 'frame_count'
playdv.c:300: error: 'gint' undeclared (first use in this function)
playdv.c:300: error: expected ';' before 'i'
playdv.c:301: error: 'gdouble' undeclared (first use in this function)
playdv.c:301: error: expected ';' before 'seconds'
playdv.c:302: error: 'gint16' undeclared (first use in this function)
playdv.c:302: error: 'audio_buffers' undeclared (first use in this function)
playdv.c:312: error: 'dv_player_t' has no member named 'option_table'
playdv.c:338: error: 'dv_player_t' has no member named 'no_mmap'
playdv.c:344: error: 'dv_player_t' has no member named 'no_mmap'
playdv.c:352: error: 'dv_player_t' has no member named 'no_mmap'
playdv.c:355: error: 'dv_mmap_region_t' has no member named 'data_start'
playdv.c:370: error: 'dv_player_t' has no member named 'no_mmap'
playdv.c:374: error: 'dv_player_t' has no member named 'arg_disable_video'
playdv.c:375: warning: implicit declaration of function 'dv_display_init'
playdv.c:380: error: 'dv_player_t' has no member named 'arg_disable_audio'
playdv.c:381: error: 'dv_player_t' has no member named 'arg_disable_audio'
playdv.c:383: error: 'i' undeclared (first use in this function)
playdv.c:393: error: 'dv_player_t' has no member named 'no_mmap'
playdv.c:399: error: 'dv_player_t' has no member named 'no_mmap'
playdv.c:404: error: 'dv_mmap_region_t' has no member named 'data_start'
playdv.c:408: error: 'dv_player_t' has no member named 'no_mmap'
playdv.c:409: error: 'dv_player_t' has no member named 'no_mmap'
playdv.c:418: error: 'dv_mmap_region_t' has no member named 'data_start'
playdv.c:427: error: 'dv_player_t' has no member named 'arg_disable_audio'
playdv.c:428: error: 'dv_mmap_region_t' has no member named 'data_start'
playdv.c:433: error: 'dv_player_t' has no member named 'arg_disable_video'
playdv.c:445: error: 'dv_mmap_region_t' has no member named 'data_start'
playdv.c:448: error: 'dv_mmap_region_t' has no member named 'data_start'
playdv.c:450: error: 'dv_display_t' has no member named 'pixels'
playdv.c:451: error: 'dv_display_t' has no member named 'pitches'
playdv.c:460: error: 'dv_player_t' has no member named 'arg_dump_frames'
playdv.c:464: error: 'dv_player_t' has no member named 'arg_dump_frames'
playdv.c:464: error: 'dv_player_t' has no member named 'arg_dump_frames'
playdv.c:464: error: 'dv_player_t' has no member named 'arg_dump_frames'
playdv.c:464: error: 'dv_player_t' has no member named 'arg_dump_frames'
playdv.c:464: error: 'dv_player_t' has no member named 'arg_dump_frames'
playdv.c:464: error: 'dv_player_t' has no member named 'arg_dump_frames'
playdv.c:464: error: 'dv_player_t' has no member named 'arg_dump_frames'
playdv.c:464: error: 'dv_player_t' has no member named 'arg_dump_frames'
playdv.c:464: error: 'dv_player_t' has no member named 'arg_dump_frames'
playdv.c:464: error: 'dv_player_t' has no member named 'arg_dump_frames'
playdv.c:464: error: 'dv_player_t' has no member named 'arg_dump_frames'
playdv.c:464: error: 'dv_player_t' has no member named 'arg_dump_frames'
playdv.c:464: error: 'dv_player_t' has no member named 'arg_dump_frames'
playdv.c:464: error: 'dv_player_t' has no member named 'arg_dump_frames'
playdv.c:464: error: 'dv_player_t' has no member named 'arg_dump_frames'
playdv.c:464: error: 'dv_player_t' has no member named 'arg_dump_frames'
playdv.c:464: error: 'dv_player_t' has no member named 'arg_dump_frames'
playdv.c:464: error: 'dv_player_t' has no member named 'arg_dump_frames'
playdv.c:464: error: 'dv_player_t' has no member named 'arg_dump_frames'
playdv.c:464: error: 'dv_player_t' has no member named 'arg_dump_frames'
playdv.c:467: error: 'dv_player_t' has no member named 'arg_dump_frames'
playdv.c:468: error: 'frame_count' undeclared (first use in this function)
playdv.c:472: error: 'dv_display_t' has no member named 'width'
playdv.c:472: error: 'dv_display_t' has no member named 'height'
playdv.c:473: error: 'dv_display_t' has no member named 'pixels'
playdv.c:474: error: 'dv_display_t' has no member named 'width'
playdv.c:475: error: 'dv_display_t' has no member named 'height'
playdv.c:485: error: 'dv_player_t' has no member named 'arg_num_frames'
playdv.c:485: error: 'dv_player_t' has no member named 'arg_num_frames'
playdv.c:493: error: 'dv_player_t' has no member named 'no_mmap'
playdv.c:500: error: 'dv_player_t' has no member named 'arg_loop_count'
playdv.c:507: error: 'seconds' undeclared (first use in this function)
playdv.c:511: error: 'dv_player_t' has no member named 'arg_disable_video'
playdv.c:514: error: 'dv_player_t' has no member named 'arg_disable_audio'
make[2]: *** [playdv.o] Error 1
make[2]: Leaving directory `/var/tmp/portage/libdv-0.104-r1/work/libdv-0.104/playdv'
make[1]: *** [all-recursive] Error 1
make[1]: Leaving directory `/var/tmp/portage/libdv-0.104-r1/work/libdv-0.104'
make: *** [all] Error 2

!!! ERROR: media-libs/libdv-0.104-r1 failed.
Call stack:
  ebuild.sh, line 1545:   Called dyn_compile
  ebuild.sh, line 940:   Called src_compile
  libdv-0.104-r1.ebuild, line 51:   Called die

!!! compile problem
!!! If you need support, post the topmost build error, and the call stack if relevant