All pastes #86606 Raw Edit

Unnamed

public shellscript v1 · immutable
·published 2006-07-13 01:46 UTC
rendered paste body
root@h4xb0x:/zaurus# bitbake opie-imageNOTE: Psyco JIT Compiler (http://psyco.sf.net) not available. Install it to increase performance.NOTE: Using cache in '/zaurus/tmp/cache'NOTE: Parsing finished. 0 cached, 2646 parsed, 35 skipped, 0 masked.NOTE: build 200607122142: startedOE Build Configuration:BB_VERSION     = "1.4.2"OE_REVISION    = "3b51d2230a4818f989fbfc40792868d79feba93d"TARGET_ARCH    = "arm"TARGET_OS      = "linux"MACHINE        = "akita"DISTRO         = "openzaurus"DISTRO_VERSION = "3.5.4.1"TARGET_FPU     = "soft"NOTE: package qemu-native-0.7.0: startedNOTE: package qemu-native-0.7.0-r1: task do_fetch: startedNOTE: package qemu-native-0.7.0-r1: task do_fetch: completedNOTE: package qemu-native-0.7.0-r1: task do_compile: startedERROR: function do_compile failedERROR: log data follows (/zaurus/tmp/work/qemu-native-0.7.0-r1/temp/log.do_compile.24928)| NOTE: make| for d in i386-user arm-user armeb-user sparc-user ppc-user i386-softmmu ppc-softmmu sparc-softmmu x86_64-softmmu; do \|       make -C $d all || exit 1 ; \|         done| make[1]: Entering directory `/zaurus/tmp/work/qemu-native-0.7.0-r1/qemu-0.7.0/i386-user'| gcc -Wall -O2 -g -fno-strict-aliasing -fomit-frame-pointer -mpreferred-stack-boundary=2 -falign-functions=0 -fno-gcse -fno-reorder-blocks -fno-optimize-sibling-calls -I. -I/zaurus/tmp/work/qemu-native-0.7.0-r1/qemu-0.7.0/target-i386 -I/zaurus/tmp/work/qemu-native-0.7.0-r1/qemu-0.7.0 -I/zaurus/tmp/work/qemu-native-0.7.0-r1/qemu-0.7.0/linux-user -I/zaurus/tmp/work/qemu-native-0.7.0-r1/qemu-0.7.0/linux-user/i386 -D_GNU_SOURCE -D_FILE_OFFSET_BITS=64 -D_LARGEFILE_SOURCE -I/zaurus/tmp/work/qemu-native-0.7.0-r1/qemu-0.7.0/fpu -I/zaurus/tmp/work/qemu-native-0.7.0-r1/qemu-0.7.0/slirp -c -o op.o /zaurus/tmp/work/qemu-native-0.7.0-r1/qemu-0.7.0/target-i386/op.c| /zaurus/tmp/work/qemu-native-0.7.0-r1/qemu-0.7.0/target-i386/ops_sse.h: In function ‘op_pshufw_mmx’:| /zaurus/tmp/work/qemu-native-0.7.0-r1/qemu-0.7.0/target-i386/ops_sse.h:574: error: unable to find a register to spill in class ‘GENERAL_REGS’| /zaurus/tmp/work/qemu-native-0.7.0-r1/qemu-0.7.0/target-i386/ops_sse.h:574: error: this is the insn:| (insn:HI 18 17 19 0 /zaurus/tmp/work/qemu-native-0.7.0-r1/qemu-0.7.0/target-i386/ops_sse.h:569 (set (strict_low_part (subreg:HI (reg/v:DI 63 [ r ]) 0))|         (mem/s/j:HI (plus:SI (mult:SI (reg:SI 64)|                     (const_int 2 [0x2]))|                 (reg/v/f:SI 59 [ s ])) [0 <variable>._w S2 A16])) 52 {*movstricthi_1} (insn_list:REG_DEP_TRUE 16 (insn_list:REG_DEP_TRUE 12 (insn_list:REG_DEP_TRUE 53 (nil))))|     (expr_list:REG_DEAD (reg:SI 64)|         (nil)))| /zaurus/tmp/work/qemu-native-0.7.0-r1/qemu-0.7.0/target-i386/ops_sse.h:574: confused by earlier errors, bailing out| make[1]: *** [op.o] Error 1| make[1]: Leaving directory `/zaurus/tmp/work/qemu-native-0.7.0-r1/qemu-0.7.0/i386-user'| make: *** [all] Error 1| FATAL: oe_runmake failedNOTE: Task failed: /zaurus/tmp/work/qemu-native-0.7.0-r1/temp/log.do_compile.24928NOTE: package qemu-native-0.7.0-r1: task do_compile: failedERROR: TaskFailed event exception, abortingNOTE: package qemu-native-0.7.0: failedERROR: Build of opie-image failed