NOTE: package qemu-native-0.7.0-r1: task do_fetch: completed
NOTE: package qemu-native-0.7.0-r1: task do_unpack: started
NOTE: Unpacking /zaurus/sources/qemu-0.7.0.tar.gz to /zaurus/tmp/work/qemu-nativ e-0.7.0-r1/
NOTE: package qemu-native-0.7.0-r1: task do_unpack: completed
NOTE: package qemu-native-0.7.0-r1: task do_patch: started
NOTE: package qemu-native-0.7.0-r1: task do_patch: completed
NOTE: package qemu-native-0.7.0-r1: task do_configure: started
NOTE: package qemu-native-0.7.0-r1: task do_configure: completed
NOTE: package qemu-native-0.7.0-r1: task do_compile: started
ERROR: function do_compile failed
ERROR: log data follows (/zaurus/tmp/work/qemu-native-0.7.0-r1/temp/log.do_compi le.5223)
| NOTE: make
| gcc -Wall -O2 -g -fno-strict-aliasing -D_GNU_SOURCE -D_FILE_OFFSET_BITS=64 -D _LARGEFILE_SOURCE -o dyngen dyngen.c
| dyngen.c: In function load_object:
| dyngen.c:508: warning: pointer targets in assignment differ in signedness
| dyngen.c:544: warning: pointer targets in assignment differ in signedness
| gcc -DQEMU_TOOL -Wall -O2 -g -fno-strict-aliasing -g -D_GNU_SOURCE -D_FILE_OF FSET_BITS=64 -D_LARGEFILE_SOURCE -o qemu-img qemu-img.c block.c block-cow.c bloc k-qcow.c aes.c block-vmdk.c block-cloop.c block-dmg.c block-bochs.c block-vpc.c -lz
| block-qcow.c:26:18: error: zlib.h: No such file or directory
| block-qcow.c: In function decompress_buffer:
| block-qcow.c:407: error: z_stream undeclared (first use in this function)
| block-qcow.c:407: error: (Each undeclared identifier is reported only once
| block-qcow.c:407: error: for each function it appears in.)
| block-qcow.c:407: error: syntax error before strm1
| block-qcow.c:410: error: strm undeclared (first use in this function)
| block-qcow.c:417: warning: implicit declaration of function inflateInit2
| block-qcow.c:418: error: Z_OK undeclared (first use in this function)
| block-qcow.c:420: warning: implicit declaration of function inflate
| block-qcow.c:420: error: Z_FINISH undeclared (first use in this function)
| block-qcow.c:422: error: Z_STREAM_END undeclared (first use in this function )
| block-qcow.c:422: error: Z_BUF_ERROR undeclared (first use in this function)
| block-qcow.c:424: warning: implicit declaration of function inflateEnd
| block-qcow.c: In function qcow_compress_cluster:
| block-qcow.c:609: error: z_stream undeclared (first use in this function)
| block-qcow.c:609: error: syntax error before strm
| block-qcow.c:622: error: strm undeclared (first use in this function)
| block-qcow.c:623: warning: implicit declaration of function deflateInit2
| block-qcow.c:623: error: Z_DEFAULT_COMPRESSION undeclared (first use in this function)
| block-qcow.c:624: error: Z_DEFLATED undeclared (first use in this function)
| block-qcow.c:625: error: Z_DEFAULT_STRATEGY undeclared (first use in this fu nction)
| block-qcow.c:636: warning: implicit declaration of function deflate
| block-qcow.c:636: error: Z_FINISH undeclared (first use in this function)
| block-qcow.c:637: error: Z_STREAM_END undeclared (first use in this function )
| block-qcow.c:637: error: Z_OK undeclared (first use in this function)
| block-qcow.c:639: warning: implicit declaration of function deflateEnd
| block-cloop.c:26:18: error: zlib.h: No such file or directory
| block-cloop.c:37: error: syntax error before z_stream
| block-cloop.c:37: warning: no semicolon at end of struct or union
| block-cloop.c:38: warning: type defaults to int in declaration of BDRVCloop State
| block-cloop.c:38: warning: data definition has no type or storage class
| block-cloop.c: In function cloop_open:
| block-cloop.c:55: error: s undeclared (first use in this function)
| block-cloop.c:55: error: (Each undeclared identifier is reported only once
| block-cloop.c:55: error: for each function it appears in.)
| block-cloop.c:96: warning: implicit declaration of function inflateInit
| block-cloop.c:96: error: Z_OK undeclared (first use in this function)
| block-cloop.c: At top level:
| block-cloop.c:105: error: syntax error before * token
| block-cloop.c: In function cloop_read_block:
| block-cloop.c:107: error: s undeclared (first use in this function)
| block-cloop.c:107: error: block_num undeclared (first use in this function)
| block-cloop.c:120: warning: implicit declaration of function inflateReset
| block-cloop.c:121: error: Z_OK undeclared (first use in this function)
| block-cloop.c:123: warning: implicit declaration of function inflate
| block-cloop.c:123: error: Z_FINISH undeclared (first use in this function)
| block-cloop.c:124: error: Z_STREAM_END undeclared (first use in this functio n)
| block-cloop.c: In function cloop_read:
| block-cloop.c:135: error: s undeclared (first use in this function)
| block-cloop.c: In function cloop_close:
| block-cloop.c:150: error: s undeclared (first use in this function)
| block-cloop.c:156: warning: implicit declaration of function inflateEnd
| block-dmg.c:27:18: error: zlib.h: No such file or directory
| block-dmg.c:49: error: syntax error before z_stream
| block-dmg.c:49: warning: no semicolon at end of struct or union
| block-dmg.c:50: warning: type defaults to int in declaration of BDRVDMGStat e
| block-dmg.c:50: warning: data definition has no type or storage class
| block-dmg.c: In function dmg_open:
| block-dmg.c:78: error: s undeclared (first use in this function)
| block-dmg.c:78: error: (Each undeclared identifier is reported only once
| block-dmg.c:78: error: for each function it appears in.)
| block-dmg.c:164: warning: implicit declaration of function inflateInit
| block-dmg.c:164: error: Z_OK undeclared (first use in this function)
| block-dmg.c: At top level:
| block-dmg.c:172: error: syntax error before * token
| block-dmg.c: In function is_sector_in_chunk:
| block-dmg.c:175: error: chunk_num undeclared (first use in this function)
| block-dmg.c:175: error: s undeclared (first use in this function)
| block-dmg.c:175: error: sector_num undeclared (first use in this function)
| block-dmg.c: At top level:
| block-dmg.c:182: error: syntax error before * token
| block-dmg.c: In function search_chunk:
| block-dmg.c:185: error: s undeclared (first use in this function)
| block-dmg.c:188: error: sector_num undeclared (first use in this function)
| block-dmg.c: At top level:
| block-dmg.c:198: error: syntax error before * token
| block-dmg.c: In function dmg_read_chunk:
| block-dmg.c:200: error: s undeclared (first use in this function)
| block-dmg.c:200: error: sector_num undeclared (first use in this function)
| block-dmg.c:233: warning: implicit declaration of function inflateReset
| block-dmg.c:234: error: Z_OK undeclared (first use in this function)
| block-dmg.c:236: warning: implicit declaration of function inflate
| block-dmg.c:236: error: Z_FINISH undeclared (first use in this function)
| block-dmg.c:237: error: Z_STREAM_END undeclared (first use in this function)
| block-dmg.c: In function dmg_read:
| block-dmg.c:257: error: s undeclared (first use in this function)
| block-dmg.c: In function dmg_close:
| block-dmg.c:272: error: s undeclared (first use in this function)
| block-dmg.c:283: warning: implicit declaration of function inflateEnd
| block-vpc.c: In function vpc_probe:
| block-vpc.c:84: warning: pointer targets in passing argument 1 of strlen dif fer in signedness
| block-vpc.c:84: warning: pointer targets in passing argument 1 of strlen dif fer in signedness
| block-vpc.c:84: warning: pointer targets in passing argument 1 of __builtin_s trcmp differ in signedness
| block-vpc.c:84: warning: pointer targets in passing argument 1 of strlen dif fer in signedness
| block-vpc.c:84: warning: pointer targets in passing argument 1 of __builtin_s trcmp differ in signedness
| block-vpc.c:84: warning: pointer targets in passing argument 1 of __builtin_s trcmp differ in signedness
| block-vpc.c:84: warning: pointer targets in passing argument 1 of __builtin_s trcmp differ in signedness
| block-vpc.c:84: warning: pointer targets in passing argument 1 of strncmp di ffer in signedness
| make: *** [qemu-img] Error 1
| FATAL: oe_runmake failed
NOTE: Task failed: /zaurus/tmp/work/qemu-native-0.7.0-r1/temp/log.do_compile.522 3
NOTE: package qemu-native-0.7.0-r1: task do_compile: failed
ERROR: TaskFailed event exception, aborting
NOTE: package qemu-native-0.7.0: failed
ERROR: Build of opie-image failed